[package - main-arm64-default][math/reduce] Failed for reduce-20210413 in build

From: <pkg-fallout_at_FreeBSD.org>
Date: Tue, 27 Jul 2021 13:43:02 GMT
You are receiving this mail as a port that you maintain
is failing to build on the FreeBSD package build server.
Please investigate the failure and submit a PR to fix
build.

Maintainer:     pfg_at_FreeBSD.org
Log URL:        http://ampere2.nyi.freebsd.org/data/main-arm64-default/pe8cfea34d340_s47aeda7b70/logs/reduce-20210413.log
Build URL:      http://ampere2.nyi.freebsd.org/build.html?mastername=main-arm64-default&build=pe8cfea34d340_s47aeda7b70
Log:

=>> Building math/reduce
build started at Tue Jul 27 13:05:29 UTC 2021
port directory: /usr/ports/math/reduce
package name: reduce-20210413
building for: FreeBSD main-arm64-default-job-14 14.0-CURRENT FreeBSD 14.0-CURRENT 1400026 arm64
maintained by: pfg_at_FreeBSD.org
Makefile ident: 
Poudriere version: 3.2.8-8-gaf08dbda
Host OSVERSION: 1400008
Jail OSVERSION: 1400026
Job Id: 14




!!! Jail is newer than host. (Jail: 1400026, Host: 1400008) !!!
!!! This is not supported. !!!
!!! Host kernel must be same or newer than jail. !!!
!!! Expect build failures. !!!



---Begin Environment---
SHELL=/bin/csh
OSVERSION=1400026
UNAME_v=FreeBSD 14.0-CURRENT 1400026
UNAME_r=14.0-CURRENT
BLOCKSIZE=K
MAIL=/var/mail/root
MM_CHARSET=UTF-8
LANG=C.UTF-8
STATUS=1
HOME=/root
PATH=/sbin:/bin:/usr/sbin:/usr/bin:/usr/local/sbin:/usr/local/bin:/root/bin
LOCALBASE=/usr/local
USER=root
LIBEXECPREFIX=/usr/local/libexec/poudriere
POUDRIERE_VERSION=3.2.8-8-gaf08dbda
MASTERMNT=/usr/local/poudriere/data/.m/main-arm64-default/ref
POUDRIERE_BUILD_TYPE=bulk
PACKAGE_BUILDING=yes
SAVED_TERM=
PWD=/usr/local/poudriere/data/.m/main-arm64-default/ref/.p/pool
P_PORTS_FEATURES=FLAVORS SELECTED_OPTIONS
MASTERNAME=main-arm64-default
SCRIPTPREFIX=/usr/local/share/poudriere
OLDPWD=/usr/local/poudriere/data/.m/main-arm64-default/ref/.p
SCRIPTPATH=/usr/local/share/poudriere/bulk.sh
POUDRIEREPATH=/usr/local/bin/poudriere
---End Environment---

---Begin Poudriere Port Flags/Env---
PORT_FLAGS=
PKGENV=
FLAVOR=
DEPENDS_ARGS=
MAKE_ARGS=
---End Poudriere Port Flags/Env---

---Begin OPTIONS List---
===> The following configuration options are available for reduce-20210413:
     DOCS=on: Build and/or install documentation
===> Use 'make config' to modify these settings
---End OPTIONS List---

--MAINTAINER--
pfg_at_FreeBSD.org
--End MAINTAINER--

--CONFIGURE_ARGS--
--with-csl
--End CONFIGURE_ARGS--

--CONFIGURE_ENV--
MAKE=gmake XDG_DATA_HOME=/wrkdirs/usr/ports/math/reduce/work  XDG_CONFIG_HOME=/wrkdirs/usr/ports/math/reduce/work  HOME=/wrkdirs/usr/ports/math/reduce/work TMPDIR="/tmp" PATH=/wrkdirs/usr/ports/math/reduce/work/.bin:/sbin:/bin:/usr/sbin:/usr/bin:/usr/local/sbin:/usr/local/bin:/root/bin SHELL=/bin/sh CONFIG_SHELL=/bin/sh
--End CONFIGURE_ENV--

--MAKE_ENV--
XDG_DATA_HOME=/wrkdirs/usr/ports/math/reduce/work  XDG_CONFIG_HOME=/wrkdirs/usr/ports/math/reduce/work  HOME=/wrkdirs/usr/ports/math/reduce/work TMPDIR="/tmp" PATH=/wrkdirs/usr/ports/math/reduce/work/.bin:/sbin:/bin:/usr/sbin:/usr/bin:/usr/local/sbin:/usr/local/bin:/root/bin NO_PIE=yes MK_DEBUG_FILES=no MK_KERNEL_SYMBOLS=no SHELL=/bin/sh NO_LINT=YES PREFIX=/usr/local  LOCALBASE=/usr/local  CC="cc" CFLAGS="-O2 -pipe  -fstack-protector-strong -fno-strict-aliasing "  CPP="cpp" CPPFLAGS="-I/usr/include `freetype-config --cflags`"  LDFLAGS=" `freetype-config --libs` -fstack-protector-strong " LIBS=""  CXX="c++" CXXFLAGS="-O2 -pipe -fstack-protector-strong -fno-strict-aliasing  "  MANPREFIX="/usr/local" BSD_INSTALL_PROGRAM="install  -s -m 555"  BSD_INSTALL_LIB="install  -s -m 0644"  BSD_INSTALL_SCRIPT="install  -m 555"  BSD_INSTALL_DATA="install  -m 0644"  BSD_INSTALL_MAN="install  -m 444"
--End MAKE_ENV--

--PLIST_SUB--
PORTDOCS="" OSREL=14.0 PREFIX=%D LOCALBASE=/usr/local  RESETPREFIX=/usr/local LIB32DIR=lib DOCSDIR="share/doc/reduce"  EXAMPLESDIR="share/examples/reduce"  DATADIR="share/reduce"  WWWDIR="www/reduce"  ETCDIR="etc/reduce"
--End PLIST_SUB--

--SUB_LIST--
PREFIX=/usr/local LOCALBASE=/usr/local  DATADIR=/usr/local/share/reduce DOCSDIR=/usr/local/share/doc/reduce EXAMPLESDIR=/usr/local/share/examples/reduce  WWWDIR=/usr/local/www/reduce ETCDIR=/usr/local/etc/reduce
--End SUB_LIST--

---Begin make.conf---
USE_PACKAGE_DEPENDS=yes
BATCH=yes
WRKDIRPREFIX=/wrkdirs
PORTSDIR=/usr/ports
PACKAGES=/packages
DISTDIR=/distfiles
PACKAGE_BUILDING=yes
PACKAGE_BUILDING_FLAVORS=yes
#### /usr/local/etc/poudriere.d/make.conf ####
# XXX: We really need this but cannot use it while 'make checksum' does not
# try the next mirror on checksum failure.  It currently retries the same
# failed mirror and then fails rather then trying another.  It *does*
# try the next if the size is mismatched though.
#MASTER_SITE_FREEBSD=yes
# Build ALLOW_MAKE_JOBS_PACKAGES with 2 jobs
MAKE_JOBS_NUMBER=2
#### /usr/ports/Mk/Scripts/ports_env.sh ####
_CCVERSION_921dbbb2=FreeBSD clang version 12.0.1 (git_at_github.com:llvm/llvm-project.git llvmorg-12.0.1-0-gfed41342a82f) Target: aarch64-unknown-freebsd14.0 Thread model: posix InstalledDir: /usr/bin
_ALTCCVERSION_921dbbb2=none
_CXXINTERNAL_acaad9ca=FreeBSD clang version 12.0.1 (git_at_github.com:llvm/llvm-project.git llvmorg-12.0.1-0-gfed41342a82f) Target: aarch64-unknown-freebsd14.0 Thread model: posix InstalledDir: /usr/bin "/usr/bin/ld" "--eh-frame-hdr" "-dynamic-linker" "/libexec/ld-elf.so.1" "--enable-new-dtags" "-o" "a.out" "/usr/lib/crt1.o" "/usr/lib/crti.o" "/usr/lib/crtbegin.o" "-L/usr/lib" "/dev/null" "-lc++" "-lm" "-lgcc" "--as-needed" "-lgcc_s" "--no-as-needed" "-lc" "-lgcc" "--as-needed" "-lgcc_s" "--no-as-needed" "/usr/lib/crtend.o" "/usr/lib/crtn.o"
CC_OUTPUT_921dbbb2_58173849=yes
CC_OUTPUT_921dbbb2_9bdba57c=yes
CC_OUTPUT_921dbbb2_6a4fe7f5=yes
CC_OUTPUT_921dbbb2_6bcac02b=yes
CC_OUTPUT_921dbbb2_67d20829=yes
CC_OUTPUT_921dbbb2_bfa62e83=yes
CC_OUTPUT_921dbbb2_f0b4d593=yes
CC_OUTPUT_921dbbb2_308abb44=yes
CC_OUTPUT_921dbbb2_f00456e5=yes
CC_OUTPUT_921dbbb2_65ad290d=yes
CC_OUTPUT_921dbbb2_f2776b26=yes
CC_OUTPUT_921dbbb2_b2657cc3=yes
CC_OUTPUT_921dbbb2_380987f7=yes
CC_OUTPUT_921dbbb2_160933ec=yes
CC_OUTPUT_921dbbb2_fb62803b=yes
_OBJC_CCVERSION_921dbbb2=FreeBSD clang version 12.0.1 (git_at_github.com:llvm/llvm-project.git llvmorg-12.0.1-0-gfed41342a82f) Target: aarch64-unknown-freebsd14.0 Thread model: posix InstalledDir: /usr/bin
_OBJC_ALTCCVERSION_921dbbb2=none
ARCH=aarch64
OPSYS=FreeBSD
_OSRELEASE=14.0-CURRENT
OSREL=14.0
OSVERSION=1400026
PYTHONBASE=/usr/local
CONFIGURE_MAX_CMD_LEN=524288
HAVE_PORTS_ENV=1
#### Misc Poudriere ####
GID=0
UID=0
---End make.conf---
--Resource limits--
cpu time               (seconds, -t)  unlimited
file size           (512-blocks, -f)  unlimited
data seg size           (kbytes, -d)  1048576
stack size              (kbytes, -s)  1048576
core file size      (512-blocks, -c)  unlimited
max memory size         (kbytes, -m)  unlimited
locked memory           (kbytes, -l)  unlimited
max user processes              (-u)  89999
open files                      (-n)  1024
virtual mem size        (kbytes, -v)  unlimited
swap limit              (kbytes, -w)  unlimited
socket buffer size       (bytes, -b)  unlimited
pseudo-terminals                (-p)  unlimited
kqueues                         (-k)  unlimited
umtx shared locks               (-o)  unlimited
--End resource limits--
=======================<phase: check-sanity   >============================
===>  License BSD2CLAUSE accepted by the user
===========================================================================
=======================<phase: pkg-depends    >============================
===>   reduce-20210413 depends on file: /usr/local/sbin/pkg - not found
===>   Installing existing package /packages/All/pkg-1.17.0.pkg
[main-arm64-default-job-14] Installing pkg-1.17.0...
[main-arm64-default-job-14] Extracting pkg-1.17.0: .......... done
===>   reduce-20210413 depends on file: /usr/local/sbin/pkg - found
===>   Returning to build of reduce-20210413
===========================================================================
=======================<phase: fetch-depends  >============================
===========================================================================
=======================<phase: fetch          >============================
===>  License BSD2CLAUSE accepted by the user
===> Fetching all distfiles required by reduce-20210413 for building
===========================================================================
=======================<phase: checksum       >============================
===>  License BSD2CLAUSE accepted by the user
===> Fetching all distfiles required by reduce-20210413 for building
=> SHA256 Checksum OK for Reduce-svn5758-src.tar.gz.
===========================================================================
=======================<phase: extract-depends>============================
===========================================================================
=======================<phase: extract        >============================
===>  License BSD2CLAUSE accepted by the user
===> Fetching all distfiles required by reduce-20210413 for building
===>  Extracting for reduce-20210413
=> SHA256 Checksum OK for Reduce-svn5758-src.tar.gz.
===========================================================================
=======================<phase: patch-depends  >============================
===========================================================================
=======================<phase: patch          >============================
===>  Patching for reduce-20210413
===>  Applying FreeBSD patches for reduce-20210413 from /usr/ports/math/reduce/files
===========================================================================
=======================<phase: build-depends  >============================
===>   reduce-20210413 depends on executable: gnuplot - not found
===>   Installing existing package /packages/All/gnuplot-5.4.1_1.pkg
[main-arm64-default-job-14] Installing gnuplot-5.4.1_1...
[main-arm64-default-job-14] `-- Installing atk-2.36.0...
[main-arm64-default-job-14] |   `-- Installing gettext-runtime-0.21...
[main-arm64-default-job-14] |   | `-- Installing indexinfo-0.3.1...
<snip>
[aarch64-unknown-freebsd14.0] CXX    reduce-u21.o
[aarch64-unknown-freebsd14.0] CXX    reduce-u22.o
[aarch64-unknown-freebsd14.0] CXX    reduce-u23.o
[aarch64-unknown-freebsd14.0] CXX    reduce-u24.o
[aarch64-unknown-freebsd14.0] CXX    reduce-u25.o
[aarch64-unknown-freebsd14.0] CXX    reduce-u26.o
[aarch64-unknown-freebsd14.0] CXX    reduce-u27.o
[aarch64-unknown-freebsd14.0] CXX    reduce-u28.o
[aarch64-unknown-freebsd14.0] CXX    reduce-u29.o
[aarch64-unknown-freebsd14.0] CXX    reduce-u30.o
[aarch64-unknown-freebsd14.0] CXX    reduce-u31.o
[aarch64-unknown-freebsd14.0] CXX    reduce-u32.o
[aarch64-unknown-freebsd14.0] CXX    reduce-u33.o
[aarch64-unknown-freebsd14.0] CXX    reduce-u34.o
[aarch64-unknown-freebsd14.0] CXX    reduce-u35.o
[aarch64-unknown-freebsd14.0] CXX    reduce-u36.o
[aarch64-unknown-freebsd14.0] CXX    reduce-u37.o
[aarch64-unknown-freebsd14.0] CXX    reduce-u38.o
[aarch64-unknown-freebsd14.0] CXX    reduce-u39.o
[aarch64-unknown-freebsd14.0] CXX    reduce-u40.o
[aarch64-unknown-freebsd14.0] CXX    reduce-u41.o
[aarch64-unknown-freebsd14.0] CXX    reduce-u42.o
[aarch64-unknown-freebsd14.0] CXX    reduce-u43.o
[aarch64-unknown-freebsd14.0] CXX    reduce-u44.o
[aarch64-unknown-freebsd14.0] CXX    reduce-u45.o
[aarch64-unknown-freebsd14.0] CXX    reduce-u46.o
[aarch64-unknown-freebsd14.0] CXX    reduce-u47.o
[aarch64-unknown-freebsd14.0] CXX    reduce-u48.o
[aarch64-unknown-freebsd14.0] CXX    reduce-u49.o
[aarch64-unknown-freebsd14.0] CXX    reduce-u50.o
[aarch64-unknown-freebsd14.0] CXX    reduce-u51.o
[aarch64-unknown-freebsd14.0] CXX    reduce-u52.o
[aarch64-unknown-freebsd14.0] CXX    reduce-u53.o
[aarch64-unknown-freebsd14.0] CXX    reduce-u54.o
[aarch64-unknown-freebsd14.0] CXX    reduce-u55.o
[aarch64-unknown-freebsd14.0] CXX    reduce-u56.o
[aarch64-unknown-freebsd14.0] CXX    reduce-u57.o
[aarch64-unknown-freebsd14.0] CXX    reduce-u58.o
[aarch64-unknown-freebsd14.0] CXX    reduce-u59.o
[aarch64-unknown-freebsd14.0] CXX    reduce-u60.o
rm -f reduce
c++ -std=gnu++17  -O2 -pipe -fstack-protector-strong -fno-strict-aliasing   -I/usr/local/include -I/usr/local/include/freetype2 -I/usr/local/include -I/usr/local/include/freetype2 -I/usr/local/include -D_THREAD_SAFE -pthread  -O3 -Wall  -L../lib  -L/usr/local/lib -lfreetype -fstack-protector-strong  -L/usr/X11R6/lib -pthread -Wl,--hash-style=both -rdynamic -o reduce reduce-arith01.o reduce-arith02.o reduce-arith03.o reduce-arith04.o reduce-arith05.o reduce-arith06.o reduce-arith07.o reduce-arith08.o reduce-arith09.o reduce-arith10.o reduce-arith11.o reduce-arith12.o reduce-arith13.o reduce-arith14.o reduce-isprime.o reduce-char.o reduce-cslmpi.o reduce-eval1.o reduce-eval2.o reduce-eval3.o reduce-eval4.o reduce-fns1.o reduce-fns2.o reduce-fns3.o reduce-inthash.o reduce-print.o reduce-cslread.o reduce-restart.o reduce-lisphash.o reduce-serialize.o reduce-sysfwin.o reduce-winsupport.o reduce-csl.o reduce-fasl.o reduce-preserve.o reduce-bytes1.o reduce-cslgc.o reduce-allocate.o   reduce
 -u01.o reduce-u02.o reduce-u03.o reduce-u04.o reduce-u05.o reduce-u06.o reduce-u07.o reduce-u08.o reduce-u09.o reduce-u10.o reduce-u11.o reduce-u12.o reduce-u13.o reduce-u14.o reduce-u15.o reduce-u16.o reduce-u17.o reduce-u18.o reduce-u19.o reduce-u20.o reduce-u21.o reduce-u22.o reduce-u23.o reduce-u24.o reduce-u25.o reduce-u26.o reduce-u27.o reduce-u28.o reduce-u29.o reduce-u30.o reduce-u31.o reduce-u32.o reduce-u33.o reduce-u34.o reduce-u35.o reduce-u36.o reduce-u37.o reduce-u38.o reduce-u39.o reduce-u40.o reduce-u41.o reduce-u42.o reduce-u43.o reduce-u44.o reduce-u45.o reduce-u46.o reduce-u47.o reduce-u48.o reduce-u49.o reduce-u50.o reduce-u51.o reduce-u52.o reduce-u53.o reduce-u54.o reduce-u55.o reduce-u56.o reduce-u57.o reduce-u58.o reduce-u59.o reduce-u60.o -lFOX-1.6 ../lib/libcrlibm.a ../lib/libffi.a ../lib/libsoftfloat.a  -lXrandr -lXcursor -lz -lXext -lX11 -L/usr/local/lib -lXft -lX11 -L/usr/local/lib -lfreetype -L/usr/local/lib -lfontconfig -lfreetype -L/usr/local/lib -lXr
 ender -lX11  -lncurses -lncurses 
strip reduce
About to build redfront for /wrkdirs/usr/ports/math/reduce/work/Reduce-svn5758-src/cslbuild/aarch64-unknown-freebsd14.0/csl
gmake[5]: Entering directory '/wrkdirs/usr/ports/math/reduce/work/Reduce-svn5758-src/cslbuild/aarch64-unknown-freebsd14.0/redfront'
cd ../libedit && gmake install
gmake[6]: Entering directory '/wrkdirs/usr/ports/math/reduce/work/Reduce-svn5758-src/cslbuild/aarch64-unknown-freebsd14.0/libedit'
Making install in src
gmake[7]: Entering directory '/wrkdirs/usr/ports/math/reduce/work/Reduce-svn5758-src/cslbuild/aarch64-unknown-freebsd14.0/libedit/src'
AWK=nawk sh /wrkdirs/usr/ports/math/reduce/work/Reduce-svn5758-src/libraries/libedit-20140620-3.1/src/makelist -h /wrkdirs/usr/ports/math/reduce/work/Reduce-svn5758-src/libraries/libedit-20140620-3.1/src/vi.c > vi.h
AWK=nawk sh /wrkdirs/usr/ports/math/reduce/work/Reduce-svn5758-src/libraries/libedit-20140620-3.1/src/makelist -h /wrkdirs/usr/ports/math/reduce/work/Reduce-svn5758-src/libraries/libedit-20140620-3.1/src/emacs.c > emacs.h
AWK=nawk sh /wrkdirs/usr/ports/math/reduce/work/Reduce-svn5758-src/libraries/libedit-20140620-3.1/src/makelist -h /wrkdirs/usr/ports/math/reduce/work/Reduce-svn5758-src/libraries/libedit-20140620-3.1/src/common.c > common.h
AWK=nawk sh /wrkdirs/usr/ports/math/reduce/work/Reduce-svn5758-src/libraries/libedit-20140620-3.1/src/makelist -fh vi.h emacs.h common.h  > fcns.h
AWK=nawk sh /wrkdirs/usr/ports/math/reduce/work/Reduce-svn5758-src/libraries/libedit-20140620-3.1/src/makelist -bh /wrkdirs/usr/ports/math/reduce/work/Reduce-svn5758-src/libraries/libedit-20140620-3.1/src/vi.c /wrkdirs/usr/ports/math/reduce/work/Reduce-svn5758-src/libraries/libedit-20140620-3.1/src/emacs.c /wrkdirs/usr/ports/math/reduce/work/Reduce-svn5758-src/libraries/libedit-20140620-3.1/src/common.c > help.h
AWK=nawk sh /wrkdirs/usr/ports/math/reduce/work/Reduce-svn5758-src/libraries/libedit-20140620-3.1/src/makelist -fc vi.h emacs.h common.h  > fcns.c
AWK=nawk sh /wrkdirs/usr/ports/math/reduce/work/Reduce-svn5758-src/libraries/libedit-20140620-3.1/src/makelist -bc /wrkdirs/usr/ports/math/reduce/work/Reduce-svn5758-src/libraries/libedit-20140620-3.1/src/vi.c /wrkdirs/usr/ports/math/reduce/work/Reduce-svn5758-src/libraries/libedit-20140620-3.1/src/emacs.c /wrkdirs/usr/ports/math/reduce/work/Reduce-svn5758-src/libraries/libedit-20140620-3.1/src/common.c > help.c
AWK=nawk sh /wrkdirs/usr/ports/math/reduce/work/Reduce-svn5758-src/libraries/libedit-20140620-3.1/src/makelist -n /wrkdirs/usr/ports/math/reduce/work/Reduce-svn5758-src/libraries/libedit-20140620-3.1/src/tokenizer.c > tokenizern.c
AWK=nawk sh /wrkdirs/usr/ports/math/reduce/work/Reduce-svn5758-src/libraries/libedit-20140620-3.1/src/makelist -n /wrkdirs/usr/ports/math/reduce/work/Reduce-svn5758-src/libraries/libedit-20140620-3.1/src/history.c > historyn.c
gmake  install-am
gmake[8]: Entering directory '/wrkdirs/usr/ports/math/reduce/work/Reduce-svn5758-src/cslbuild/aarch64-unknown-freebsd14.0/libedit/src'
  CC       chared.lo
  CC       common.lo
  CC       el.lo
  CC       emacs.lo
  CC       hist.lo
  CC       keymacro.lo
  CC       map.lo
  CC       chartype.lo
  CC       parse.lo
  CC       prompt.lo
  CC       read.lo
  CC       refresh.lo
  CC       search.lo
  CC       sig.lo
  CC       terminal.lo
  CC       tty.lo
  CC       vi.lo
  CC       fgetln.lo
  CC       wcsdup.lo
  CC       tokenizer.lo
  CC       history.lo
  CC       filecomplete.lo
  CC       readline.lo
  CC       eln.lo
  CC       fcns.lo
  CC       help.lo
  CC       tokenizern.lo
  CC       historyn.lo
  CCLD     libedit.la
gmake[9]: Entering directory '/wrkdirs/usr/ports/math/reduce/work/Reduce-svn5758-src/cslbuild/aarch64-unknown-freebsd14.0/libedit/src'
 /wrkdirs/usr/ports/math/reduce/work/Reduce-svn5758-src/libraries/libedit-20140620-3.1/./install-sh -c -d '/wrkdirs/usr/ports/math/reduce/work/Reduce-svn5758-src/cslbuild/aarch64-unknown-freebsd14.0/lib'
 /bin/sh ../libtool   --mode=install /usr/bin/install -c   libedit.la '/wrkdirs/usr/ports/math/reduce/work/Reduce-svn5758-src/cslbuild/aarch64-unknown-freebsd14.0/lib'
libtool: install: /usr/bin/install -c .libs/libedit.so.0.0.51 /wrkdirs/usr/ports/math/reduce/work/Reduce-svn5758-src/cslbuild/aarch64-unknown-freebsd14.0/lib/libedit.so.0.0.51
libtool: install: (cd /wrkdirs/usr/ports/math/reduce/work/Reduce-svn5758-src/cslbuild/aarch64-unknown-freebsd14.0/lib && { ln -s -f libedit.so.0.0.51 libedit.so.0 || { rm -f libedit.so.0 && ln -s libedit.so.0.0.51 libedit.so.0; }; })
libtool: install: (cd /wrkdirs/usr/ports/math/reduce/work/Reduce-svn5758-src/cslbuild/aarch64-unknown-freebsd14.0/lib && { ln -s -f libedit.so.0.0.51 libedit.so || { rm -f libedit.so && ln -s libedit.so.0.0.51 libedit.so; }; })
libtool: install: /usr/bin/install -c .libs/libedit.lai /wrkdirs/usr/ports/math/reduce/work/Reduce-svn5758-src/cslbuild/aarch64-unknown-freebsd14.0/lib/libedit.la
libtool: install: /usr/bin/install -c .libs/libedit.a /wrkdirs/usr/ports/math/reduce/work/Reduce-svn5758-src/cslbuild/aarch64-unknown-freebsd14.0/lib/libedit.a
libtool: install: chmod 644 /wrkdirs/usr/ports/math/reduce/work/Reduce-svn5758-src/cslbuild/aarch64-unknown-freebsd14.0/lib/libedit.a
libtool: install: ranlib /wrkdirs/usr/ports/math/reduce/work/Reduce-svn5758-src/cslbuild/aarch64-unknown-freebsd14.0/lib/libedit.a
 /wrkdirs/usr/ports/math/reduce/work/Reduce-svn5758-src/libraries/libedit-20140620-3.1/./install-sh -c -d '/wrkdirs/usr/ports/math/reduce/work/Reduce-svn5758-src/cslbuild/aarch64-unknown-freebsd14.0/include'
 /wrkdirs/usr/ports/math/reduce/work/Reduce-svn5758-src/libraries/libedit-20140620-3.1/./install-sh -c -d '/wrkdirs/usr/ports/math/reduce/work/Reduce-svn5758-src/cslbuild/aarch64-unknown-freebsd14.0/include/editline'
 install  -m 0644  /wrkdirs/usr/ports/math/reduce/work/Reduce-svn5758-src/libraries/libedit-20140620-3.1/src/editline/readline.h '/wrkdirs/usr/ports/math/reduce/work/Reduce-svn5758-src/cslbuild/aarch64-unknown-freebsd14.0/include/editline'
 install  -m 0644  /wrkdirs/usr/ports/math/reduce/work/Reduce-svn5758-src/libraries/libedit-20140620-3.1/src/filecomplete.h /wrkdirs/usr/ports/math/reduce/work/Reduce-svn5758-src/libraries/libedit-20140620-3.1/src/histedit.h /wrkdirs/usr/ports/math/reduce/work/Reduce-svn5758-src/libraries/libedit-20140620-3.1/src/chartype.h /wrkdirs/usr/ports/math/reduce/work/Reduce-svn5758-src/libraries/libedit-20140620-3.1/src/sys.h '/wrkdirs/usr/ports/math/reduce/work/Reduce-svn5758-src/cslbuild/aarch64-unknown-freebsd14.0/include/.'
gmake[9]: Leaving directory '/wrkdirs/usr/ports/math/reduce/work/Reduce-svn5758-src/cslbuild/aarch64-unknown-freebsd14.0/libedit/src'
gmake[8]: Leaving directory '/wrkdirs/usr/ports/math/reduce/work/Reduce-svn5758-src/cslbuild/aarch64-unknown-freebsd14.0/libedit/src'
gmake[7]: Leaving directory '/wrkdirs/usr/ports/math/reduce/work/Reduce-svn5758-src/cslbuild/aarch64-unknown-freebsd14.0/libedit/src'
Making install in examples
gmake[7]: Entering directory '/wrkdirs/usr/ports/math/reduce/work/Reduce-svn5758-src/cslbuild/aarch64-unknown-freebsd14.0/libedit/examples'
  CC       tc1.o
/wrkdirs/usr/ports/math/reduce/work/Reduce-svn5758-src/libraries/libedit-20140620-3.1/examples/tc1.c:197:47: warning: format specifies type 'int' but the argument has type 'sig_atomic_t' (aka 'long') [-Wformat]
                        (void) fprintf(stderr, "Got signal %d.\n", gotsig);
                                                           ~~      ^~~~~~
                                                           %ld
1 warning generated.
  CCLD     tc1
  CC       fileman.o
  CCLD     fileman
  CC       wtc1.o
/wrkdirs/usr/ports/math/reduce/work/Reduce-svn5758-src/libraries/libedit-20140620-3.1/examples/wtc1.c:173:46: warning: format specifies type 'int' but the argument has type 'sig_atomic_t' (aka 'long') [-Wformat]
                        (void)fprintf(stderr, "Got signal %d.\n", gotsig);
                                                          ~~      ^~~~~~
                                                          %ld
1 warning generated.
  CCLD     wtc1
gmake[8]: Entering directory '/wrkdirs/usr/ports/math/reduce/work/Reduce-svn5758-src/cslbuild/aarch64-unknown-freebsd14.0/libedit/examples'
gmake[8]: Nothing to be done for 'install-exec-am'.
gmake[8]: Nothing to be done for 'install-data-am'.
gmake[8]: Leaving directory '/wrkdirs/usr/ports/math/reduce/work/Reduce-svn5758-src/cslbuild/aarch64-unknown-freebsd14.0/libedit/examples'
gmake[7]: Leaving directory '/wrkdirs/usr/ports/math/reduce/work/Reduce-svn5758-src/cslbuild/aarch64-unknown-freebsd14.0/libedit/examples'
Making install in doc
gmake[7]: Entering directory '/wrkdirs/usr/ports/math/reduce/work/Reduce-svn5758-src/cslbuild/aarch64-unknown-freebsd14.0/libedit/doc'
gmake[8]: Entering directory '/wrkdirs/usr/ports/math/reduce/work/Reduce-svn5758-src/cslbuild/aarch64-unknown-freebsd14.0/libedit/doc'
gmake[8]: Nothing to be done for 'install-exec-am'.
 /wrkdirs/usr/ports/math/reduce/work/Reduce-svn5758-src/libraries/libedit-20140620-3.1/./install-sh -c -d '/wrkdirs/usr/ports/math/reduce/work/Reduce-svn5758-src/cslbuild/aarch64-unknown-freebsd14.0/share/man/man3'
 install  -m 0644 editline.3 '/wrkdirs/usr/ports/math/reduce/work/Reduce-svn5758-src/cslbuild/aarch64-unknown-freebsd14.0/share/man/man3'
 /wrkdirs/usr/ports/math/reduce/work/Reduce-svn5758-src/libraries/libedit-20140620-3.1/./install-sh -c -d '/wrkdirs/usr/ports/math/reduce/work/Reduce-svn5758-src/cslbuild/aarch64-unknown-freebsd14.0/share/man/man5'
 install  -m 0644 editrc.5 '/wrkdirs/usr/ports/math/reduce/work/Reduce-svn5758-src/cslbuild/aarch64-unknown-freebsd14.0/share/man/man5'
gmake  install-data-hook
gmake[9]: Entering directory '/wrkdirs/usr/ports/math/reduce/work/Reduce-svn5758-src/cslbuild/aarch64-unknown-freebsd14.0/libedit/doc'
(cd /wrkdirs/usr/ports/math/reduce/work/Reduce-svn5758-src/cslbuild/aarch64-unknown-freebsd14.0/share/man/man3 && rm -f el_init.3 && ln -s editline.3 el_init.3)
(cd /wrkdirs/usr/ports/math/reduce/work/Reduce-svn5758-src/cslbuild/aarch64-unknown-freebsd14.0/share/man/man3 && rm -f el_end.3 && ln -s editline.3 el_end.3)
(cd /wrkdirs/usr/ports/math/reduce/work/Reduce-svn5758-src/cslbuild/aarch64-unknown-freebsd14.0/share/man/man3 && rm -f el_reset.3 && ln -s editline.3 el_reset.3)
(cd /wrkdirs/usr/ports/math/reduce/work/Reduce-svn5758-src/cslbuild/aarch64-unknown-freebsd14.0/share/man/man3 && rm -f el_gets.3 && ln -s editline.3 el_gets.3)
(cd /wrkdirs/usr/ports/math/reduce/work/Reduce-svn5758-src/cslbuild/aarch64-unknown-freebsd14.0/share/man/man3 && rm -f el_getc.3 && ln -s editline.3 el_getc.3)
(cd /wrkdirs/usr/ports/math/reduce/work/Reduce-svn5758-src/cslbuild/aarch64-unknown-freebsd14.0/share/man/man3 && rm -f el_push.3 && ln -s editline.3 el_push.3)
(cd /wrkdirs/usr/ports/math/reduce/work/Reduce-svn5758-src/cslbuild/aarch64-unknown-freebsd14.0/share/man/man3 && rm -f el_parse.3 && ln -s editline.3 el_parse.3)
(cd /wrkdirs/usr/ports/math/reduce/work/Reduce-svn5758-src/cslbuild/aarch64-unknown-freebsd14.0/share/man/man3 && rm -f el_set.3 && ln -s editline.3 el_set.3)
(cd /wrkdirs/usr/ports/math/reduce/work/Reduce-svn5758-src/cslbuild/aarch64-unknown-freebsd14.0/share/man/man3 && rm -f el_get.3 && ln -s editline.3 el_get.3)
(cd /wrkdirs/usr/ports/math/reduce/work/Reduce-svn5758-src/cslbuild/aarch64-unknown-freebsd14.0/share/man/man3 && rm -f el_source.3 && ln -s editline.3 el_source.3)
(cd /wrkdirs/usr/ports/math/reduce/work/Reduce-svn5758-src/cslbuild/aarch64-unknown-freebsd14.0/share/man/man3 && rm -f el_resize.3 && ln -s editline.3 el_resize.3)
(cd /wrkdirs/usr/ports/math/reduce/work/Reduce-svn5758-src/cslbuild/aarch64-unknown-freebsd14.0/share/man/man3 && rm -f el_line.3 && ln -s editline.3 el_line.3)
(cd /wrkdirs/usr/ports/math/reduce/work/Reduce-svn5758-src/cslbuild/aarch64-unknown-freebsd14.0/share/man/man3 && rm -f el_insertstr.3 && ln -s editline.3 el_insertstr.3)
(cd /wrkdirs/usr/ports/math/reduce/work/Reduce-svn5758-src/cslbuild/aarch64-unknown-freebsd14.0/share/man/man3 && rm -f el_deletestr.3 && ln -s editline.3 el_deletestr.3)
(cd /wrkdirs/usr/ports/math/reduce/work/Reduce-svn5758-src/cslbuild/aarch64-unknown-freebsd14.0/share/man/man3 && rm -f el_history_init.3 && ln -s editline.3 el_history_init.3)
(cd /wrkdirs/usr/ports/math/reduce/work/Reduce-svn5758-src/cslbuild/aarch64-unknown-freebsd14.0/share/man/man3 && rm -f el_history_end.3 && ln -s editline.3 el_history_end.3)
(cd /wrkdirs/usr/ports/math/reduce/work/Reduce-svn5758-src/cslbuild/aarch64-unknown-freebsd14.0/share/man/man3 && rm -f el_history.3 && ln -s editline.3 el_history.3)
(cd /wrkdirs/usr/ports/math/reduce/work/Reduce-svn5758-src/cslbuild/aarch64-unknown-freebsd14.0/share/man/man3 && rm -f el_tok_init.3 && ln -s editline.3 el_tok_init.3)
(cd /wrkdirs/usr/ports/math/reduce/work/Reduce-svn5758-src/cslbuild/aarch64-unknown-freebsd14.0/share/man/man3 && rm -f el_tok_end.3 && ln -s editline.3 el_tok_end.3)
(cd /wrkdirs/usr/ports/math/reduce/work/Reduce-svn5758-src/cslbuild/aarch64-unknown-freebsd14.0/share/man/man3 && rm -f el_tok_reset.3 && ln -s editline.3 el_tok_reset.3)
(cd /wrkdirs/usr/ports/math/reduce/work/Reduce-svn5758-src/cslbuild/aarch64-unknown-freebsd14.0/share/man/man3 && rm -f el_tok_line.3 && ln -s editline.3 el_tok_line.3)
(cd /wrkdirs/usr/ports/math/reduce/work/Reduce-svn5758-src/cslbuild/aarch64-unknown-freebsd14.0/share/man/man3 && rm -f el_tok_str.3 && ln -s editline.3 el_tok_str.3)
gmake[9]: Leaving directory '/wrkdirs/usr/ports/math/reduce/work/Reduce-svn5758-src/cslbuild/aarch64-unknown-freebsd14.0/libedit/doc'
gmake[8]: Leaving directory '/wrkdirs/usr/ports/math/reduce/work/Reduce-svn5758-src/cslbuild/aarch64-unknown-freebsd14.0/libedit/doc'
gmake[7]: Leaving directory '/wrkdirs/usr/ports/math/reduce/work/Reduce-svn5758-src/cslbuild/aarch64-unknown-freebsd14.0/libedit/doc'
gmake[7]: Entering directory '/wrkdirs/usr/ports/math/reduce/work/Reduce-svn5758-src/cslbuild/aarch64-unknown-freebsd14.0/libedit'
gmake[8]: Entering directory '/wrkdirs/usr/ports/math/reduce/work/Reduce-svn5758-src/cslbuild/aarch64-unknown-freebsd14.0/libedit'
gmake[8]: Nothing to be done for 'install-exec-am'.
 /wrkdirs/usr/ports/math/reduce/work/Reduce-svn5758-src/libraries/libedit-20140620-3.1/./install-sh -c -d '/wrkdirs/usr/ports/math/reduce/work/Reduce-svn5758-src/cslbuild/aarch64-unknown-freebsd14.0/lib/pkgconfig'
 install  -m 0644 libedit.pc '/wrkdirs/usr/ports/math/reduce/work/Reduce-svn5758-src/cslbuild/aarch64-unknown-freebsd14.0/lib/pkgconfig'
gmake[8]: Leaving directory '/wrkdirs/usr/ports/math/reduce/work/Reduce-svn5758-src/cslbuild/aarch64-unknown-freebsd14.0/libedit'
gmake[7]: Leaving directory '/wrkdirs/usr/ports/math/reduce/work/Reduce-svn5758-src/cslbuild/aarch64-unknown-freebsd14.0/libedit'
gmake[6]: Leaving directory '/wrkdirs/usr/ports/math/reduce/work/Reduce-svn5758-src/cslbuild/aarch64-unknown-freebsd14.0/libedit'
cc -DPACKAGE_NAME=\"Redfront\" -DPACKAGE_TARNAME=\"redfront\" -DPACKAGE_VERSION=\"3.3\" -DPACKAGE_STRING=\"Redfront\ 3.3\" -DPACKAGE_BUGREPORT=\"http://sourceforge.net/reduce-algebra\" -DPACKAGE_URL=\"\" -DPACKAGE=\"redfront\" -DVERSION=\"3.3\" -DSTDC_HEADERS=1 -DHAVE_SYS_TYPES_H=1 -DHAVE_SYS_STAT_H=1 -DHAVE_STDLIB_H=1 -DHAVE_STRING_H=1 -DHAVE_MEMORY_H=1 -DHAVE_STRINGS_H=1 -DHAVE_INTTYPES_H=1 -DHAVE_STDINT_H=1 -DHAVE_UNISTD_H=1 -DHAVE_DLFCN_H=1 -DLT_OBJDIR=\".libs/\" -DUSE_PIPES=0 -DHAVE_CURSES_H=1 -DHAVE_NCURSES_H=1 -DHAVE_SYS_WAIT_H=1 -DHAVE_WAITPID=1 -DHAVE_SETLINEBUF=1 -I. -I/wrkdirs/usr/ports/math/reduce/work/Reduce-svn5758-src/generic/newfront  -DPSL=1 -I../include -I/usr/include -I/usr/local/include/freetype2 -DBUILDTIME="\"27-Jul-2021\""  -O2 -pipe  -fstack-protector-strong -fno-strict-aliasing   -O3 -MT rfpsl-redchild.o -MD -MP -MF .deps/rfpsl-redchild.Tpo -c -o rfpsl-redchild.o `test -f 'redchild.c' || echo '/wrkdirs/usr/ports/math/reduce/work/Reduce-svn5758-src/generic/new
 front/'`redchild.c
In file included from /wrkdirs/usr/ports/math/reduce/work/Reduce-svn5758-src/generic/newfront/redchild.c:31:
/wrkdirs/usr/ports/math/reduce/work/Reduce-svn5758-src/generic/newfront/redfront.h:118:12: error: conflicting types for '__wcwidth'
extern int wcwidth(wchar_t c);
           ^
/usr/include/wchar.h:216:21: note: expanded from macro 'wcwidth'
#define wcwidth(_c)     __wcwidth(_c)
                        ^
/usr/include/_ctype.h:161:1: note: previous definition is here
__wcwidth(__ct_rune_t _c)
^
1 error generated.
gmake[5]: *** [Makefile:859: rfpsl-redchild.o] Error 1
gmake[5]: Leaving directory '/wrkdirs/usr/ports/math/reduce/work/Reduce-svn5758-src/cslbuild/aarch64-unknown-freebsd14.0/redfront'
gmake[4]: *** [Makefile:7443: /wrkdirs/usr/ports/math/reduce/work/Reduce-svn5758-src/csl/cslbase/../../bin/rfcsl] Error 2
gmake[4]: Leaving directory '/wrkdirs/usr/ports/math/reduce/work/Reduce-svn5758-src/cslbuild/aarch64-unknown-freebsd14.0/csl'
gmake[3]: *** [Makefile:1472: all] Error 2
gmake[3]: Leaving directory '/wrkdirs/usr/ports/math/reduce/work/Reduce-svn5758-src/cslbuild/aarch64-unknown-freebsd14.0/csl'
gmake[2]: *** [Makefile:674: /wrkdirs/usr/ports/math/reduce/work/Reduce-svn5758-src/m4/libtool.m4] Error 2
gmake[2]: Leaving directory '/wrkdirs/usr/ports/math/reduce/work/Reduce-svn5758-src/cslbuild/aarch64-unknown-freebsd14.0'

Reduce build tasks finished with highest return code 2
gmake[1]: *** [Makefile:34: all] Error 2
gmake[1]: Leaving directory '/wrkdirs/usr/ports/math/reduce/work/Reduce-svn5758-src'
*** Error code 1

Stop.
make: stopped in /usr/ports/math/reduce
Received on Tue Jul 27 2021 - 13:43:02 UTC

Original text of this message