[package - 130releng-armv7-quarterly][emulators/aranym] Failed for aranym-1.1.0_1 in build

From: <pkg-fallout_at_FreeBSD.org>
Date: Tue, 27 Jul 2021 10:16:30 GMT
You are receiving this mail as a port that you maintain
is failing to build on the FreeBSD package build server.
Please investigate the failure and submit a PR to fix
build.

Maintainer:     yuri_at_FreeBSD.org
Log URL:        http://beefy12.nyi.freebsd.org/data/130releng-armv7-quarterly/2e72ae10199f/logs/aranym-1.1.0_1.log
Build URL:      http://beefy12.nyi.freebsd.org/build.html?mastername=130releng-armv7-quarterly&build=2e72ae10199f
Log:

=>> Building emulators/aranym
build started at Tue Jul 27 10:14:13 UTC 2021
port directory: /usr/ports/emulators/aranym
package name: aranym-1.1.0_1
building for: FreeBSD 130releng-armv7-quarterly-job-05 13.0-RELEASE-p3 FreeBSD 13.0-RELEASE-p3 1300139 arm
maintained by: yuri_at_FreeBSD.org
Makefile ident: 
Poudriere version: 3.2.8-8-gaf08dbda
Host OSVERSION: 1400003
Jail OSVERSION: 1300139
Job Id: 05

---Begin Environment---
SHELL=/bin/csh
UNAME_p=armv7
UNAME_m=arm
ABI_FILE=/usr/lib/crt1.o
OSVERSION=1300139
UNAME_v=FreeBSD 13.0-RELEASE-p3 1300139
UNAME_r=13.0-RELEASE-p3
BLOCKSIZE=K
MAIL=/var/mail/root
MM_CHARSET=UTF-8
LANG=C.UTF-8
STATUS=1
HOME=/root
PATH=/sbin:/bin:/usr/sbin:/usr/bin:/usr/local/sbin:/usr/local/bin:/root/bin
LOCALBASE=/usr/local
QEMU_EMULATING=1
USER=root
LIBEXECPREFIX=/usr/local/libexec/poudriere
POUDRIERE_VERSION=3.2.8-8-gaf08dbda
MASTERMNT=/usr/local/poudriere/data/.m/130releng-armv7-quarterly/ref
POUDRIERE_BUILD_TYPE=bulk
PACKAGE_BUILDING=yes
SAVED_TERM=
PWD=/usr/local/poudriere/data/.m/130releng-armv7-quarterly/ref/.p/pool
P_PORTS_FEATURES=FLAVORS SELECTED_OPTIONS
MASTERNAME=130releng-armv7-quarterly
SCRIPTPREFIX=/usr/local/share/poudriere
OLDPWD=/usr/local/poudriere/data/.m/130releng-armv7-quarterly/ref/.p
SCRIPTPATH=/usr/local/share/poudriere/bulk.sh
POUDRIEREPATH=/usr/local/bin/poudriere
---End Environment---

---Begin Poudriere Port Flags/Env---
PORT_FLAGS=
PKGENV=
FLAVOR=
DEPENDS_ARGS=
MAKE_ARGS=
---End Poudriere Port Flags/Env---

---Begin OPTIONS List---
---End OPTIONS List---

--MAINTAINER--
yuri_at_FreeBSD.org
--End MAINTAINER--

--CONFIGURE_ARGS--
-disable-nat-debug --disable-nat-debug --enable-nfjpeg --x-libraries=/usr/local/lib --x-includes=/usr/local/include --prefix=/usr/local ${_LATE_CONFIGURE_ARGS}
--End CONFIGURE_ARGS--

--CONFIGURE_ENV--
MAKE=gmake ac_cv_path_PERL=/usr/local/bin/perl ac_cv_path_PERL_PATH=/usr/local/bin/perl  PERL_USE_UNSAFE_INC=1 PKG_CONFIG=pkgconf SDL2_CONFIG=/usr/local/bin/sdl2-config XDG_DATA_HOME=/wrkdirs/usr/ports/emulators/aranym/work  XDG_CONFIG_HOME=/wrkdirs/usr/ports/emulators/aranym/work  HOME=/wrkdirs/usr/ports/emulators/aranym/work TMPDIR="/tmp" PATH=/wrkdirs/usr/ports/emulators/aranym/work/.bin:/sbin:/bin:/usr/sbin:/usr/bin:/usr/local/sbin:/usr/local/bin:/root/bin SHELL=/bin/sh CONFIG_SHELL=/bin/sh CMAKE_PREFIX_PATH="/usr/local" CONFIG_SITE=/usr/ports/Templates/config.site lt_cv_sys_max_cmd_len=524288
--End CONFIGURE_ENV--

--MAKE_ENV--
PERL_USE_UNSAFE_INC=1 SDL2_CONFIG=/usr/local/bin/sdl2-config XDG_DATA_HOME=/wrkdirs/usr/ports/emulators/aranym/work  XDG_CONFIG_HOME=/wrkdirs/usr/ports/emulators/aranym/work  HOME=/wrkdirs/usr/ports/emulators/aranym/work TMPDIR="/tmp" PATH=/wrkdirs/usr/ports/emulators/aranym/work/.bin:/sbin:/bin:/usr/sbin:/usr/bin:/usr/local/sbin:/usr/local/bin:/root/bin NO_PIE=yes MK_DEBUG_FILES=no MK_KERNEL_SYMBOLS=no SHELL=/bin/sh NO_LINT=YES PREFIX=/usr/local  LOCALBASE=/usr/local  CC="/nxb-bin/usr/bin/cc" CFLAGS="-O2 -pipe  -fstack-protector-strong -isystem /usr/local/include -fno-strict-aliasing "  CPP="/nxb-bin/usr/bin/cpp" CPPFLAGS="-isystem /usr/local/include"  LDFLAGS=" -fstack-protector-strong -L/usr/local/lib " LIBS=""  CXX="/nxb-bin/usr/bin/c++" CXXFLAGS="-O2 -pipe -fstack-protector-strong -isystem /usr/local/include -fno-strict-aliasing  -isystem /usr/local/include "  MANPREFIX="/usr/local" BSD_INSTALL_PROGRAM="install  -s -m 555"  BSD_INSTALL_LIB="install  -s -m 0644"  BSD_INSTALL_SCRI
 PT="install  -m 555"  BSD_INSTALL_DATA="install  -m 0644"  BSD_INSTALL_MAN="install  -m 444"
--End MAKE_ENV--

--PLIST_SUB--
OSREL=13.0 PREFIX=%D LOCALBASE=/usr/local  RESETPREFIX=/usr/local LIB32DIR=lib PERL_VERSION=5.32.1  PERL_VER=5.32  PERL5_MAN1=lib/perl5/site_perl/man/man1  PERL5_MAN3=lib/perl5/site_perl/man/man3  SITE_PERL=lib/perl5/site_perl  SITE_ARCH=lib/perl5/site_perl/mach/5.32 DOCSDIR="share/doc/aranym"  EXAMPLESDIR="share/examples/aranym"  DATADIR="share/aranym"  WWWDIR="www/aranym"  ETCDIR="etc/aranym"
--End PLIST_SUB--

--SUB_LIST--
PREFIX=/usr/local LOCALBASE=/usr/local  DATADIR=/usr/local/share/aranym DOCSDIR=/usr/local/share/doc/aranym EXAMPLESDIR=/usr/local/share/examples/aranym  WWWDIR=/usr/local/www/aranym ETCDIR=/usr/local/etc/aranym
--End SUB_LIST--

---Begin make.conf---
.sinclude "/etc/make.nxb.conf"
USE_PACKAGE_DEPENDS=yes
BATCH=yes
WRKDIRPREFIX=/wrkdirs
PORTSDIR=/usr/ports
PACKAGES=/packages
DISTDIR=/distfiles
PACKAGE_BUILDING=yes
PACKAGE_BUILDING_FLAVORS=yes
MACHINE=arm
MACHINE_ARCH=armv7
ARCH=${MACHINE_ARCH}
#### /usr/local/etc/poudriere.d/make.conf ####
# XXX: We really need this but cannot use it while 'make checksum' does not
# try the next mirror on checksum failure.  It currently retries the same
# failed mirror and then fails rather then trying another.  It *does*
# try the next if the size is mismatched though.
#MASTER_SITE_FREEBSD=yes
# Build ALLOW_MAKE_JOBS_PACKAGES with 2 jobs
MAKE_JOBS_NUMBER=2
#### /usr/ports/Mk/Scripts/ports_env.sh ####
_CCVERSION_9d218390=FreeBSD clang version 11.0.1 (git_at_github.com:llvm/llvm-project.git llvmorg-11.0.1-0-g43ff75f2c3fe) Target: armv7-unknown-freebsd13.0-gnueabihf Thread model: posix InstalledDir: /nxb-bin/usr/bin
_ALTCCVERSION_9d218390=none
_CXXINTERNAL_9c45a5b1=FreeBSD clang version 11.0.1 (git_at_github.com:llvm/llvm-project.git llvmorg-11.0.1-0-g43ff75f2c3fe) Target: armv7-unknown-freebsd13.0-gnueabihf Thread model: posix InstalledDir: /nxb-bin/usr/bin "/nxb-bin/usr/bin/ld" "--eh-frame-hdr" "-dynamic-linker" "/libexec/ld-elf.so.1" "--hash-style=both" "--enable-new-dtags" "-o" "a.out" "/usr/lib/crt1.o" "/usr/lib/crti.o" "/usr/lib/crtbegin.o" "-L/usr/lib" "/dev/null" "-lc++" "-lm" "-lgcc" "--as-needed" "-lgcc_s" "--no-as-needed" "-lc" "-lgcc" "--as-needed" "-lgcc_s" "--no-as-needed" "/usr/lib/crtend.o" "/usr/lib/crtn.o"
CC_OUTPUT_9d218390_58173849=yes
CC_OUTPUT_9d218390_9bdba57c=yes
CC_OUTPUT_9d218390_6a4fe7f5=yes
CC_OUTPUT_9d218390_6bcac02b=yes
CC_OUTPUT_9d218390_67d20829=yes
CC_OUTPUT_9d218390_bfa62e83=yes
CC_OUTPUT_9d218390_f0b4d593=yes
CC_OUTPUT_9d218390_308abb44=yes
CC_OUTPUT_9d218390_f00456e5=yes
CC_OUTPUT_9d218390_65ad290d=yes
CC_OUTPUT_9d218390_f2776b26=yes
CC_OUTPUT_9d218390_b2657cc3=yes
CC_OUTPUT_9d218390_380987f7=yes
CC_OUTPUT_9d218390_160933ec=yes
CC_OUTPUT_9d218390_fb62803b=yes
_OBJC_CCVERSION_9d218390=FreeBSD clang version 11.0.1 (git_at_github.com:llvm/llvm-project.git llvmorg-11.0.1-0-g43ff75f2c3fe) Target: armv7-unknown-freebsd13.0-gnueabihf Thread model: posix InstalledDir: /nxb-bin/usr/bin
_OBJC_ALTCCVERSION_9d218390=none
ARCH=armv7
OPSYS=FreeBSD
_OSRELEASE=13.0-RELEASE-p3
OSREL=13.0
OSVERSION=1300139
PYTHONBASE=/usr/local
CONFIGURE_MAX_CMD_LEN=524288
HAVE_PORTS_ENV=1
#### Misc Poudriere ####
GID=0
UID=0
DISABLE_MAKE_JOBS=poudriere
---End make.conf---
---Begin make.nxb.conf---
CC=/nxb-bin/usr/bin/cc
CPP=/nxb-bin/usr/bin/cpp
CXX=/nxb-bin/usr/bin/c++
NM=/nxb-bin/usr/bin/nm
LD=/nxb-bin/usr/bin/ld
OBJCOPY=/nxb-bin/usr/bin/objcopy
SIZE=/nxb-bin/usr/bin/size
STRIPBIN=/nxb-bin/usr/bin/strip
SED=/nxb-bin/usr/bin/sed
RANLIB=/nxb-bin/usr/bin/ranlib
YACC=/nxb-bin/usr/bin/yacc
MAKE=/nxb-bin/usr/bin/make
STRINGS=/nxb-bin/usr/bin/strings
AWK=/nxb-bin/usr/bin/awk
FLEX=/nxb-bin/usr/bin/flex
---End make.nxb.conf---
--Resource limits--
cpu time               (seconds, -t)  unlimited
file size           (512-blocks, -f)  unlimited
data seg size           (kbytes, -d)  33554432
stack size              (kbytes, -s)  524288
core file size      (512-blocks, -c)  unlimited
max memory size         (kbytes, -m)  unlimited
locked memory           (kbytes, -l)  unlimited
max user processes              (-u)  89999
open files                      (-n)  1024
virtual mem size        (kbytes, -v)  unlimited
swap limit              (kbytes, -w)  unlimited
socket buffer size       (bytes, -b)  unlimited
pseudo-terminals                (-p)  unlimited
kqueues                         (-k)  unlimited
umtx shared locks               (-o)  unlimited
--End resource limits--
=======================<phase: check-sanity   >============================
===>  License GPLv2 accepted by the user
===========================================================================
=======================<phase: pkg-depends    >============================
===>   aranym-1.1.0_1 depends on file: /usr/local/sbin/pkg - not found
===>   Installing existing package /packages/All/pkg-1.16.3.txz
[130releng-armv7-quarterly-job-05] Installing pkg-1.16.3...
[130releng-armv7-quarterly-job-05] Extracting pkg-1.16.3: .......... done
===>   aranym-1.1.0_1 depends on file: /usr/local/sbin/pkg - found
===>   Returning to build of aranym-1.1.0_1
===========================================================================
=======================<phase: fetch-depends  >============================
===========================================================================
=======================<phase: fetch          >============================
===>  License GPLv2 accepted by the user
===> Fetching all distfiles required by aranym-1.1.0_1 for building
===========================================================================
=======================<phase: checksum       >============================
===>  License GPLv2 accepted by the user
===> Fetching all distfiles required by aranym-1.1.0_1 for building
=> SHA256 Checksum OK for aranym_1.1.0.orig.tar.gz.
===========================================================================
=======================<phase: extract-depends>============================
===========================================================================
=======================<phase: extract        >============================
===>  License GPLv2 accepted by the user
===> Fetching all distfiles required by aranym-1.1.0_1 for building
===>  Extracting for aranym-1.1.0_1
=> SHA256 Checksum OK for aranym_1.1.0.orig.tar.gz.
===========================================================================
<snip>
else \
	/usr/local/bin/perl ./tools/dyngl.pl -incfile ./atari/nfosmesa/gltypes.h -tinyslbheader ./tools/glfuncs.h > $$.tmp && mv $$.tmp atari/nfosmesa/slb/tiny_gl.h || { rm -f $$.tmp; false; } \
fi
if test -z "/usr/local/bin/perl"; then \
	echo "atari/nfosmesa/slb/osmesa.h is out of date, but PERL not available" >&2; \
else \
	/usr/local/bin/perl ./tools/dyngl.pl -incfile ./atari/nfosmesa/gltypes.h -enums ./atari/nfosmesa/enum-gl.h -slbheader ./tools/glfuncs.h > $$.tmp && mv $$.tmp atari/nfosmesa/slb/osmesa.h || { rm -f $$.tmp; false; } \
fi
if test -z "/usr/local/bin/perl"; then \
	echo "atari/nfosmesa/tinygl_loadslb.c is out of date, but PERL not available" >&2; \
else \
	/usr/local/bin/perl ./tools/dyngl.pl -enums ./atari/nfosmesa/enum-gl.h -tinyslbsource ./tools/glfuncs.h > $$.tmp && mv $$.tmp atari/nfosmesa/tinygl_loadslb.c || { rm -f $$.tmp; false; } \
fi
if test -z "/usr/local/bin/perl"; then \
	echo "atari/nfosmesa/osmesa_loadslb.c is out of date, but PERL not available" >&2; \
else \
	/usr/local/bin/perl ./tools/dyngl.pl -enums ./atari/nfosmesa/enum-gl.h -slbsource ./tools/glfuncs.h > $$.tmp && mv $$.tmp atari/nfosmesa/osmesa_loadslb.c || { rm -f $$.tmp; false; } \
fi
gmake  all-recursive
gmake[2]: Entering directory '/wrkdirs/usr/ports/emulators/aranym/work/aranym-1.1.0'
Making all in src
gmake[3]: Entering directory '/wrkdirs/usr/ports/emulators/aranym/work/aranym-1.1.0/src'
Making all in uae_cpu
gmake[4]: Entering directory '/wrkdirs/usr/ports/emulators/aranym/work/aranym-1.1.0/src/uae_cpu'
depbase=`echo build68k.o | sed 's|[^/]*$|.deps/&|;s|\.o$||'`;\
cc -DHAVE_CONFIG_H -I. -I../..  -DOS_freebsd -DCPU_arm -D_GNU_SOURCE -DDIRECT_ADDRESSING -DARMV6_ASSEMBLY -DARM_ASSEMBLY -DOPTIMIZED_FLAGS -DFPU_IEEE -DENABLE_EXCLUSIVE_SPCFLAGS "-I./../include" "-I./../Unix" "-I./.." "-I." "-I."    -g -O2 -MT build68k.o -MD -MP -MF $depbase.Tpo -c -o build68k.o build68k.c &&\
mv -f $depbase.Tpo $depbase.Po
cc   -g -O2   -o build68k build68k.o  -lm
./build68k <./table68k > cpudefs.cpp
depbase=`echo gencpu.o | sed 's|[^/]*$|.deps/&|;s|\.o$||'`;\
cc -DHAVE_CONFIG_H -I. -I../..  -DOS_freebsd -DCPU_arm -D_GNU_SOURCE -DDIRECT_ADDRESSING -DARMV6_ASSEMBLY -DARM_ASSEMBLY -DOPTIMIZED_FLAGS -DFPU_IEEE -DENABLE_EXCLUSIVE_SPCFLAGS "-I./../include" "-I./../Unix" "-I./.." "-I." "-I."    -g -O2 -MT gencpu.o -MD -MP -MF $depbase.Tpo -c -o gencpu.o gencpu.c &&\
mv -f $depbase.Tpo $depbase.Po
depbase=`echo readcpu.o | sed 's|[^/]*$|.deps/&|;s|\.o$||'`;\
c++ -DHAVE_CONFIG_H -I. -I../..  -DOS_freebsd -DCPU_arm -D_GNU_SOURCE -DDIRECT_ADDRESSING -DARMV6_ASSEMBLY -DARM_ASSEMBLY -DOPTIMIZED_FLAGS -DFPU_IEEE -DENABLE_EXCLUSIVE_SPCFLAGS "-I./../include" "-I./../Unix" "-I./.." "-I." "-I."    -g -O2 -MT readcpu.o -MD -MP -MF $depbase.Tpo -c -o readcpu.o readcpu.cpp &&\
mv -f $depbase.Tpo $depbase.Po
depbase=`echo cpudefs.o | sed 's|[^/]*$|.deps/&|;s|\.o$||'`;\
c++ -DHAVE_CONFIG_H -I. -I../..  -DOS_freebsd -DCPU_arm -D_GNU_SOURCE -DDIRECT_ADDRESSING -DARMV6_ASSEMBLY -DARM_ASSEMBLY -DOPTIMIZED_FLAGS -DFPU_IEEE -DENABLE_EXCLUSIVE_SPCFLAGS "-I./../include" "-I./../Unix" "-I./.." "-I." "-I."    -g -O2 -MT cpudefs.o -MD -MP -MF $depbase.Tpo -c -o cpudefs.o cpudefs.cpp &&\
mv -f $depbase.Tpo $depbase.Po
c++   -g -O2   -o gencpu gencpu.o readcpu.o cpudefs.o  -lm
./gencpu
gmake  all-am
gmake[5]: Entering directory '/wrkdirs/usr/ports/emulators/aranym/work/aranym-1.1.0/src/uae_cpu'
gmake[5]: Nothing to be done for 'all-am'.
gmake[5]: Leaving directory '/wrkdirs/usr/ports/emulators/aranym/work/aranym-1.1.0/src/uae_cpu'
gmake[4]: Leaving directory '/wrkdirs/usr/ports/emulators/aranym/work/aranym-1.1.0/src/uae_cpu'
gmake[4]: Entering directory '/wrkdirs/usr/ports/emulators/aranym/work/aranym-1.1.0/src'
/nxb-bin/usr/bin/c++ -DHAVE_CONFIG_H -I. -I..  -DOS_freebsd -DCPU_arm -D_GNU_SOURCE -DDIRECT_ADDRESSING -DARMV6_ASSEMBLY -DARM_ASSEMBLY -DOPTIMIZED_FLAGS -DFPU_IEEE -DENABLE_EXCLUSIVE_SPCFLAGS -I./include -I./Unix -I. -I./natfeat -I./uae_cpu -I./uae_cpu  -I./gui-sdl -isystem /usr/local/include   -I/usr/local/include/SDL2 -I/usr/local/include -D_REENTRANT -D_THREAD_SAFE    -O3  -DARANYM_DATADIR="\"/usr/local/share/aranym\"" -MT uae_cpu/libaranym_a-cpudefsa.o -MD -MP -MF uae_cpu/.deps/libaranym_a-cpudefsa.Tpo -c -o uae_cpu/libaranym_a-cpudefsa.o `test -f 'uae_cpu/cpudefsa.cpp' || echo './'`uae_cpu/cpudefsa.cpp
mv -f uae_cpu/.deps/libaranym_a-cpudefsa.Tpo uae_cpu/.deps/libaranym_a-cpudefsa.Po
/nxb-bin/usr/bin/c++ -DHAVE_CONFIG_H -I. -I..  -DOS_freebsd -DCPU_arm -D_GNU_SOURCE -DDIRECT_ADDRESSING -DARMV6_ASSEMBLY -DARM_ASSEMBLY -DOPTIMIZED_FLAGS -DFPU_IEEE -DENABLE_EXCLUSIVE_SPCFLAGS -I./include -I./Unix -I. -I./natfeat -I./uae_cpu -I./uae_cpu  -I./gui-sdl -isystem /usr/local/include   -I/usr/local/include/SDL2 -I/usr/local/include -D_REENTRANT -D_THREAD_SAFE    -O3  -DARANYM_DATADIR="\"/usr/local/share/aranym\"" -MT uae_cpu/libaranym_a-cpustbla.o -MD -MP -MF uae_cpu/.deps/libaranym_a-cpustbla.Tpo -c -o uae_cpu/libaranym_a-cpustbla.o `test -f 'uae_cpu/cpustbla.cpp' || echo './'`uae_cpu/cpustbla.cpp
mv -f uae_cpu/.deps/libaranym_a-cpustbla.Tpo uae_cpu/.deps/libaranym_a-cpustbla.Po
/nxb-bin/usr/bin/c++ -DHAVE_CONFIG_H -I. -I..  -DOS_freebsd -DCPU_arm -D_GNU_SOURCE -DDIRECT_ADDRESSING -DARMV6_ASSEMBLY -DARM_ASSEMBLY -DOPTIMIZED_FLAGS -DFPU_IEEE -DENABLE_EXCLUSIVE_SPCFLAGS -I./include -I./Unix -I. -I./natfeat -I./uae_cpu -I./uae_cpu  -I./gui-sdl -isystem /usr/local/include   -I/usr/local/include/SDL2 -I/usr/local/include -D_REENTRANT -D_THREAD_SAFE    -O3  -DARANYM_DATADIR="\"/usr/local/share/aranym\"" -MT uae_cpu/libaranym_a-cpufunctbla.o -MD -MP -MF uae_cpu/.deps/libaranym_a-cpufunctbla.Tpo -c -o uae_cpu/libaranym_a-cpufunctbla.o `test -f 'uae_cpu/cpufunctbla.cpp' || echo './'`uae_cpu/cpufunctbla.cpp
mv -f uae_cpu/.deps/libaranym_a-cpufunctbla.Tpo uae_cpu/.deps/libaranym_a-cpufunctbla.Po
/nxb-bin/usr/bin/c++ -DHAVE_CONFIG_H -I. -I..  -DOS_freebsd -DCPU_arm -D_GNU_SOURCE -DDIRECT_ADDRESSING -DARMV6_ASSEMBLY -DARM_ASSEMBLY -DOPTIMIZED_FLAGS -DFPU_IEEE -DENABLE_EXCLUSIVE_SPCFLAGS -I./include -I./Unix -I. -I./natfeat -I./uae_cpu -I./uae_cpu  -I./gui-sdl -isystem /usr/local/include   -I/usr/local/include/SDL2 -I/usr/local/include -D_REENTRANT -D_THREAD_SAFE    -O3  -DARANYM_DATADIR="\"/usr/local/share/aranym\"" -MT uae_cpu/libaranym_a-cpuemu1.o -MD -MP -MF uae_cpu/.deps/libaranym_a-cpuemu1.Tpo -c -o uae_cpu/libaranym_a-cpuemu1.o `test -f 'uae_cpu/cpuemu1.cpp' || echo './'`uae_cpu/cpuemu1.cpp
In file included from uae_cpu/cpuemu1.cpp:2:
./uae_cpu/cpuemu.cpp:59:17: error: unsupported inline asm: input with type 'int8' (aka 'signed char') matching output with type 'uint32' (aka 'unsigned int')
        optflag_testb ((uae_s8)(src));
        ~~~~~~~~~~~~~~~^~~~~~~~~~~~~~
./uae_cpu/m68k.h:574:37: note: expanded from macro 'optflag_testb'
                        : [rv] "0" (v) \
                                    ^
In file included from uae_cpu/cpuemu1.cpp:2:
./uae_cpu/cpuemu.cpp:90:17: error: unsupported inline asm: input with type 'int8' (aka 'signed char') matching output with type 'uint32' (aka 'unsigned int')
        optflag_testb ((uae_s8)(src));
        ~~~~~~~~~~~~~~~^~~~~~~~~~~~~~
./uae_cpu/m68k.h:574:37: note: expanded from macro 'optflag_testb'
                        : [rv] "0" (v) \
                                    ^
In file included from uae_cpu/cpuemu1.cpp:2:
./uae_cpu/cpuemu.cpp:127:17: error: unsupported inline asm: input with type 'int8' (aka 'signed char') matching output with type 'uint32' (aka 'unsigned int')
        optflag_testb ((uae_s8)(src));
        ~~~~~~~~~~~~~~~^~~~~~~~~~~~~~
./uae_cpu/m68k.h:574:37: note: expanded from macro 'optflag_testb'
                        : [rv] "0" (v) \
                                    ^
In file included from uae_cpu/cpuemu1.cpp:2:
./uae_cpu/cpuemu.cpp:164:17: error: unsupported inline asm: input with type 'int8' (aka 'signed char') matching output with type 'uint32' (aka 'unsigned int')
        optflag_testb ((uae_s8)(src));
        ~~~~~~~~~~~~~~~^~~~~~~~~~~~~~
./uae_cpu/m68k.h:574:37: note: expanded from macro 'optflag_testb'
                        : [rv] "0" (v) \
                                    ^
In file included from uae_cpu/cpuemu1.cpp:2:
./uae_cpu/cpuemu.cpp:200:17: error: unsupported inline asm: input with type 'int8' (aka 'signed char') matching output with type 'uint32' (aka 'unsigned int')
        optflag_testb ((uae_s8)(src));
        ~~~~~~~~~~~~~~~^~~~~~~~~~~~~~
./uae_cpu/m68k.h:574:37: note: expanded from macro 'optflag_testb'
                        : [rv] "0" (v) \
                                    ^
In file included from uae_cpu/cpuemu1.cpp:2:
./uae_cpu/cpuemu.cpp:237:17: error: unsupported inline asm: input with type 'int8' (aka 'signed char') matching output with type 'uint32' (aka 'unsigned int')
        optflag_testb ((uae_s8)(src));
        ~~~~~~~~~~~~~~~^~~~~~~~~~~~~~
./uae_cpu/m68k.h:574:37: note: expanded from macro 'optflag_testb'
                        : [rv] "0" (v) \
                                    ^
In file included from uae_cpu/cpuemu1.cpp:2:
./uae_cpu/cpuemu.cpp:266:17: error: unsupported inline asm: input with type 'int8' (aka 'signed char') matching output with type 'uint32' (aka 'unsigned int')
        optflag_testb ((uae_s8)(src));
        ~~~~~~~~~~~~~~~^~~~~~~~~~~~~~
./uae_cpu/m68k.h:574:37: note: expanded from macro 'optflag_testb'
                        : [rv] "0" (v) \
                                    ^
In file included from uae_cpu/cpuemu1.cpp:2:
./uae_cpu/cpuemu.cpp:296:17: error: unsupported inline asm: input with type 'int8' (aka 'signed char') matching output with type 'uint32' (aka 'unsigned int')
        optflag_testb ((uae_s8)(src));
        ~~~~~~~~~~~~~~~^~~~~~~~~~~~~~
./uae_cpu/m68k.h:574:37: note: expanded from macro 'optflag_testb'
                        : [rv] "0" (v) \
                                    ^
In file included from uae_cpu/cpuemu1.cpp:2:
./uae_cpu/cpuemu.cpp:343:17: error: unsupported inline asm: input with type 'int16' (aka 'short') matching output with type 'uint32' (aka 'unsigned int')
        optflag_testw ((uae_s16)(src));
        ~~~~~~~~~~~~~~~^~~~~~~~~~~~~~~
./uae_cpu/m68k.h:564:37: note: expanded from macro 'optflag_testw'
                        : [rv] "0" (v) \
                                    ^
In file included from uae_cpu/cpuemu1.cpp:2:
./uae_cpu/cpuemu.cpp:374:17: error: unsupported inline asm: input with type 'int16' (aka 'short') matching output with type 'uint32' (aka 'unsigned int')
        optflag_testw ((uae_s16)(src));
        ~~~~~~~~~~~~~~~^~~~~~~~~~~~~~~
./uae_cpu/m68k.h:564:37: note: expanded from macro 'optflag_testw'
                        : [rv] "0" (v) \
                                    ^
In file included from uae_cpu/cpuemu1.cpp:2:
./uae_cpu/cpuemu.cpp:411:17: error: unsupported inline asm: input with type 'int16' (aka 'short') matching output with type 'uint32' (aka 'unsigned int')
        optflag_testw ((uae_s16)(src));
        ~~~~~~~~~~~~~~~^~~~~~~~~~~~~~~
./uae_cpu/m68k.h:564:37: note: expanded from macro 'optflag_testw'
                        : [rv] "0" (v) \
                                    ^
In file included from uae_cpu/cpuemu1.cpp:2:
./uae_cpu/cpuemu.cpp:448:17: error: unsupported inline asm: input with type 'int16' (aka 'short') matching output with type 'uint32' (aka 'unsigned int')
        optflag_testw ((uae_s16)(src));
        ~~~~~~~~~~~~~~~^~~~~~~~~~~~~~~
./uae_cpu/m68k.h:564:37: note: expanded from macro 'optflag_testw'
                        : [rv] "0" (v) \
                                    ^
In file included from uae_cpu/cpuemu1.cpp:2:
./uae_cpu/cpuemu.cpp:484:17: error: unsupported inline asm: input with type 'int16' (aka 'short') matching output with type 'uint32' (aka 'unsigned int')
        optflag_testw ((uae_s16)(src));
        ~~~~~~~~~~~~~~~^~~~~~~~~~~~~~~
./uae_cpu/m68k.h:564:37: note: expanded from macro 'optflag_testw'
                        : [rv] "0" (v) \
                                    ^
In file included from uae_cpu/cpuemu1.cpp:2:
./uae_cpu/cpuemu.cpp:521:17: error: unsupported inline asm: input with type 'int16' (aka 'short') matching output with type 'uint32' (aka 'unsigned int')
        optflag_testw ((uae_s16)(src));
        ~~~~~~~~~~~~~~~^~~~~~~~~~~~~~~
./uae_cpu/m68k.h:564:37: note: expanded from macro 'optflag_testw'
                        : [rv] "0" (v) \
                                    ^
In file included from uae_cpu/cpuemu1.cpp:2:
./uae_cpu/cpuemu.cpp:550:17: error: unsupported inline asm: input with type 'int16' (aka 'short') matching output with type 'uint32' (aka 'unsigned int')
        optflag_testw ((uae_s16)(src));
        ~~~~~~~~~~~~~~~^~~~~~~~~~~~~~~
./uae_cpu/m68k.h:564:37: note: expanded from macro 'optflag_testw'
                        : [rv] "0" (v) \
                                    ^
In file included from uae_cpu/cpuemu1.cpp:2:
./uae_cpu/cpuemu.cpp:580:17: error: unsupported inline asm: input with type 'int16' (aka 'short') matching output with type 'uint32' (aka 'unsigned int')
        optflag_testw ((uae_s16)(src));
        ~~~~~~~~~~~~~~~^~~~~~~~~~~~~~~
./uae_cpu/m68k.h:564:37: note: expanded from macro 'optflag_testw'
                        : [rv] "0" (v) \
                                    ^
In file included from uae_cpu/cpuemu1.cpp:2:
./uae_cpu/cpuemu.cpp:2474:17: error: unsupported inline asm: input with type 'int8' (aka 'signed char') matching output with type 'uint32' (aka 'unsigned int')
        optflag_testb ((uae_s8)(src));
        ~~~~~~~~~~~~~~~^~~~~~~~~~~~~~
./uae_cpu/m68k.h:574:37: note: expanded from macro 'optflag_testb'
                        : [rv] "0" (v) \
                                    ^
In file included from uae_cpu/cpuemu1.cpp:2:
./uae_cpu/cpuemu.cpp:2505:17: error: unsupported inline asm: input with type 'int8' (aka 'signed char') matching output with type 'uint32' (aka 'unsigned int')
        optflag_testb ((uae_s8)(src));
        ~~~~~~~~~~~~~~~^~~~~~~~~~~~~~
./uae_cpu/m68k.h:574:37: note: expanded from macro 'optflag_testb'
                        : [rv] "0" (v) \
                                    ^
In file included from uae_cpu/cpuemu1.cpp:2:
./uae_cpu/cpuemu.cpp:2542:17: error: unsupported inline asm: input with type 'int8' (aka 'signed char') matching output with type 'uint32' (aka 'unsigned int')
        optflag_testb ((uae_s8)(src));
        ~~~~~~~~~~~~~~~^~~~~~~~~~~~~~
./uae_cpu/m68k.h:574:37: note: expanded from macro 'optflag_testb'
                        : [rv] "0" (v) \
                                    ^
fatal error: too many errors emitted, stopping now [-ferror-limit=]
20 errors generated.
gmake[4]: *** [Makefile:1753: uae_cpu/libaranym_a-cpuemu1.o] Error 1
gmake[4]: Leaving directory '/wrkdirs/usr/ports/emulators/aranym/work/aranym-1.1.0/src'
gmake[3]: *** [Makefile:2139: all-recursive] Error 1
gmake[3]: Leaving directory '/wrkdirs/usr/ports/emulators/aranym/work/aranym-1.1.0/src'
gmake[2]: *** [Makefile:476: all-recursive] Error 1
gmake[2]: Leaving directory '/wrkdirs/usr/ports/emulators/aranym/work/aranym-1.1.0'
gmake[1]: *** [Makefile:416: all] Error 2
gmake[1]: Leaving directory '/wrkdirs/usr/ports/emulators/aranym/work/aranym-1.1.0'
*** Error code 1

Stop.
make: stopped in /usr/ports/emulators/aranym
Received on Tue Jul 27 2021 - 10:16:30 UTC

Original text of this message