[package - 122arm64-quarterly][devel/hs-threadscope] Failed for hs-threadscope-0.2.14_1 in build

From: <pkg-fallout_at_FreeBSD.org>
Date: Tue, 27 Jul 2021 09:56:22 GMT
You are receiving this mail as a port that you maintain
is failing to build on the FreeBSD package build server.
Please investigate the failure and submit a PR to fix
build.

Maintainer:     haskell_at_FreeBSD.org
Log URL:        http://ampere1.nyi.freebsd.org/data/122arm64-quarterly/861e2a11357f/logs/hs-threadscope-0.2.14_1.log
Build URL:      http://ampere1.nyi.freebsd.org/build.html?mastername=122arm64-quarterly&build=861e2a11357f
Log:

=>> Building devel/hs-threadscope
build started at Tue Jul 27 09:27:55 UTC 2021
port directory: /usr/ports/devel/hs-threadscope
package name: hs-threadscope-0.2.14_1
building for: FreeBSD 122arm64-quarterly-job-11 12.2-RELEASE FreeBSD 12.2-RELEASE arm64
maintained by: haskell_at_FreeBSD.org
Makefile ident: 
Poudriere version: 3.2.8-16-g00a37fcb
Host OSVERSION: 1400008
Jail OSVERSION: 1202000
Job Id: 11

---Begin Environment---
SHELL=/bin/csh
OSVERSION=1202000
UNAME_v=FreeBSD 12.2-RELEASE
UNAME_r=12.2-RELEASE
BLOCKSIZE=K
MAIL=/var/mail/root
STATUS=1
HOME=/root
PATH=/sbin:/bin:/usr/sbin:/usr/bin:/usr/local/sbin:/usr/local/bin:/root/bin
LOCALBASE=/usr/local
USER=root
LIBEXECPREFIX=/usr/local/libexec/poudriere
POUDRIERE_VERSION=3.2.8-16-g00a37fcb
MASTERMNT=/usr/local/poudriere/data/.m/122arm64-quarterly/ref
POUDRIERE_BUILD_TYPE=bulk
PACKAGE_BUILDING=yes
SAVED_TERM=
PWD=/usr/local/poudriere/data/.m/122arm64-quarterly/ref/.p/pool
P_PORTS_FEATURES=FLAVORS SELECTED_OPTIONS
MASTERNAME=122arm64-quarterly
SCRIPTPREFIX=/usr/local/share/poudriere
OLDPWD=/usr/local/poudriere/data/.m/122arm64-quarterly/ref/.p
SCRIPTPATH=/usr/local/share/poudriere/bulk.sh
POUDRIEREPATH=/usr/local/bin/poudriere
---End Environment---

---Begin Poudriere Port Flags/Env---
PORT_FLAGS=
PKGENV=
FLAVOR=
DEPENDS_ARGS=
MAKE_ARGS=
---End Poudriere Port Flags/Env---

---Begin OPTIONS List---
---End OPTIONS List---

--MAINTAINER--
haskell_at_FreeBSD.org
--End MAINTAINER--

--CONFIGURE_ARGS--

--End CONFIGURE_ARGS--

--CONFIGURE_ENV--
PKG_CONFIG=pkgconf XDG_DATA_HOME=/wrkdirs/usr/ports/devel/hs-threadscope/work  XDG_CONFIG_HOME=/wrkdirs/usr/ports/devel/hs-threadscope/work  HOME=/wrkdirs/usr/ports/devel/hs-threadscope/work TMPDIR="/tmp" PATH=/wrkdirs/usr/ports/devel/hs-threadscope/work/.bin:/sbin:/bin:/usr/sbin:/usr/bin:/usr/local/sbin:/usr/local/bin:/root/bin SHELL=/bin/sh CONFIG_SHELL=/bin/sh LANG=en_US.UTF-8 LC_ALL=en_US.UTF-8
--End CONFIGURE_ENV--

--MAKE_ENV--
XDG_DATA_HOME=/wrkdirs/usr/ports/devel/hs-threadscope/work  XDG_CONFIG_HOME=/wrkdirs/usr/ports/devel/hs-threadscope/work  HOME=/wrkdirs/usr/ports/devel/hs-threadscope/work TMPDIR="/tmp" PATH=/wrkdirs/usr/ports/devel/hs-threadscope/work/.bin:/sbin:/bin:/usr/sbin:/usr/bin:/usr/local/sbin:/usr/local/bin:/root/bin NO_PIE=yes MK_DEBUG_FILES=no MK_KERNEL_SYMBOLS=no SHELL=/bin/sh NO_LINT=YES LANG=en_US.UTF-8 LC_ALL=en_US.UTF-8 PREFIX=/usr/local  LOCALBASE=/usr/local  CC="cc" CFLAGS="-O2 -pipe  -fstack-protector-strong -fno-strict-aliasing "  CPP="cpp" CPPFLAGS=""  LDFLAGS=" -fstack-protector-strong " LIBS=""  CXX="c++" CXXFLAGS="-O2 -pipe -fstack-protector-strong -fno-strict-aliasing  "  MANPREFIX="/usr/local" BSD_INSTALL_PROGRAM="install  -s -m 555"  BSD_INSTALL_LIB="install  -s -m 0644"  BSD_INSTALL_SCRIPT="install  -m 555"  BSD_INSTALL_DATA="install  -m 0644"  BSD_INSTALL_MAN="install  -m 444"
--End MAKE_ENV--

--PLIST_SUB--
GTK2_VERSION="2.10.0"  GTK3_VERSION="3.0.0"  GTK4_VERSION="4.0.0" OSREL=12.2 PREFIX=%D LOCALBASE=/usr/local  RESETPREFIX=/usr/local LIB32DIR=lib DOCSDIR="share/doc/threadscope"  EXAMPLESDIR="share/examples/threadscope"  DATADIR="share/threadscope"  WWWDIR="www/threadscope"  ETCDIR="etc/threadscope"
--End PLIST_SUB--

--SUB_LIST--
PREFIX=/usr/local LOCALBASE=/usr/local  DATADIR=/usr/local/share/threadscope DOCSDIR=/usr/local/share/doc/threadscope EXAMPLESDIR=/usr/local/share/examples/threadscope  WWWDIR=/usr/local/www/threadscope ETCDIR=/usr/local/etc/threadscope
--End SUB_LIST--

---Begin make.conf---
USE_PACKAGE_DEPENDS=yes
BATCH=yes
WRKDIRPREFIX=/wrkdirs
PORTSDIR=/usr/ports
PACKAGES=/packages
DISTDIR=/distfiles
PACKAGE_BUILDING=yes
PACKAGE_BUILDING_FLAVORS=yes
#### /usr/local/etc/poudriere.d/make.conf ####
# XXX: We really need this but cannot use it while 'make checksum' does not
# try the next mirror on checksum failure.  It currently retries the same
# failed mirror and then fails rather then trying another.  It *does*
# try the next if the size is mismatched though.
#MASTER_SITE_FREEBSD=yes
# Build ALLOW_MAKE_JOBS_PACKAGES with 2 jobs
MAKE_JOBS_NUMBER=2
#### /usr/ports/Mk/Scripts/ports_env.sh ####
_CCVERSION_921dbbb2=FreeBSD clang version 10.0.1 (git_at_github.com:llvm/llvm-project.git llvmorg-10.0.1-0-gef32c611aa2) Target: aarch64-unknown-freebsd12.2 Thread model: posix InstalledDir: /usr/bin
_ALTCCVERSION_921dbbb2=none
_CXXINTERNAL_acaad9ca=FreeBSD clang version 10.0.1 (git_at_github.com:llvm/llvm-project.git llvmorg-10.0.1-0-gef32c611aa2) Target: aarch64-unknown-freebsd12.2 Thread model: posix InstalledDir: /usr/bin "/usr/bin/ld" "--eh-frame-hdr" "-dynamic-linker" "/libexec/ld-elf.so.1" "--enable-new-dtags" "-o" "a.out" "/usr/lib/crt1.o" "/usr/lib/crti.o" "/usr/lib/crtbegin.o" "-L/usr/lib" "/dev/null" "-lc++" "-lm" "-lgcc" "--as-needed" "-lgcc_s" "--no-as-needed" "-lc" "-lgcc" "--as-needed" "-lgcc_s" "--no-as-needed" "/usr/lib/crtend.o" "/usr/lib/crtn.o"
CC_OUTPUT_921dbbb2_58173849=yes
CC_OUTPUT_921dbbb2_9bdba57c=yes
CC_OUTPUT_921dbbb2_6a4fe7f5=yes
CC_OUTPUT_921dbbb2_6bcac02b=yes
CC_OUTPUT_921dbbb2_67d20829=yes
CC_OUTPUT_921dbbb2_bfa62e83=yes
CC_OUTPUT_921dbbb2_f0b4d593=yes
CC_OUTPUT_921dbbb2_308abb44=yes
CC_OUTPUT_921dbbb2_f00456e5=yes
CC_OUTPUT_921dbbb2_65ad290d=yes
CC_OUTPUT_921dbbb2_f2776b26=yes
CC_OUTPUT_921dbbb2_b2657cc3=yes
CC_OUTPUT_921dbbb2_380987f7=yes
CC_OUTPUT_921dbbb2_160933ec=yes
CC_OUTPUT_921dbbb2_fb62803b=yes
_OBJC_CCVERSION_921dbbb2=FreeBSD clang version 10.0.1 (git_at_github.com:llvm/llvm-project.git llvmorg-10.0.1-0-gef32c611aa2) Target: aarch64-unknown-freebsd12.2 Thread model: posix InstalledDir: /usr/bin
_OBJC_ALTCCVERSION_921dbbb2=none
ARCH=aarch64
OPSYS=FreeBSD
_OSRELEASE=12.2-RELEASE
OSREL=12.2
OSVERSION=1202000
PYTHONBASE=/usr/local
CONFIGURE_MAX_CMD_LEN=524288
HAVE_PORTS_ENV=1
#### Misc Poudriere ####
GID=0
UID=0
---End make.conf---
--Resource limits--
cpu time               (seconds, -t)  unlimited
file size           (512-blocks, -f)  unlimited
data seg size           (kbytes, -d)  1048576
stack size              (kbytes, -s)  1048576
core file size      (512-blocks, -c)  unlimited
max memory size         (kbytes, -m)  unlimited
locked memory           (kbytes, -l)  unlimited
max user processes              (-u)  89999
open files                      (-n)  1024
virtual mem size        (kbytes, -v)  unlimited
swap limit              (kbytes, -w)  unlimited
socket buffer size       (bytes, -b)  unlimited
pseudo-terminals                (-p)  unlimited
kqueues                         (-k)  unlimited
umtx shared locks               (-o)  unlimited
--End resource limits--
=======================<phase: check-sanity   >============================
===>  License BSD3CLAUSE accepted by the user
===========================================================================
=======================<phase: pkg-depends    >============================
===>   hs-threadscope-0.2.14_1 depends on file: /usr/local/sbin/pkg - not found
===>   Installing existing package /packages/All/pkg-1.16.3.txz
[122arm64-quarterly-job-11] Installing pkg-1.16.3...
[122arm64-quarterly-job-11] Extracting pkg-1.16.3: .......... done
===>   hs-threadscope-0.2.14_1 depends on file: /usr/local/sbin/pkg - found
===>   Returning to build of hs-threadscope-0.2.14_1
===========================================================================
=======================<phase: fetch-depends  >============================
===========================================================================
=======================<phase: fetch          >============================
===>  License BSD3CLAUSE accepted by the user
===> Fetching all distfiles required by hs-threadscope-0.2.14_1 for building
===========================================================================
=======================<phase: checksum       >============================
===>  License BSD3CLAUSE accepted by the user
===> Fetching all distfiles required by hs-threadscope-0.2.14_1 for building
=> SHA256 Checksum OK for cabal/threadscope-0.2.14.tar.gz.
=> SHA256 Checksum OK for cabal/alex-3.2.6/alex-3.2.6.tar.gz.
=> SHA256 Checksum OK for cabal/cairo-0.13.8.1/cairo-0.13.8.1.tar.gz.
=> SHA256 Checksum OK for cabal/exceptions-0.10.4/exceptions-0.10.4.tar.gz.
=> SHA256 Checksum OK for cabal/exceptions-0.10.4/revision/1.cabal.
=> SHA256 Checksum OK for cabal/file-embed-0.0.13.0/file-embed-0.0.13.0.tar.gz.
=> SHA256 Checksum OK for cabal/ghc-events-0.15.1/ghc-events-0.15.1.tar.gz.
=> SHA256 Checksum OK for cabal/glib-0.13.8.1/glib-0.13.8.1.tar.gz.
=> SHA256 Checksum OK for cabal/gtk-0.15.5/gtk-0.15.5.tar.gz.
=> SHA256 Checksum OK for cabal/gtk2hs-buildtools-0.13.8.0/gtk2hs-buildtools-0.13.8.0.tar.gz.
=> SHA256 Checksum OK for cabal/happy-1.20.0/happy-1.20.0.tar.gz.
=> SHA256 Checksum OK for cabal/hashable-1.3.1.0/hashable-1.3.1.0.tar.gz.
=> SHA256 Checksum OK for cabal/hashtables-1.2.4.1/hashtables-1.2.4.1.tar.gz.
=> SHA256 Checksum OK for cabal/pango-0.13.8.1/pango-0.13.8.1.tar.gz.
=> SHA256 Checksum OK for cabal/primitive-0.7.1.0/primitive-0.7.1.0.tar.gz.
=> SHA256 Checksum OK for cabal/primitive-0.7.1.0/revision/2.cabal.
=> SHA256 Checksum OK for cabal/random-1.2.0/random-1.2.0.tar.gz.
=> SHA256 Checksum OK for cabal/random-1.2.0/revision/5.cabal.
=> SHA256 Checksum OK for cabal/splitmix-0.1.0.3/splitmix-0.1.0.3.tar.gz.
=> SHA256 Checksum OK for cabal/temporary-1.3/temporary-1.3.tar.gz.
=> SHA256 Checksum OK for cabal/utf8-string-1.0.2/utf8-string-1.0.2.tar.gz.
=> SHA256 Checksum OK for cabal/vector-0.12.2.0/vector-0.12.2.0.tar.gz.
===========================================================================
=======================<phase: extract-depends>============================
===========================================================================
=======================<phase: extract        >============================
===>  License BSD3CLAUSE accepted by the user
===> Fetching all distfiles required by hs-threadscope-0.2.14_1 for building
===>  Extracting for hs-threadscope-0.2.14_1
=> SHA256 Checksum OK for cabal/threadscope-0.2.14.tar.gz.
=> SHA256 Checksum OK for cabal/alex-3.2.6/alex-3.2.6.tar.gz.
=> SHA256 Checksum OK for cabal/cairo-0.13.8.1/cairo-0.13.8.1.tar.gz.
=> SHA256 Checksum OK for cabal/exceptions-0.10.4/exceptions-0.10.4.tar.gz.
=> SHA256 Checksum OK for cabal/exceptions-0.10.4/revision/1.cabal.
=> SHA256 Checksum OK for cabal/file-embed-0.0.13.0/file-embed-0.0.13.0.tar.gz.
=> SHA256 Checksum OK for cabal/ghc-events-0.15.1/ghc-events-0.15.1.tar.gz.
=> SHA256 Checksum OK for cabal/glib-0.13.8.1/glib-0.13.8.1.tar.gz.
=> SHA256 Checksum OK for cabal/gtk-0.15.5/gtk-0.15.5.tar.gz.
<snip>
[16 of 19] Compiling ProduceGLRCode   ( src/ProduceGLRCode.lhs, /wrkdirs/usr/ports/devel/hs-threadscope/work/threadscope-0.2.14/dist-newstyle/build/aarch64-freebsd/ghc-8.10.5/happy-1.20.0/x/happy/build/happy/happy-tmp/ProduceGLRCode.o )
[ 2 of 13] Compiling Data.Primitive.Internal.Compat ( Data/Primitive/Internal/Compat.hs, /wrkdirs/usr/ports/devel/hs-threadscope/work/threadscope-0.2.14/dist-newstyle/build/aarch64-freebsd/ghc-8.10.5/primitive-0.7.1.0/build/Data/Primitive/Internal/Compat.o, /wrkdirs/usr/ports/devel/hs-threadscope/work/threadscope-0.2.14/dist-newstyle/build/aarch64-freebsd/ghc-8.10.5/primitive-0.7.1.0/build/Data/Primitive/Internal/Compat.dyn_o )
[ 3 of 13] Compiling Data.Primitive.Array ( Data/Primitive/Array.hs, /wrkdirs/usr/ports/devel/hs-threadscope/work/threadscope-0.2.14/dist-newstyle/build/aarch64-freebsd/ghc-8.10.5/primitive-0.7.1.0/build/Data/Primitive/Array.o, /wrkdirs/usr/ports/devel/hs-threadscope/work/threadscope-0.2.14/dist-newstyle/build/aarch64-freebsd/ghc-8.10.5/primitive-0.7.1.0/build/Data/Primitive/Array.dyn_o )
[17 of 19] Compiling Target           ( src/Target.lhs, /wrkdirs/usr/ports/devel/hs-threadscope/work/threadscope-0.2.14/dist-newstyle/build/aarch64-freebsd/ghc-8.10.5/happy-1.20.0/x/happy/build/happy/happy-tmp/Target.o )
[18 of 19] Compiling ProduceCode      ( src/ProduceCode.lhs, /wrkdirs/usr/ports/devel/hs-threadscope/work/threadscope-0.2.14/dist-newstyle/build/aarch64-freebsd/ghc-8.10.5/happy-1.20.0/x/happy/build/happy/happy-tmp/ProduceCode.o )
[ 4 of 13] Compiling Data.Primitive.MVar ( Data/Primitive/MVar.hs, /wrkdirs/usr/ports/devel/hs-threadscope/work/threadscope-0.2.14/dist-newstyle/build/aarch64-freebsd/ghc-8.10.5/primitive-0.7.1.0/build/Data/Primitive/MVar.o, /wrkdirs/usr/ports/devel/hs-threadscope/work/threadscope-0.2.14/dist-newstyle/build/aarch64-freebsd/ghc-8.10.5/primitive-0.7.1.0/build/Data/Primitive/MVar.dyn_o )
[ 5 of 13] Compiling Data.Primitive.MachDeps ( Data/Primitive/MachDeps.hs, /wrkdirs/usr/ports/devel/hs-threadscope/work/threadscope-0.2.14/dist-newstyle/build/aarch64-freebsd/ghc-8.10.5/primitive-0.7.1.0/build/Data/Primitive/MachDeps.o, /wrkdirs/usr/ports/devel/hs-threadscope/work/threadscope-0.2.14/dist-newstyle/build/aarch64-freebsd/ghc-8.10.5/primitive-0.7.1.0/build/Data/Primitive/MachDeps.dyn_o )
[ 6 of 13] Compiling Data.Primitive.Internal.Operations ( Data/Primitive/Internal/Operations.hs, /wrkdirs/usr/ports/devel/hs-threadscope/work/threadscope-0.2.14/dist-newstyle/build/aarch64-freebsd/ghc-8.10.5/primitive-0.7.1.0/build/Data/Primitive/Internal/Operations.o, /wrkdirs/usr/ports/devel/hs-threadscope/work/threadscope-0.2.14/dist-newstyle/build/aarch64-freebsd/ghc-8.10.5/primitive-0.7.1.0/build/Data/Primitive/Internal/Operations.dyn_o )
[ 7 of 13] Compiling Data.Primitive.MutVar ( Data/Primitive/MutVar.hs, /wrkdirs/usr/ports/devel/hs-threadscope/work/threadscope-0.2.14/dist-newstyle/build/aarch64-freebsd/ghc-8.10.5/primitive-0.7.1.0/build/Data/Primitive/MutVar.o, /wrkdirs/usr/ports/devel/hs-threadscope/work/threadscope-0.2.14/dist-newstyle/build/aarch64-freebsd/ghc-8.10.5/primitive-0.7.1.0/build/Data/Primitive/MutVar.dyn_o )
[ 8 of 13] Compiling Data.Primitive.SmallArray ( Data/Primitive/SmallArray.hs, /wrkdirs/usr/ports/devel/hs-threadscope/work/threadscope-0.2.14/dist-newstyle/build/aarch64-freebsd/ghc-8.10.5/primitive-0.7.1.0/build/Data/Primitive/SmallArray.o, /wrkdirs/usr/ports/devel/hs-threadscope/work/threadscope-0.2.14/dist-newstyle/build/aarch64-freebsd/ghc-8.10.5/primitive-0.7.1.0/build/Data/Primitive/SmallArray.dyn_o )
[19 of 19] Compiling Main             ( src/Main.lhs, /wrkdirs/usr/ports/devel/hs-threadscope/work/threadscope-0.2.14/dist-newstyle/build/aarch64-freebsd/ghc-8.10.5/happy-1.20.0/x/happy/build/happy/happy-tmp/Main.o )
[ 9 of 13] Compiling Data.Primitive.Types ( Data/Primitive/Types.hs, /wrkdirs/usr/ports/devel/hs-threadscope/work/threadscope-0.2.14/dist-newstyle/build/aarch64-freebsd/ghc-8.10.5/primitive-0.7.1.0/build/Data/Primitive/Types.o, /wrkdirs/usr/ports/devel/hs-threadscope/work/threadscope-0.2.14/dist-newstyle/build/aarch64-freebsd/ghc-8.10.5/primitive-0.7.1.0/build/Data/Primitive/Types.dyn_o )
Linking /wrkdirs/usr/ports/devel/hs-threadscope/work/threadscope-0.2.14/dist-newstyle/build/aarch64-freebsd/ghc-8.10.5/happy-1.20.0/x/happy/build/happy/happy ...
Configuring library for splitmix-0.1.0.3..
Preprocessing library for splitmix-0.1.0.3..
Building library for splitmix-0.1.0.3..
[1 of 4] Compiling Data.Bits.Compat ( src-compat/Data/Bits/Compat.hs, /wrkdirs/usr/ports/devel/hs-threadscope/work/threadscope-0.2.14/dist-newstyle/build/aarch64-freebsd/ghc-8.10.5/splitmix-0.1.0.3/build/Data/Bits/Compat.o, /wrkdirs/usr/ports/devel/hs-threadscope/work/threadscope-0.2.14/dist-newstyle/build/aarch64-freebsd/ghc-8.10.5/splitmix-0.1.0.3/build/Data/Bits/Compat.dyn_o )
[2 of 4] Compiling System.Random.SplitMix.Init ( src/System/Random/SplitMix/Init.hs, /wrkdirs/usr/ports/devel/hs-threadscope/work/threadscope-0.2.14/dist-newstyle/build/aarch64-freebsd/ghc-8.10.5/splitmix-0.1.0.3/build/System/Random/SplitMix/Init.o, /wrkdirs/usr/ports/devel/hs-threadscope/work/threadscope-0.2.14/dist-newstyle/build/aarch64-freebsd/ghc-8.10.5/splitmix-0.1.0.3/build/System/Random/SplitMix/Init.dyn_o )
[3 of 4] Compiling System.Random.SplitMix ( src/System/Random/SplitMix.hs, /wrkdirs/usr/ports/devel/hs-threadscope/work/threadscope-0.2.14/dist-newstyle/build/aarch64-freebsd/ghc-8.10.5/splitmix-0.1.0.3/build/System/Random/SplitMix.o, /wrkdirs/usr/ports/devel/hs-threadscope/work/threadscope-0.2.14/dist-newstyle/build/aarch64-freebsd/ghc-8.10.5/splitmix-0.1.0.3/build/System/Random/SplitMix.dyn_o )
[10 of 13] Compiling Data.Primitive.ByteArray ( Data/Primitive/ByteArray.hs, /wrkdirs/usr/ports/devel/hs-threadscope/work/threadscope-0.2.14/dist-newstyle/build/aarch64-freebsd/ghc-8.10.5/primitive-0.7.1.0/build/Data/Primitive/ByteArray.o, /wrkdirs/usr/ports/devel/hs-threadscope/work/threadscope-0.2.14/dist-newstyle/build/aarch64-freebsd/ghc-8.10.5/primitive-0.7.1.0/build/Data/Primitive/ByteArray.dyn_o )
[4 of 4] Compiling System.Random.SplitMix32 ( src/System/Random/SplitMix32.hs, /wrkdirs/usr/ports/devel/hs-threadscope/work/threadscope-0.2.14/dist-newstyle/build/aarch64-freebsd/ghc-8.10.5/splitmix-0.1.0.3/build/System/Random/SplitMix32.o, /wrkdirs/usr/ports/devel/hs-threadscope/work/threadscope-0.2.14/dist-newstyle/build/aarch64-freebsd/ghc-8.10.5/splitmix-0.1.0.3/build/System/Random/SplitMix32.dyn_o )
Configuring library for utf8-string-1.0.2..
[11 of 13] Compiling Data.Primitive.PrimArray ( Data/Primitive/PrimArray.hs, /wrkdirs/usr/ports/devel/hs-threadscope/work/threadscope-0.2.14/dist-newstyle/build/aarch64-freebsd/ghc-8.10.5/primitive-0.7.1.0/build/Data/Primitive/PrimArray.o, /wrkdirs/usr/ports/devel/hs-threadscope/work/threadscope-0.2.14/dist-newstyle/build/aarch64-freebsd/ghc-8.10.5/primitive-0.7.1.0/build/Data/Primitive/PrimArray.dyn_o )
Preprocessing library for utf8-string-1.0.2..
Building library for utf8-string-1.0.2..
[1 of 5] Compiling Codec.Binary.UTF8.String ( Codec/Binary/UTF8/String.hs, /wrkdirs/usr/ports/devel/hs-threadscope/work/threadscope-0.2.14/dist-newstyle/build/aarch64-freebsd/ghc-8.10.5/utf8-string-1.0.2/build/Codec/Binary/UTF8/String.o, /wrkdirs/usr/ports/devel/hs-threadscope/work/threadscope-0.2.14/dist-newstyle/build/aarch64-freebsd/ghc-8.10.5/utf8-string-1.0.2/build/Codec/Binary/UTF8/String.dyn_o )
[2 of 5] Compiling Codec.Binary.UTF8.Generic ( Codec/Binary/UTF8/Generic.hs, /wrkdirs/usr/ports/devel/hs-threadscope/work/threadscope-0.2.14/dist-newstyle/build/aarch64-freebsd/ghc-8.10.5/utf8-string-1.0.2/build/Codec/Binary/UTF8/Generic.o, /wrkdirs/usr/ports/devel/hs-threadscope/work/threadscope-0.2.14/dist-newstyle/build/aarch64-freebsd/ghc-8.10.5/utf8-string-1.0.2/build/Codec/Binary/UTF8/Generic.dyn_o )
[3 of 5] Compiling Data.ByteString.Lazy.UTF8 ( Data/ByteString/Lazy/UTF8.hs, /wrkdirs/usr/ports/devel/hs-threadscope/work/threadscope-0.2.14/dist-newstyle/build/aarch64-freebsd/ghc-8.10.5/utf8-string-1.0.2/build/Data/ByteString/Lazy/UTF8.o, /wrkdirs/usr/ports/devel/hs-threadscope/work/threadscope-0.2.14/dist-newstyle/build/aarch64-freebsd/ghc-8.10.5/utf8-string-1.0.2/build/Data/ByteString/Lazy/UTF8.dyn_o )
[12 of 13] Compiling Data.Primitive.Ptr ( Data/Primitive/Ptr.hs, /wrkdirs/usr/ports/devel/hs-threadscope/work/threadscope-0.2.14/dist-newstyle/build/aarch64-freebsd/ghc-8.10.5/primitive-0.7.1.0/build/Data/Primitive/Ptr.o, /wrkdirs/usr/ports/devel/hs-threadscope/work/threadscope-0.2.14/dist-newstyle/build/aarch64-freebsd/ghc-8.10.5/primitive-0.7.1.0/build/Data/Primitive/Ptr.dyn_o )
[13 of 13] Compiling Data.Primitive   ( Data/Primitive.hs, /wrkdirs/usr/ports/devel/hs-threadscope/work/threadscope-0.2.14/dist-newstyle/build/aarch64-freebsd/ghc-8.10.5/primitive-0.7.1.0/build/Data/Primitive.o, /wrkdirs/usr/ports/devel/hs-threadscope/work/threadscope-0.2.14/dist-newstyle/build/aarch64-freebsd/ghc-8.10.5/primitive-0.7.1.0/build/Data/Primitive.dyn_o )
Configuring library for random-1.2.0..
Preprocessing library for random-1.2.0..
Building library for random-1.2.0..
[1 of 3] Compiling System.Random.Internal ( src/System/Random/Internal.hs, /wrkdirs/usr/ports/devel/hs-threadscope/work/threadscope-0.2.14/dist-newstyle/build/aarch64-freebsd/ghc-8.10.5/random-1.2.0/build/System/Random/Internal.o, /wrkdirs/usr/ports/devel/hs-threadscope/work/threadscope-0.2.14/dist-newstyle/build/aarch64-freebsd/ghc-8.10.5/random-1.2.0/build/System/Random/Internal.dyn_o )
[4 of 5] Compiling Data.ByteString.UTF8 ( Data/ByteString/UTF8.hs, /wrkdirs/usr/ports/devel/hs-threadscope/work/threadscope-0.2.14/dist-newstyle/build/aarch64-freebsd/ghc-8.10.5/utf8-string-1.0.2/build/Data/ByteString/UTF8.o, /wrkdirs/usr/ports/devel/hs-threadscope/work/threadscope-0.2.14/dist-newstyle/build/aarch64-freebsd/ghc-8.10.5/utf8-string-1.0.2/build/Data/ByteString/UTF8.dyn_o )
[5 of 5] Compiling Data.String.UTF8 ( Data/String/UTF8.hs, /wrkdirs/usr/ports/devel/hs-threadscope/work/threadscope-0.2.14/dist-newstyle/build/aarch64-freebsd/ghc-8.10.5/utf8-string-1.0.2/build/Data/String/UTF8.o, /wrkdirs/usr/ports/devel/hs-threadscope/work/threadscope-0.2.14/dist-newstyle/build/aarch64-freebsd/ghc-8.10.5/utf8-string-1.0.2/build/Data/String/UTF8.dyn_o )
Configuring library for vector-0.12.2.0..
Preprocessing library for vector-0.12.2.0..
Building library for vector-0.12.2.0..
[ 1 of 21] Compiling Data.Vector.Fusion.Util ( Data/Vector/Fusion/Util.hs, /wrkdirs/usr/ports/devel/hs-threadscope/work/threadscope-0.2.14/dist-newstyle/build/aarch64-freebsd/ghc-8.10.5/vector-0.12.2.0/build/Data/Vector/Fusion/Util.o, /wrkdirs/usr/ports/devel/hs-threadscope/work/threadscope-0.2.14/dist-newstyle/build/aarch64-freebsd/ghc-8.10.5/vector-0.12.2.0/build/Data/Vector/Fusion/Util.dyn_o )
[ 2 of 21] Compiling Data.Vector.Fusion.Bundle.Size ( Data/Vector/Fusion/Bundle/Size.hs, /wrkdirs/usr/ports/devel/hs-threadscope/work/threadscope-0.2.14/dist-newstyle/build/aarch64-freebsd/ghc-8.10.5/vector-0.12.2.0/build/Data/Vector/Fusion/Bundle/Size.o, /wrkdirs/usr/ports/devel/hs-threadscope/work/threadscope-0.2.14/dist-newstyle/build/aarch64-freebsd/ghc-8.10.5/vector-0.12.2.0/build/Data/Vector/Fusion/Bundle/Size.dyn_o )
[ 3 of 21] Compiling Data.Vector.Generic.Mutable.Base ( Data/Vector/Generic/Mutable/Base.hs, /wrkdirs/usr/ports/devel/hs-threadscope/work/threadscope-0.2.14/dist-newstyle/build/aarch64-freebsd/ghc-8.10.5/vector-0.12.2.0/build/Data/Vector/Generic/Mutable/Base.o, /wrkdirs/usr/ports/devel/hs-threadscope/work/threadscope-0.2.14/dist-newstyle/build/aarch64-freebsd/ghc-8.10.5/vector-0.12.2.0/build/Data/Vector/Generic/Mutable/Base.dyn_o )
[ 4 of 21] Compiling Data.Vector.Generic.Base ( Data/Vector/Generic/Base.hs, /wrkdirs/usr/ports/devel/hs-threadscope/work/threadscope-0.2.14/dist-newstyle/build/aarch64-freebsd/ghc-8.10.5/vector-0.12.2.0/build/Data/Vector/Generic/Base.o, /wrkdirs/usr/ports/devel/hs-threadscope/work/threadscope-0.2.14/dist-newstyle/build/aarch64-freebsd/ghc-8.10.5/vector-0.12.2.0/build/Data/Vector/Generic/Base.dyn_o )
[ 5 of 21] Compiling Data.Vector.Internal.Check ( Data/Vector/Internal/Check.hs, /wrkdirs/usr/ports/devel/hs-threadscope/work/threadscope-0.2.14/dist-newstyle/build/aarch64-freebsd/ghc-8.10.5/vector-0.12.2.0/build/Data/Vector/Internal/Check.o, /wrkdirs/usr/ports/devel/hs-threadscope/work/threadscope-0.2.14/dist-newstyle/build/aarch64-freebsd/ghc-8.10.5/vector-0.12.2.0/build/Data/Vector/Internal/Check.dyn_o )
[ 6 of 21] Compiling Data.Vector.Fusion.Stream.Monadic ( Data/Vector/Fusion/Stream/Monadic.hs, /wrkdirs/usr/ports/devel/hs-threadscope/work/threadscope-0.2.14/dist-newstyle/build/aarch64-freebsd/ghc-8.10.5/vector-0.12.2.0/build/Data/Vector/Fusion/Stream/Monadic.o, /wrkdirs/usr/ports/devel/hs-threadscope/work/threadscope-0.2.14/dist-newstyle/build/aarch64-freebsd/ghc-8.10.5/vector-0.12.2.0/build/Data/Vector/Fusion/Stream/Monadic.dyn_o )
[2 of 3] Compiling System.Random    ( src/System/Random.hs, /wrkdirs/usr/ports/devel/hs-threadscope/work/threadscope-0.2.14/dist-newstyle/build/aarch64-freebsd/ghc-8.10.5/random-1.2.0/build/System/Random.o, /wrkdirs/usr/ports/devel/hs-threadscope/work/threadscope-0.2.14/dist-newstyle/build/aarch64-freebsd/ghc-8.10.5/random-1.2.0/build/System/Random.dyn_o )
[3 of 3] Compiling System.Random.Stateful ( src/System/Random/Stateful.hs, /wrkdirs/usr/ports/devel/hs-threadscope/work/threadscope-0.2.14/dist-newstyle/build/aarch64-freebsd/ghc-8.10.5/random-1.2.0/build/System/Random/Stateful.o, /wrkdirs/usr/ports/devel/hs-threadscope/work/threadscope-0.2.14/dist-newstyle/build/aarch64-freebsd/ghc-8.10.5/random-1.2.0/build/System/Random/Stateful.dyn_o )
[ 7 of 21] Compiling Data.Vector.Fusion.Bundle.Monadic ( Data/Vector/Fusion/Bundle/Monadic.hs, /wrkdirs/usr/ports/devel/hs-threadscope/work/threadscope-0.2.14/dist-newstyle/build/aarch64-freebsd/ghc-8.10.5/vector-0.12.2.0/build/Data/Vector/Fusion/Bundle/Monadic.o, /wrkdirs/usr/ports/devel/hs-threadscope/work/threadscope-0.2.14/dist-newstyle/build/aarch64-freebsd/ghc-8.10.5/vector-0.12.2.0/build/Data/Vector/Fusion/Bundle/Monadic.dyn_o )
Configuring library for temporary-1.3..
Preprocessing library for temporary-1.3..
Building library for temporary-1.3..
[1 of 1] Compiling System.IO.Temp   ( System/IO/Temp.hs, /wrkdirs/usr/ports/devel/hs-threadscope/work/threadscope-0.2.14/dist-newstyle/build/aarch64-freebsd/ghc-8.10.5/temporary-1.3/build/System/IO/Temp.o, /wrkdirs/usr/ports/devel/hs-threadscope/work/threadscope-0.2.14/dist-newstyle/build/aarch64-freebsd/ghc-8.10.5/temporary-1.3/build/System/IO/Temp.dyn_o )
[ 8 of 21] Compiling Data.Vector.Fusion.Bundle ( Data/Vector/Fusion/Bundle.hs, /wrkdirs/usr/ports/devel/hs-threadscope/work/threadscope-0.2.14/dist-newstyle/build/aarch64-freebsd/ghc-8.10.5/vector-0.12.2.0/build/Data/Vector/Fusion/Bundle.o, /wrkdirs/usr/ports/devel/hs-threadscope/work/threadscope-0.2.14/dist-newstyle/build/aarch64-freebsd/ghc-8.10.5/vector-0.12.2.0/build/Data/Vector/Fusion/Bundle.dyn_o )
[ 9 of 21] Compiling Data.Vector.Generic.Mutable ( Data/Vector/Generic/Mutable.hs, /wrkdirs/usr/ports/devel/hs-threadscope/work/threadscope-0.2.14/dist-newstyle/build/aarch64-freebsd/ghc-8.10.5/vector-0.12.2.0/build/Data/Vector/Generic/Mutable.o, /wrkdirs/usr/ports/devel/hs-threadscope/work/threadscope-0.2.14/dist-newstyle/build/aarch64-freebsd/ghc-8.10.5/vector-0.12.2.0/build/Data/Vector/Generic/Mutable.dyn_o )
[10 of 21] Compiling Data.Vector.Generic.New ( Data/Vector/Generic/New.hs, /wrkdirs/usr/ports/devel/hs-threadscope/work/threadscope-0.2.14/dist-newstyle/build/aarch64-freebsd/ghc-8.10.5/vector-0.12.2.0/build/Data/Vector/Generic/New.o, /wrkdirs/usr/ports/devel/hs-threadscope/work/threadscope-0.2.14/dist-newstyle/build/aarch64-freebsd/ghc-8.10.5/vector-0.12.2.0/build/Data/Vector/Generic/New.dyn_o )
[11 of 21] Compiling Data.Vector.Generic ( Data/Vector/Generic.hs, /wrkdirs/usr/ports/devel/hs-threadscope/work/threadscope-0.2.14/dist-newstyle/build/aarch64-freebsd/ghc-8.10.5/vector-0.12.2.0/build/Data/Vector/Generic.o, /wrkdirs/usr/ports/devel/hs-threadscope/work/threadscope-0.2.14/dist-newstyle/build/aarch64-freebsd/ghc-8.10.5/vector-0.12.2.0/build/Data/Vector/Generic.dyn_o )
[12 of 21] Compiling Data.Vector.Mutable ( Data/Vector/Mutable.hs, /wrkdirs/usr/ports/devel/hs-threadscope/work/threadscope-0.2.14/dist-newstyle/build/aarch64-freebsd/ghc-8.10.5/vector-0.12.2.0/build/Data/Vector/Mutable.o, /wrkdirs/usr/ports/devel/hs-threadscope/work/threadscope-0.2.14/dist-newstyle/build/aarch64-freebsd/ghc-8.10.5/vector-0.12.2.0/build/Data/Vector/Mutable.dyn_o )
[13 of 21] Compiling Data.Vector      ( Data/Vector.hs, /wrkdirs/usr/ports/devel/hs-threadscope/work/threadscope-0.2.14/dist-newstyle/build/aarch64-freebsd/ghc-8.10.5/vector-0.12.2.0/build/Data/Vector.o, /wrkdirs/usr/ports/devel/hs-threadscope/work/threadscope-0.2.14/dist-newstyle/build/aarch64-freebsd/ghc-8.10.5/vector-0.12.2.0/build/Data/Vector.dyn_o )
[14 of 21] Compiling Data.Vector.Primitive.Mutable ( Data/Vector/Primitive/Mutable.hs, /wrkdirs/usr/ports/devel/hs-threadscope/work/threadscope-0.2.14/dist-newstyle/build/aarch64-freebsd/ghc-8.10.5/vector-0.12.2.0/build/Data/Vector/Primitive/Mutable.o, /wrkdirs/usr/ports/devel/hs-threadscope/work/threadscope-0.2.14/dist-newstyle/build/aarch64-freebsd/ghc-8.10.5/vector-0.12.2.0/build/Data/Vector/Primitive/Mutable.dyn_o )
[15 of 21] Compiling Data.Vector.Primitive ( Data/Vector/Primitive.hs, /wrkdirs/usr/ports/devel/hs-threadscope/work/threadscope-0.2.14/dist-newstyle/build/aarch64-freebsd/ghc-8.10.5/vector-0.12.2.0/build/Data/Vector/Primitive.o, /wrkdirs/usr/ports/devel/hs-threadscope/work/threadscope-0.2.14/dist-newstyle/build/aarch64-freebsd/ghc-8.10.5/vector-0.12.2.0/build/Data/Vector/Primitive.dyn_o )
[16 of 21] Compiling Data.Vector.Storable.Internal ( Data/Vector/Storable/Internal.hs, /wrkdirs/usr/ports/devel/hs-threadscope/work/threadscope-0.2.14/dist-newstyle/build/aarch64-freebsd/ghc-8.10.5/vector-0.12.2.0/build/Data/Vector/Storable/Internal.o, /wrkdirs/usr/ports/devel/hs-threadscope/work/threadscope-0.2.14/dist-newstyle/build/aarch64-freebsd/ghc-8.10.5/vector-0.12.2.0/build/Data/Vector/Storable/Internal.dyn_o )
[17 of 21] Compiling Data.Vector.Storable.Mutable ( Data/Vector/Storable/Mutable.hs, /wrkdirs/usr/ports/devel/hs-threadscope/work/threadscope-0.2.14/dist-newstyle/build/aarch64-freebsd/ghc-8.10.5/vector-0.12.2.0/build/Data/Vector/Storable/Mutable.o, /wrkdirs/usr/ports/devel/hs-threadscope/work/threadscope-0.2.14/dist-newstyle/build/aarch64-freebsd/ghc-8.10.5/vector-0.12.2.0/build/Data/Vector/Storable/Mutable.dyn_o )
[18 of 21] Compiling Data.Vector.Storable ( Data/Vector/Storable.hs, /wrkdirs/usr/ports/devel/hs-threadscope/work/threadscope-0.2.14/dist-newstyle/build/aarch64-freebsd/ghc-8.10.5/vector-0.12.2.0/build/Data/Vector/Storable.o, /wrkdirs/usr/ports/devel/hs-threadscope/work/threadscope-0.2.14/dist-newstyle/build/aarch64-freebsd/ghc-8.10.5/vector-0.12.2.0/build/Data/Vector/Storable.dyn_o )
[19 of 21] Compiling Data.Vector.Unboxed.Base ( Data/Vector/Unboxed/Base.hs, /wrkdirs/usr/ports/devel/hs-threadscope/work/threadscope-0.2.14/dist-newstyle/build/aarch64-freebsd/ghc-8.10.5/vector-0.12.2.0/build/Data/Vector/Unboxed/Base.o, /wrkdirs/usr/ports/devel/hs-threadscope/work/threadscope-0.2.14/dist-newstyle/build/aarch64-freebsd/ghc-8.10.5/vector-0.12.2.0/build/Data/Vector/Unboxed/Base.dyn_o )
[20 of 21] Compiling Data.Vector.Unboxed ( Data/Vector/Unboxed.hs, /wrkdirs/usr/ports/devel/hs-threadscope/work/threadscope-0.2.14/dist-newstyle/build/aarch64-freebsd/ghc-8.10.5/vector-0.12.2.0/build/Data/Vector/Unboxed.o, /wrkdirs/usr/ports/devel/hs-threadscope/work/threadscope-0.2.14/dist-newstyle/build/aarch64-freebsd/ghc-8.10.5/vector-0.12.2.0/build/Data/Vector/Unboxed.dyn_o )
[21 of 21] Compiling Data.Vector.Unboxed.Mutable ( Data/Vector/Unboxed/Mutable.hs, /wrkdirs/usr/ports/devel/hs-threadscope/work/threadscope-0.2.14/dist-newstyle/build/aarch64-freebsd/ghc-8.10.5/vector-0.12.2.0/build/Data/Vector/Unboxed/Mutable.o, /wrkdirs/usr/ports/devel/hs-threadscope/work/threadscope-0.2.14/dist-newstyle/build/aarch64-freebsd/ghc-8.10.5/vector-0.12.2.0/build/Data/Vector/Unboxed/Mutable.dyn_o )
Configuring library for ghc-events-0.15.1..
Configuring library for hashtables-1.2.4.1..
Preprocessing library for hashtables-1.2.4.1..
Preprocessing library for ghc-events-0.15.1..
Building library for ghc-events-0.15.1..
Building library for hashtables-1.2.4.1..
[ 1 of 10] Compiling GHC.RTS.EventTypes ( src/GHC/RTS/EventTypes.hs, /wrkdirs/usr/ports/devel/hs-threadscope/work/threadscope-0.2.14/dist-newstyle/build/aarch64-freebsd/ghc-8.10.5/ghc-events-0.15.1/build/GHC/RTS/EventTypes.o, /wrkdirs/usr/ports/devel/hs-threadscope/work/threadscope-0.2.14/dist-newstyle/build/aarch64-freebsd/ghc-8.10.5/ghc-events-0.15.1/build/GHC/RTS/EventTypes.dyn_o )
[ 1 of 12] Compiling Data.HashTable.Class ( src/Data/HashTable/Class.hs, /wrkdirs/usr/ports/devel/hs-threadscope/work/threadscope-0.2.14/dist-newstyle/build/aarch64-freebsd/ghc-8.10.5/hashtables-1.2.4.1/build/Data/HashTable/Class.o, /wrkdirs/usr/ports/devel/hs-threadscope/work/threadscope-0.2.14/dist-newstyle/build/aarch64-freebsd/ghc-8.10.5/hashtables-1.2.4.1/build/Data/HashTable/Class.dyn_o )

src/Data/HashTable/Class.hs:54:1: warning: [-Wunused-imports]
    The import of ‘Data.Word’ is redundant
      except perhaps to import instances from ‘Data.Word’
    To import instances alone, use: import Data.Word()
   |
54 | import           Data.Word           (Word)
   | ^^^^^^^^^^^^^^^^^^^^^^^^^^^^^^^^^^^^^^^^^^^
[ 2 of 12] Compiling Data.HashTable.Internal.Array ( src/Data/HashTable/Internal/Array.hs, /wrkdirs/usr/ports/devel/hs-threadscope/work/threadscope-0.2.14/dist-newstyle/build/aarch64-freebsd/ghc-8.10.5/hashtables-1.2.4.1/build/Data/HashTable/Internal/Array.o, /wrkdirs/usr/ports/devel/hs-threadscope/work/threadscope-0.2.14/dist-newstyle/build/aarch64-freebsd/ghc-8.10.5/hashtables-1.2.4.1/build/Data/HashTable/Internal/Array.dyn_o )
[ 3 of 12] Compiling Data.HashTable.Internal.IntArray ( src/Data/HashTable/Internal/IntArray.hs, /wrkdirs/usr/ports/devel/hs-threadscope/work/threadscope-0.2.14/dist-newstyle/build/aarch64-freebsd/ghc-8.10.5/hashtables-1.2.4.1/build/Data/HashTable/Internal/IntArray.o, /wrkdirs/usr/ports/devel/hs-threadscope/work/threadscope-0.2.14/dist-newstyle/build/aarch64-freebsd/ghc-8.10.5/hashtables-1.2.4.1/build/Data/HashTable/Internal/IntArray.dyn_o )
[ 4 of 12] Compiling Data.HashTable.Internal.UnsafeTricks ( src/Data/HashTable/Internal/UnsafeTricks.hs, /wrkdirs/usr/ports/devel/hs-threadscope/work/threadscope-0.2.14/dist-newstyle/build/aarch64-freebsd/ghc-8.10.5/hashtables-1.2.4.1/build/Data/HashTable/Internal/UnsafeTricks.o, /wrkdirs/usr/ports/devel/hs-threadscope/work/threadscope-0.2.14/dist-newstyle/build/aarch64-freebsd/ghc-8.10.5/hashtables-1.2.4.1/build/Data/HashTable/Internal/UnsafeTricks.dyn_o )
[ 5 of 12] Compiling Data.HashTable.Internal.Linear.Bucket ( src/Data/HashTable/Internal/Linear/Bucket.hs, /wrkdirs/usr/ports/devel/hs-threadscope/work/threadscope-0.2.14/dist-newstyle/build/aarch64-freebsd/ghc-8.10.5/hashtables-1.2.4.1/build/Data/HashTable/Internal/Linear/Bucket.o, /wrkdirs/usr/ports/devel/hs-threadscope/work/threadscope-0.2.14/dist-newstyle/build/aarch64-freebsd/ghc-8.10.5/hashtables-1.2.4.1/build/Data/HashTable/Internal/Linear/Bucket.dyn_o )
[ 6 of 12] Compiling Data.HashTable.Internal.Utils ( src/Data/HashTable/Internal/Utils.hs, /wrkdirs/usr/ports/devel/hs-threadscope/work/threadscope-0.2.14/dist-newstyle/build/aarch64-freebsd/ghc-8.10.5/hashtables-1.2.4.1/build/Data/HashTable/Internal/Utils.o, /wrkdirs/usr/ports/devel/hs-threadscope/work/threadscope-0.2.14/dist-newstyle/build/aarch64-freebsd/ghc-8.10.5/hashtables-1.2.4.1/build/Data/HashTable/Internal/Utils.dyn_o )
[ 7 of 12] Compiling Data.HashTable.Internal.CheapPseudoRandomBitStream ( src/Data/HashTable/Internal/CheapPseudoRandomBitStream.hs, /wrkdirs/usr/ports/devel/hs-threadscope/work/threadscope-0.2.14/dist-newstyle/build/aarch64-freebsd/ghc-8.10.5/hashtables-1.2.4.1/build/Data/HashTable/Internal/CheapPseudoRandomBitStream.o, /wrkdirs/usr/ports/devel/hs-threadscope/work/threadscope-0.2.14/dist-newstyle/build/aarch64-freebsd/ghc-8.10.5/hashtables-1.2.4.1/build/Data/HashTable/Internal/CheapPseudoRandomBitStream.dyn_o )
[ 8 of 12] Compiling Data.HashTable.Internal.CacheLine ( src/Data/HashTable/Internal/CacheLine.hs, /wrkdirs/usr/ports/devel/hs-threadscope/work/threadscope-0.2.14/dist-newstyle/build/aarch64-freebsd/ghc-8.10.5/hashtables-1.2.4.1/build/Data/HashTable/Internal/CacheLine.o, /wrkdirs/usr/ports/devel/hs-threadscope/work/threadscope-0.2.14/dist-newstyle/build/aarch64-freebsd/ghc-8.10.5/hashtables-1.2.4.1/build/Data/HashTable/Internal/CacheLine.dyn_o )
[ 9 of 12] Compiling Data.HashTable.ST.Basic ( src/Data/HashTable/ST/Basic.hs, /wrkdirs/usr/ports/devel/hs-threadscope/work/threadscope-0.2.14/dist-newstyle/build/aarch64-freebsd/ghc-8.10.5/hashtables-1.2.4.1/build/Data/HashTable/ST/Basic.o, /wrkdirs/usr/ports/devel/hs-threadscope/work/threadscope-0.2.14/dist-newstyle/build/aarch64-freebsd/ghc-8.10.5/hashtables-1.2.4.1/build/Data/HashTable/ST/Basic.dyn_o )
[10 of 12] Compiling Data.HashTable.ST.Cuckoo ( src/Data/HashTable/ST/Cuckoo.hs, /wrkdirs/usr/ports/devel/hs-threadscope/work/threadscope-0.2.14/dist-newstyle/build/aarch64-freebsd/ghc-8.10.5/hashtables-1.2.4.1/build/Data/HashTable/ST/Cuckoo.o, /wrkdirs/usr/ports/devel/hs-threadscope/work/threadscope-0.2.14/dist-newstyle/build/aarch64-freebsd/ghc-8.10.5/hashtables-1.2.4.1/build/Data/HashTable/ST/Cuckoo.dyn_o )
[11 of 12] Compiling Data.HashTable.ST.Linear ( src/Data/HashTable/ST/Linear.hs, /wrkdirs/usr/ports/devel/hs-threadscope/work/threadscope-0.2.14/dist-newstyle/build/aarch64-freebsd/ghc-8.10.5/hashtables-1.2.4.1/build/Data/HashTable/ST/Linear.o, /wrkdirs/usr/ports/devel/hs-threadscope/work/threadscope-0.2.14/dist-newstyle/build/aarch64-freebsd/ghc-8.10.5/hashtables-1.2.4.1/build/Data/HashTable/ST/Linear.dyn_o )
[12 of 12] Compiling Data.HashTable.IO ( src/Data/HashTable/IO.hs, /wrkdirs/usr/ports/devel/hs-threadscope/work/threadscope-0.2.14/dist-newstyle/build/aarch64-freebsd/ghc-8.10.5/hashtables-1.2.4.1/build/Data/HashTable/IO.o, /wrkdirs/usr/ports/devel/hs-threadscope/work/threadscope-0.2.14/dist-newstyle/build/aarch64-freebsd/ghc-8.10.5/hashtables-1.2.4.1/build/Data/HashTable/IO.dyn_o )
[ 2 of 10] Compiling GHC.RTS.EventParserUtils ( src/GHC/RTS/EventParserUtils.hs, /wrkdirs/usr/ports/devel/hs-threadscope/work/threadscope-0.2.14/dist-newstyle/build/aarch64-freebsd/ghc-8.10.5/ghc-events-0.15.1/build/GHC/RTS/EventParserUtils.o, /wrkdirs/usr/ports/devel/hs-threadscope/work/threadscope-0.2.14/dist-newstyle/build/aarch64-freebsd/ghc-8.10.5/ghc-events-0.15.1/build/GHC/RTS/EventParserUtils.dyn_o )
Configuring library for gtk2hs-buildtools-0.13.8.0..
Preprocessing library for gtk2hs-buildtools-0.13.8.0..
[ 3 of 10] Compiling GHC.RTS.Events.Binary ( src/GHC/RTS/Events/Binary.hs, /wrkdirs/usr/ports/devel/hs-threadscope/work/threadscope-0.2.14/dist-newstyle/build/aarch64-freebsd/ghc-8.10.5/ghc-events-0.15.1/build/GHC/RTS/Events/Binary.o, /wrkdirs/usr/ports/devel/hs-threadscope/work/threadscope-0.2.14/dist-newstyle/build/aarch64-freebsd/ghc-8.10.5/ghc-events-0.15.1/build/GHC/RTS/Events/Binary.dyn_o )
Building library for gtk2hs-buildtools-0.13.8.0..
[ 1 of 46] Compiling BaseVersion      ( c2hs/base/admin/BaseVersion.hs, /wrkdirs/usr/ports/devel/hs-threadscope/work/threadscope-0.2.14/dist-newstyle/build/aarch64-freebsd/ghc-8.10.5/gtk2hs-buildtools-0.13.8.0/build/BaseVersion.o, /wrkdirs/usr/ports/devel/hs-threadscope/work/threadscope-0.2.14/dist-newstyle/build/aarch64-freebsd/ghc-8.10.5/gtk2hs-buildtools-0.13.8.0/build/BaseVersion.dyn_o )
[ 2 of 46] Compiling C2HSConfig       ( c2hs/toplevel/C2HSConfig.hs, /wrkdirs/usr/ports/devel/hs-threadscope/work/threadscope-0.2.14/dist-newstyle/build/aarch64-freebsd/ghc-8.10.5/gtk2hs-buildtools-0.13.8.0/build/C2HSConfig.o, /wrkdirs/usr/ports/devel/hs-threadscope/work/threadscope-0.2.14/dist-newstyle/build/aarch64-freebsd/ghc-8.10.5/gtk2hs-buildtools-0.13.8.0/build/C2HSConfig.dyn_o )
[ 3 of 46] Compiling CInfo            ( c2hs/gen/CInfo.hs, /wrkdirs/usr/ports/devel/hs-threadscope/work/threadscope-0.2.14/dist-newstyle/build/aarch64-freebsd/ghc-8.10.5/gtk2hs-buildtools-0.13.8.0/build/CInfo.o, /wrkdirs/usr/ports/devel/hs-threadscope/work/threadscope-0.2.14/dist-newstyle/build/aarch64-freebsd/ghc-8.10.5/gtk2hs-buildtools-0.13.8.0/build/CInfo.dyn_o )
[ 4 of 46] Compiling Config           ( c2hs/base/admin/Config.hs, /wrkdirs/usr/ports/devel/hs-threadscope/work/threadscope-0.2.14/dist-newstyle/build/aarch64-freebsd/ghc-8.10.5/gtk2hs-buildtools-0.13.8.0/build/Config.o, /wrkdirs/usr/ports/devel/hs-threadscope/work/threadscope-0.2.14/dist-newstyle/build/aarch64-freebsd/ghc-8.10.5/gtk2hs-buildtools-0.13.8.0/build/Config.dyn_o )
[ 5 of 46] Compiling DLists           ( c2hs/base/general/DLists.hs, /wrkdirs/usr/ports/devel/hs-threadscope/work/threadscope-0.2.14/dist-newstyle/build/aarch64-freebsd/ghc-8.10.5/gtk2hs-buildtools-0.13.8.0/build/DLists.o, /wrkdirs/usr/ports/devel/hs-threadscope/work/threadscope-0.2.14/dist-newstyle/build/aarch64-freebsd/ghc-8.10.5/gtk2hs-buildtools-0.13.8.0/build/DLists.dyn_o )
[ 6 of 46] Compiling FNameOps         ( c2hs/base/general/FNameOps.hs, /wrkdirs/usr/ports/devel/hs-threadscope/work/threadscope-0.2.14/dist-newstyle/build/aarch64-freebsd/ghc-8.10.5/gtk2hs-buildtools-0.13.8.0/build/FNameOps.o, /wrkdirs/usr/ports/devel/hs-threadscope/work/threadscope-0.2.14/dist-newstyle/build/aarch64-freebsd/ghc-8.10.5/gtk2hs-buildtools-0.13.8.0/build/FNameOps.dyn_o )
[ 7 of 46] Compiling FastMutInt       ( c2hs/base/general/FastMutInt.hs, /wrkdirs/usr/ports/devel/hs-threadscope/work/threadscope-0.2.14/dist-newstyle/build/aarch64-freebsd/ghc-8.10.5/gtk2hs-buildtools-0.13.8.0/build/FastMutInt.o, /wrkdirs/usr/ports/devel/hs-threadscope/work/threadscope-0.2.14/dist-newstyle/build/aarch64-freebsd/ghc-8.10.5/gtk2hs-buildtools-0.13.8.0/build/FastMutInt.dyn_o )
[ 8 of 46] Compiling FileOps          ( c2hs/base/general/FileOps.hs, /wrkdirs/usr/ports/devel/hs-threadscope/work/threadscope-0.2.14/dist-newstyle/build/aarch64-freebsd/ghc-8.10.5/gtk2hs-buildtools-0.13.8.0/build/FileOps.o, /wrkdirs/usr/ports/devel/hs-threadscope/work/threadscope-0.2.14/dist-newstyle/build/aarch64-freebsd/ghc-8.10.5/gtk2hs-buildtools-0.13.8.0/build/FileOps.dyn_o )
[ 9 of 46] Compiling Map              ( c2hs/base/general/Map.hs, /wrkdirs/usr/ports/devel/hs-threadscope/work/threadscope-0.2.14/dist-newstyle/build/aarch64-freebsd/ghc-8.10.5/gtk2hs-buildtools-0.13.8.0/build/Map.o, /wrkdirs/usr/ports/devel/hs-threadscope/work/threadscope-0.2.14/dist-newstyle/build/aarch64-freebsd/ghc-8.10.5/gtk2hs-buildtools-0.13.8.0/build/Map.dyn_o )
[10 of 46] Compiling Binary           ( c2hs/base/general/Binary.hs, /wrkdirs/usr/ports/devel/hs-threadscope/work/threadscope-0.2.14/dist-newstyle/build/aarch64-freebsd/ghc-8.10.5/gtk2hs-buildtools-0.13.8.0/build/Binary.o, /wrkdirs/usr/ports/devel/hs-threadscope/work/threadscope-0.2.14/dist-newstyle/build/aarch64-freebsd/ghc-8.10.5/gtk2hs-buildtools-0.13.8.0/build/Binary.dyn_o )
[11 of 46] Compiling Paths_gtk2hs_buildtools ( /wrkdirs/usr/ports/devel/hs-threadscope/work/threadscope-0.2.14/dist-newstyle/build/aarch64-freebsd/ghc-8.10.5/gtk2hs-buildtools-0.13.8.0/build/autogen/Paths_gtk2hs_buildtools.hs, /wrkdirs/usr/ports/devel/hs-threadscope/work/threadscope-0.2.14/dist-newstyle/build/aarch64-freebsd/ghc-8.10.5/gtk2hs-buildtools-0.13.8.0/build/Paths_gtk2hs_buildtools.o, /wrkdirs/usr/ports/devel/hs-threadscope/work/threadscope-0.2.14/dist-newstyle/build/aarch64-freebsd/ghc-8.10.5/gtk2hs-buildtools-0.13.8.0/build/Paths_gtk2hs_buildtools.dyn_o )
[12 of 46] Compiling HookGenerator    ( callbackGen/HookGenerator.hs, /wrkdirs/usr/ports/devel/hs-threadscope/work/threadscope-0.2.14/dist-newstyle/build/aarch64-freebsd/ghc-8.10.5/gtk2hs-buildtools-0.13.8.0/build/HookGenerator.o, /wrkdirs/usr/ports/devel/hs-threadscope/work/threadscope-0.2.14/dist-newstyle/build/aarch64-freebsd/ghc-8.10.5/gtk2hs-buildtools-0.13.8.0/build/HookGenerator.dyn_o )
[13 of 46] Compiling Position         ( c2hs/base/general/Position.hs, /wrkdirs/usr/ports/devel/hs-threadscope/work/threadscope-0.2.14/dist-newstyle/build/aarch64-freebsd/ghc-8.10.5/gtk2hs-buildtools-0.13.8.0/build/Position.o, /wrkdirs/usr/ports/devel/hs-threadscope/work/threadscope-0.2.14/dist-newstyle/build/aarch64-freebsd/ghc-8.10.5/gtk2hs-buildtools-0.13.8.0/build/Position.dyn_o )
[14 of 46] Compiling Errors           ( c2hs/base/errors/Errors.hs, /wrkdirs/usr/ports/devel/hs-threadscope/work/threadscope-0.2.14/dist-newstyle/build/aarch64-freebsd/ghc-8.10.5/gtk2hs-buildtools-0.13.8.0/build/Errors.o, /wrkdirs/usr/ports/devel/hs-threadscope/work/threadscope-0.2.14/dist-newstyle/build/aarch64-freebsd/ghc-8.10.5/gtk2hs-buildtools-0.13.8.0/build/Errors.dyn_o )
[15 of 46] Compiling Lexers           ( c2hs/base/syntax/Lexers.hs, /wrkdirs/usr/ports/devel/hs-threadscope/work/threadscope-0.2.14/dist-newstyle/build/aarch64-freebsd/ghc-8.10.5/gtk2hs-buildtools-0.13.8.0/build/Lexers.o, /wrkdirs/usr/ports/devel/hs-threadscope/work/threadscope-0.2.14/dist-newstyle/build/aarch64-freebsd/ghc-8.10.5/gtk2hs-buildtools-0.13.8.0/build/Lexers.dyn_o )

c2hs/base/syntax/Lexers.hs:133:1: warning: [-Wtabs]
    Tab character found here, and in 172 further locations.
    Please use spaces instead.
    |
133 |                lexactionErr, lexmeta, (>|<), (>||<), ctrlChars, ctrlLexer,
    | ^^^^^^^^
[16 of 46] Compiling Set              ( c2hs/base/general/Set.hs, /wrkdirs/usr/ports/devel/hs-threadscope/work/threadscope-0.2.14/dist-newstyle/build/aarch64-freebsd/ghc-8.10.5/gtk2hs-buildtools-0.13.8.0/build/Set.o, /wrkdirs/usr/ports/devel/hs-threadscope/work/threadscope-0.2.14/dist-newstyle/build/aarch64-freebsd/ghc-8.10.5/gtk2hs-buildtools-0.13.8.0/build/Set.dyn_o )
[17 of 46] Compiling StateTrans       ( c2hs/base/state/StateTrans.hs, /wrkdirs/usr/ports/devel/hs-threadscope/work/threadscope-0.2.14/dist-newstyle/build/aarch64-freebsd/ghc-8.10.5/gtk2hs-buildtools-0.13.8.0/build/StateTrans.o, /wrkdirs/usr/ports/devel/hs-threadscope/work/threadscope-0.2.14/dist-newstyle/build/aarch64-freebsd/ghc-8.10.5/gtk2hs-buildtools-0.13.8.0/build/StateTrans.dyn_o )
[18 of 46] Compiling Switches         ( c2hs/state/Switches.hs, /wrkdirs/usr/ports/devel/hs-threadscope/work/threadscope-0.2.14/dist-newstyle/build/aarch64-freebsd/ghc-8.10.5/gtk2hs-buildtools-0.13.8.0/build/Switches.o, /wrkdirs/usr/ports/devel/hs-threadscope/work/threadscope-0.2.14/dist-newstyle/build/aarch64-freebsd/ghc-8.10.5/gtk2hs-buildtools-0.13.8.0/build/Switches.dyn_o )
[19 of 46] Compiling TypeGen          ( hierarchyGen/TypeGen.hs, /wrkdirs/usr/ports/devel/hs-threadscope/work/threadscope-0.2.14/dist-newstyle/build/aarch64-freebsd/ghc-8.10.5/gtk2hs-buildtools-0.13.8.0/build/TypeGen.o, /wrkdirs/usr/ports/devel/hs-threadscope/work/threadscope-0.2.14/dist-newstyle/build/aarch64-freebsd/ghc-8.10.5/gtk2hs-buildtools-0.13.8.0/build/TypeGen.dyn_o )
[20 of 46] Compiling UNames           ( c2hs/base/general/UNames.hs, /wrkdirs/usr/ports/devel/hs-threadscope/work/threadscope-0.2.14/dist-newstyle/build/aarch64-freebsd/ghc-8.10.5/gtk2hs-buildtools-0.13.8.0/build/UNames.o, /wrkdirs/usr/ports/devel/hs-threadscope/work/threadscope-0.2.14/dist-newstyle/build/aarch64-freebsd/ghc-8.10.5/gtk2hs-buildtools-0.13.8.0/build/UNames.dyn_o )
[21 of 46] Compiling StateBase        ( c2hs/base/state/StateBase.hs, /wrkdirs/usr/ports/devel/hs-threadscope/work/threadscope-0.2.14/dist-newstyle/build/aarch64-freebsd/ghc-8.10.5/gtk2hs-buildtools-0.13.8.0/build/StateBase.o, /wrkdirs/usr/ports/devel/hs-threadscope/work/threadscope-0.2.14/dist-newstyle/build/aarch64-freebsd/ghc-8.10.5/gtk2hs-buildtools-0.13.8.0/build/StateBase.dyn_o )
[22 of 46] Compiling CIO              ( c2hs/base/state/CIO.hs, /wrkdirs/usr/ports/devel/hs-threadscope/work/threadscope-0.2.14/dist-newstyle/build/aarch64-freebsd/ghc-8.10.5/gtk2hs-buildtools-0.13.8.0/build/CIO.o, /wrkdirs/usr/ports/devel/hs-threadscope/work/threadscope-0.2.14/dist-newstyle/build/aarch64-freebsd/ghc-8.10.5/gtk2hs-buildtools-0.13.8.0/build/CIO.dyn_o )

c2hs/base/state/CIO.hs:77:1: warning: [-Wdeprecations]
    Module ‘System.Cmd’ is deprecated: Use "System.Process" instead
   |
77 | import System.Cmd
   | ^^^^^^^^^^^^^^^^^
[23 of 46] Compiling State            ( c2hs/base/state/State.hs, /wrkdirs/usr/ports/devel/hs-threadscope/work/threadscope-0.2.14/dist-newstyle/build/aarch64-freebsd/ghc-8.10.5/gtk2hs-buildtools-0.13.8.0/build/State.o, /wrkdirs/usr/ports/devel/hs-threadscope/work/threadscope-0.2.14/dist-newstyle/build/aarch64-freebsd/ghc-8.10.5/gtk2hs-buildtools-0.13.8.0/build/State.dyn_o )
[24 of 46] Compiling C2HSState        ( c2hs/state/C2HSState.hs, /wrkdirs/usr/ports/devel/hs-threadscope/work/threadscope-0.2.14/dist-newstyle/build/aarch64-freebsd/ghc-8.10.5/gtk2hs-buildtools-0.13.8.0/build/C2HSState.o, /wrkdirs/usr/ports/devel/hs-threadscope/work/threadscope-0.2.14/dist-newstyle/build/aarch64-freebsd/ghc-8.10.5/gtk2hs-buildtools-0.13.8.0/build/C2HSState.dyn_o )
[ 4 of 10] Compiling GHC.RTS.Events.Incremental ( src/GHC/RTS/Events/Incremental.hs, /wrkdirs/usr/ports/devel/hs-threadscope/work/threadscope-0.2.14/dist-newstyle/build/aarch64-freebsd/ghc-8.10.5/ghc-events-0.15.1/build/GHC/RTS/Events/Incremental.o, /wrkdirs/usr/ports/devel/hs-threadscope/work/threadscope-0.2.14/dist-newstyle/build/aarch64-freebsd/ghc-8.10.5/ghc-events-0.15.1/build/GHC/RTS/Events/Incremental.dyn_o )
[25 of 46] Compiling Attributes       ( c2hs/base/syms/Attributes.hs, /wrkdirs/usr/ports/devel/hs-threadscope/work/threadscope-0.2.14/dist-newstyle/build/aarch64-freebsd/ghc-8.10.5/gtk2hs-buildtools-0.13.8.0/build/Attributes.o, /wrkdirs/usr/ports/devel/hs-threadscope/work/threadscope-0.2.14/dist-newstyle/build/aarch64-freebsd/ghc-8.10.5/gtk2hs-buildtools-0.13.8.0/build/Attributes.dyn_o )
[ 5 of 10] Compiling GHC.RTS.Events   ( src/GHC/RTS/Events.hs, /wrkdirs/usr/ports/devel/hs-threadscope/work/threadscope-0.2.14/dist-newstyle/build/aarch64-freebsd/ghc-8.10.5/ghc-events-0.15.1/build/GHC/RTS/Events.o, /wrkdirs/usr/ports/devel/hs-threadscope/work/threadscope-0.2.14/dist-newstyle/build/aarch64-freebsd/ghc-8.10.5/ghc-events-0.15.1/build/GHC/RTS/Events.dyn_o )
[26 of 46] Compiling Idents           ( c2hs/base/syms/Idents.hs, /wrkdirs/usr/ports/devel/hs-threadscope/work/threadscope-0.2.14/dist-newstyle/build/aarch64-freebsd/ghc-8.10.5/gtk2hs-buildtools-0.13.8.0/build/Idents.o, /wrkdirs/usr/ports/devel/hs-threadscope/work/threadscope-0.2.14/dist-newstyle/build/aarch64-freebsd/ghc-8.10.5/gtk2hs-buildtools-0.13.8.0/build/Idents.dyn_o )
[27 of 46] Compiling NameSpaces       ( c2hs/base/syms/NameSpaces.hs, /wrkdirs/usr/ports/devel/hs-threadscope/work/threadscope-0.2.14/dist-newstyle/build/aarch64-freebsd/ghc-8.10.5/gtk2hs-buildtools-0.13.8.0/build/NameSpaces.o, /wrkdirs/usr/ports/devel/hs-threadscope/work/threadscope-0.2.14/dist-newstyle/build/aarch64-freebsd/ghc-8.10.5/gtk2hs-buildtools-0.13.8.0/build/NameSpaces.dyn_o )
[28 of 46] Compiling CTokens          ( c2hs/c/CTokens.hs, /wrkdirs/usr/ports/devel/hs-threadscope/work/threadscope-0.2.14/dist-newstyle/build/aarch64-freebsd/ghc-8.10.5/gtk2hs-buildtools-0.13.8.0/build/CTokens.o, /wrkdirs/usr/ports/devel/hs-threadscope/work/threadscope-0.2.14/dist-newstyle/build/aarch64-freebsd/ghc-8.10.5/gtk2hs-buildtools-0.13.8.0/build/CTokens.dyn_o )
[29 of 46] Compiling CParserMonad     ( c2hs/c/CParserMonad.hs, /wrkdirs/usr/ports/devel/hs-threadscope/work/threadscope-0.2.14/dist-newstyle/build/aarch64-freebsd/ghc-8.10.5/gtk2hs-buildtools-0.13.8.0/build/CParserMonad.o, /wrkdirs/usr/ports/devel/hs-threadscope/work/threadscope-0.2.14/dist-newstyle/build/aarch64-freebsd/ghc-8.10.5/gtk2hs-buildtools-0.13.8.0/build/CParserMonad.dyn_o )
[30 of 46] Compiling CLexer           ( /wrkdirs/usr/ports/devel/hs-threadscope/work/threadscope-0.2.14/dist-newstyle/build/aarch64-freebsd/ghc-8.10.5/gtk2hs-buildtools-0.13.8.0/build/CLexer.hs, /wrkdirs/usr/ports/devel/hs-threadscope/work/threadscope-0.2.14/dist-newstyle/build/aarch64-freebsd/ghc-8.10.5/gtk2hs-buildtools-0.13.8.0/build/CLexer.o, /wrkdirs/usr/ports/devel/hs-threadscope/work/threadscope-0.2.14/dist-newstyle/build/aarch64-freebsd/ghc-8.10.5/gtk2hs-buildtools-0.13.8.0/build/CLexer.dyn_o )

c2hs/c/CLexer.x:75:14: warning: [-Wtabs]
    Tab character found here, and in 226 further locations.
    Please use spaces instead.
   |
75 | import UNames    (Name)
   |              ^^^
[31 of 46] Compiling CHSLexer         ( c2hs/chs/CHSLexer.hs, /wrkdirs/usr/ports/devel/hs-threadscope/work/threadscope-0.2.14/dist-newstyle/build/aarch64-freebsd/ghc-8.10.5/gtk2hs-buildtools-0.13.8.0/build/CHSLexer.o, /wrkdirs/usr/ports/devel/hs-threadscope/work/threadscope-0.2.14/dist-newstyle/build/aarch64-freebsd/ghc-8.10.5/gtk2hs-buildtools-0.13.8.0/build/CHSLexer.dyn_o )
[32 of 46] Compiling CHS              ( c2hs/chs/CHS.hs, /wrkdirs/usr/ports/devel/hs-threadscope/work/threadscope-0.2.14/dist-newstyle/build/aarch64-freebsd/ghc-8.10.5/gtk2hs-buildtools-0.13.8.0/build/CHS.o, /wrkdirs/usr/ports/devel/hs-threadscope/work/threadscope-0.2.14/dist-newstyle/build/aarch64-freebsd/ghc-8.10.5/gtk2hs-buildtools-0.13.8.0/build/CHS.dyn_o )
[33 of 46] Compiling GenHeader        ( c2hs/gen/GenHeader.hs, /wrkdirs/usr/ports/devel/hs-threadscope/work/threadscope-0.2.14/dist-newstyle/build/aarch64-freebsd/ghc-8.10.5/gtk2hs-buildtools-0.13.8.0/build/GenHeader.o, /wrkdirs/usr/ports/devel/hs-threadscope/work/threadscope-0.2.14/dist-newstyle/build/aarch64-freebsd/ghc-8.10.5/gtk2hs-buildtools-0.13.8.0/build/GenHeader.dyn_o )
[ 6 of 10] Compiling GHC.RTS.Events.Analysis ( src/GHC/RTS/Events/Analysis.hs, /wrkdirs/usr/ports/devel/hs-threadscope/work/threadscope-0.2.14/dist-newstyle/build/aarch64-freebsd/ghc-8.10.5/ghc-events-0.15.1/build/GHC/RTS/Events/Analysis.o, /wrkdirs/usr/ports/devel/hs-threadscope/work/threadscope-0.2.14/dist-newstyle/build/aarch64-freebsd/ghc-8.10.5/ghc-events-0.15.1/build/GHC/RTS/Events/Analysis.dyn_o )
[34 of 46] Compiling CAST             ( c2hs/c/CAST.hs, /wrkdirs/usr/ports/devel/hs-threadscope/work/threadscope-0.2.14/dist-newstyle/build/aarch64-freebsd/ghc-8.10.5/gtk2hs-buildtools-0.13.8.0/build/CAST.o, /wrkdirs/usr/ports/devel/hs-threadscope/work/threadscope-0.2.14/dist-newstyle/build/aarch64-freebsd/ghc-8.10.5/gtk2hs-buildtools-0.13.8.0/build/CAST.dyn_o )
[ 7 of 10] Compiling GHC.RTS.Events.Analysis.Thread ( src/GHC/RTS/Events/Analysis/Thread.hs, /wrkdirs/usr/ports/devel/hs-threadscope/work/threadscope-0.2.14/dist-newstyle/build/aarch64-freebsd/ghc-8.10.5/ghc-events-0.15.1/build/GHC/RTS/Events/Analysis/Thread.o, /wrkdirs/usr/ports/devel/hs-threadscope/work/threadscope-0.2.14/dist-newstyle/build/aarch64-freebsd/ghc-8.10.5/ghc-events-0.15.1/build/GHC/RTS/Events/Analysis/Thread.dyn_o )
[ 8 of 10] Compiling GHC.RTS.Events.Analysis.SparkThread ( src/GHC/RTS/Events/Analysis/SparkThread.hs, /wrkdirs/usr/ports/devel/hs-threadscope/work/threadscope-0.2.14/dist-newstyle/build/aarch64-freebsd/ghc-8.10.5/ghc-events-0.15.1/build/GHC/RTS/Events/Analysis/SparkThread.o, /wrkdirs/usr/ports/devel/hs-threadscope/work/threadscope-0.2.14/dist-newstyle/build/aarch64-freebsd/ghc-8.10.5/ghc-events-0.15.1/build/GHC/RTS/Events/Analysis/SparkThread.dyn_o )

src/GHC/RTS/Events/Analysis/SparkThread.hs:94:5: warning: [-Wunused-local-binds]
    Defined but not used: ‘stopThread’
   |
94 |     stopThread threadId = Just (M.filter (/= threadId) m, S.delete threadId s)
   |     ^^^^^^^^^^
[ 9 of 10] Compiling GHC.RTS.Events.Analysis.Capability ( src/GHC/RTS/Events/Analysis/Capability.hs, /wrkdirs/usr/ports/devel/hs-threadscope/work/threadscope-0.2.14/dist-newstyle/build/aarch64-freebsd/ghc-8.10.5/ghc-events-0.15.1/build/GHC/RTS/Events/Analysis/Capability.o, /wrkdirs/usr/ports/devel/hs-threadscope/work/threadscope-0.2.14/dist-newstyle/build/aarch64-freebsd/ghc-8.10.5/ghc-events-0.15.1/build/GHC/RTS/Events/Analysis/Capability.dyn_o )
[10 of 10] Compiling GHC.RTS.Events.Merge ( src/GHC/RTS/Events/Merge.hs, /wrkdirs/usr/ports/devel/hs-threadscope/work/threadscope-0.2.14/dist-newstyle/build/aarch64-freebsd/ghc-8.10.5/ghc-events-0.15.1/build/GHC/RTS/Events/Merge.o, /wrkdirs/usr/ports/devel/hs-threadscope/work/threadscope-0.2.14/dist-newstyle/build/aarch64-freebsd/ghc-8.10.5/ghc-events-0.15.1/build/GHC/RTS/Events/Merge.dyn_o )
[35 of 46] Compiling CPretty          ( c2hs/c/CPretty.hs, /wrkdirs/usr/ports/devel/hs-threadscope/work/threadscope-0.2.14/dist-newstyle/build/aarch64-freebsd/ghc-8.10.5/gtk2hs-buildtools-0.13.8.0/build/CPretty.o, /wrkdirs/usr/ports/devel/hs-threadscope/work/threadscope-0.2.14/dist-newstyle/build/aarch64-freebsd/ghc-8.10.5/gtk2hs-buildtools-0.13.8.0/build/CPretty.dyn_o )
[36 of 46] Compiling CAttrs           ( c2hs/c/CAttrs.hs, /wrkdirs/usr/ports/devel/hs-threadscope/work/threadscope-0.2.14/dist-newstyle/build/aarch64-freebsd/ghc-8.10.5/gtk2hs-buildtools-0.13.8.0/build/CAttrs.o, /wrkdirs/usr/ports/devel/hs-threadscope/work/threadscope-0.2.14/dist-newstyle/build/aarch64-freebsd/ghc-8.10.5/gtk2hs-buildtools-0.13.8.0/build/CAttrs.dyn_o )
[37 of 46] Compiling CTrav            ( c2hs/c/CTrav.hs, /wrkdirs/usr/ports/devel/hs-threadscope/work/threadscope-0.2.14/dist-newstyle/build/aarch64-freebsd/ghc-8.10.5/gtk2hs-buildtools-0.13.8.0/build/CTrav.o, /wrkdirs/usr/ports/devel/hs-threadscope/work/threadscope-0.2.14/dist-newstyle/build/aarch64-freebsd/ghc-8.10.5/gtk2hs-buildtools-0.13.8.0/build/CTrav.dyn_o )
[38 of 46] Compiling CBuiltin         ( c2hs/c/CBuiltin.hs, /wrkdirs/usr/ports/devel/hs-threadscope/work/threadscope-0.2.14/dist-newstyle/build/aarch64-freebsd/ghc-8.10.5/gtk2hs-buildtools-0.13.8.0/build/CBuiltin.o, /wrkdirs/usr/ports/devel/hs-threadscope/work/threadscope-0.2.14/dist-newstyle/build/aarch64-freebsd/ghc-8.10.5/gtk2hs-buildtools-0.13.8.0/build/CBuiltin.dyn_o )
[39 of 46] Compiling CParser          ( /wrkdirs/usr/ports/devel/hs-threadscope/work/threadscope-0.2.14/dist-newstyle/build/aarch64-freebsd/ghc-8.10.5/gtk2hs-buildtools-0.13.8.0/build/CParser.hs, /wrkdirs/usr/ports/devel/hs-threadscope/work/threadscope-0.2.14/dist-newstyle/build/aarch64-freebsd/ghc-8.10.5/gtk2hs-buildtools-0.13.8.0/build/CParser.o, /wrkdirs/usr/ports/devel/hs-threadscope/work/threadscope-0.2.14/dist-newstyle/build/aarch64-freebsd/ghc-8.10.5/gtk2hs-buildtools-0.13.8.0/build/CParser.dyn_o )
[40 of 46] Compiling CNames           ( c2hs/c/CNames.hs, /wrkdirs/usr/ports/devel/hs-threadscope/work/threadscope-0.2.14/dist-newstyle/build/aarch64-freebsd/ghc-8.10.5/gtk2hs-buildtools-0.13.8.0/build/CNames.o, /wrkdirs/usr/ports/devel/hs-threadscope/work/threadscope-0.2.14/dist-newstyle/build/aarch64-freebsd/ghc-8.10.5/gtk2hs-buildtools-0.13.8.0/build/CNames.dyn_o )
[41 of 46] Compiling C                ( c2hs/c/C.hs, /wrkdirs/usr/ports/devel/hs-threadscope/work/threadscope-0.2.14/dist-newstyle/build/aarch64-freebsd/ghc-8.10.5/gtk2hs-buildtools-0.13.8.0/build/C.o, /wrkdirs/usr/ports/devel/hs-threadscope/work/threadscope-0.2.14/dist-newstyle/build/aarch64-freebsd/ghc-8.10.5/gtk2hs-buildtools-0.13.8.0/build/C.dyn_o )
[42 of 46] Compiling GBMonad          ( c2hs/gen/GBMonad.hs, /wrkdirs/usr/ports/devel/hs-threadscope/work/threadscope-0.2.14/dist-newstyle/build/aarch64-freebsd/ghc-8.10.5/gtk2hs-buildtools-0.13.8.0/build/GBMonad.o, /wrkdirs/usr/ports/devel/hs-threadscope/work/threadscope-0.2.14/dist-newstyle/build/aarch64-freebsd/ghc-8.10.5/gtk2hs-buildtools-0.13.8.0/build/GBMonad.dyn_o )
[43 of 46] Compiling GenBind          ( c2hs/gen/GenBind.hs, /wrkdirs/usr/ports/devel/hs-threadscope/work/threadscope-0.2.14/dist-newstyle/build/aarch64-freebsd/ghc-8.10.5/gtk2hs-buildtools-0.13.8.0/build/GenBind.o, /wrkdirs/usr/ports/devel/hs-threadscope/work/threadscope-0.2.14/dist-newstyle/build/aarch64-freebsd/ghc-8.10.5/gtk2hs-buildtools-0.13.8.0/build/GenBind.dyn_o )
[44 of 46] Compiling Version          ( c2hs/toplevel/Version.hs, /wrkdirs/usr/ports/devel/hs-threadscope/work/threadscope-0.2.14/dist-newstyle/build/aarch64-freebsd/ghc-8.10.5/gtk2hs-buildtools-0.13.8.0/build/Version.o, /wrkdirs/usr/ports/devel/hs-threadscope/work/threadscope-0.2.14/dist-newstyle/build/aarch64-freebsd/ghc-8.10.5/gtk2hs-buildtools-0.13.8.0/build/Version.dyn_o )
[45 of 46] Compiling Gtk2HsC2Hs       ( c2hs/toplevel/Gtk2HsC2Hs.hs, /wrkdirs/usr/ports/devel/hs-threadscope/work/threadscope-0.2.14/dist-newstyle/build/aarch64-freebsd/ghc-8.10.5/gtk2hs-buildtools-0.13.8.0/build/Gtk2HsC2Hs.o, /wrkdirs/usr/ports/devel/hs-threadscope/work/threadscope-0.2.14/dist-newstyle/build/aarch64-freebsd/ghc-8.10.5/gtk2hs-buildtools-0.13.8.0/build/Gtk2HsC2Hs.dyn_o )
[46 of 46] Compiling Gtk2HsSetup      ( src/Gtk2HsSetup.hs, /wrkdirs/usr/ports/devel/hs-threadscope/work/threadscope-0.2.14/dist-newstyle/build/aarch64-freebsd/ghc-8.10.5/gtk2hs-buildtools-0.13.8.0/build/Gtk2HsSetup.o, /wrkdirs/usr/ports/devel/hs-threadscope/work/threadscope-0.2.14/dist-newstyle/build/aarch64-freebsd/ghc-8.10.5/gtk2hs-buildtools-0.13.8.0/build/Gtk2HsSetup.dyn_o )
ld.lld: error: relocation R_AARCH64_PREL64 cannot be used against symbol cFoh_closure; recompile with -fPIC
>>> defined in /wrkdirs/usr/ports/devel/hs-threadscope/work/threadscope-0.2.14/dist-newstyle/build/aarch64-freebsd/ghc-8.10.5/gtk2hs-buildtools-0.13.8.0/build/Binary.dyn_o
>>> referenced by ghc_140.ll
>>>               /wrkdirs/usr/ports/devel/hs-threadscope/work/threadscope-0.2.14/dist-newstyle/build/aarch64-freebsd/ghc-8.10.5/gtk2hs-buildtools-0.13.8.0/build/Binary.dyn_o:(.text+0xDE20)

ld.lld: error: relocation R_AARCH64_PREL64 cannot be used against symbol cFoz_closure; recompile with -fPIC
>>> defined in /wrkdirs/usr/ports/devel/hs-threadscope/work/threadscope-0.2.14/dist-newstyle/build/aarch64-freebsd/ghc-8.10.5/gtk2hs-buildtools-0.13.8.0/build/Binary.dyn_o
>>> referenced by ghc_140.ll
>>>               /wrkdirs/usr/ports/devel/hs-threadscope/work/threadscope-0.2.14/dist-newstyle/build/aarch64-freebsd/ghc-8.10.5/gtk2hs-buildtools-0.13.8.0/build/Binary.dyn_o:(.text+0xDF20)

ld.lld: error: relocation R_AARCH64_PREL64 cannot be used against symbol cFoz_closure; recompile with -fPIC
>>> defined in /wrkdirs/usr/ports/devel/hs-threadscope/work/threadscope-0.2.14/dist-newstyle/build/aarch64-freebsd/ghc-8.10.5/gtk2hs-buildtools-0.13.8.0/build/Binary.dyn_o
>>> referenced by ghc_140.ll
>>>               /wrkdirs/usr/ports/devel/hs-threadscope/work/threadscope-0.2.14/dist-newstyle/build/aarch64-freebsd/ghc-8.10.5/gtk2hs-buildtools-0.13.8.0/build/Binary.dyn_o:(.text+0xDF60)
clang: error: linker command failed with exit code 1 (use -v to see invocation)
`clang10' failed in phase `Linker'. (Exit code: 1)
cabal: Failed to build gtk2hs-buildtools-0.13.8.0 (which is required by
exe:threadscope from threadscope-0.2.14).

*** Error code 1

Stop.
make: stopped in /usr/ports/devel/hs-threadscope
Received on Tue Jul 27 2021 - 09:56:22 UTC

Original text of this message