[package - 130powerpc64-quarterly][ftp/ftpcopy] Failed for ftpcopy-0.6.7 in build

From: <pkg-fallout_at_FreeBSD.org>
Date: Tue, 27 Jul 2021 06:36:35 GMT
You are receiving this mail as a port that you maintain
is failing to build on the FreeBSD package build server.
Please investigate the failure and submit a PR to fix
build.

Maintainer:     mandree_at_FreeBSD.org
Log URL:        http://foul1.nyi.freebsd.org/data/130powerpc64-quarterly/861e2a11357f/logs/ftpcopy-0.6.7.log
Build URL:      http://foul1.nyi.freebsd.org/build.html?mastername=130powerpc64-quarterly&build=861e2a11357f
Log:

=>> Building ftp/ftpcopy
build started at Tue Jul 27 06:35:56 UTC 2021
port directory: /usr/ports/ftp/ftpcopy
package name: ftpcopy-0.6.7
building for: FreeBSD 130powerpc64-quarterly-job-11 13.0-RELEASE FreeBSD 13.0-RELEASE powerpc
maintained by: mandree_at_FreeBSD.org
Makefile ident: 
Poudriere version: 3.2.8-16-g00a37fcb
Host OSVERSION: 1400008
Jail OSVERSION: 1300139
Job Id: 11

---Begin Environment---
SHELL=/bin/csh
OSVERSION=1300139
UNAME_v=FreeBSD 13.0-RELEASE
UNAME_r=13.0-RELEASE
BLOCKSIZE=K
MAIL=/var/mail/root
MM_CHARSET=UTF-8
LANG=C.UTF-8
STATUS=1
HOME=/root
PATH=/sbin:/bin:/usr/sbin:/usr/bin:/usr/local/sbin:/usr/local/bin:/root/bin
LOCALBASE=/usr/local
USER=root
LIBEXECPREFIX=/usr/local/libexec/poudriere
POUDRIERE_VERSION=3.2.8-16-g00a37fcb
MASTERMNT=/usr/local/poudriere/data/.m/130powerpc64-quarterly/ref
POUDRIERE_BUILD_TYPE=bulk
PACKAGE_BUILDING=yes
SAVED_TERM=
PWD=/usr/local/poudriere/data/.m/130powerpc64-quarterly/ref/.p/pool
P_PORTS_FEATURES=FLAVORS SELECTED_OPTIONS
MASTERNAME=130powerpc64-quarterly
SCRIPTPREFIX=/usr/local/share/poudriere
OLDPWD=/usr/local/poudriere/data/.m/130powerpc64-quarterly/ref/.p
SCRIPTPATH=/usr/local/share/poudriere/bulk.sh
POUDRIEREPATH=/usr/local/bin/poudriere
---End Environment---

---Begin Poudriere Port Flags/Env---
PORT_FLAGS=
PKGENV=
FLAVOR=
DEPENDS_ARGS=
MAKE_ARGS=
---End Poudriere Port Flags/Env---

---Begin OPTIONS List---
===> The following configuration options are available for ftpcopy-0.6.7:
     DOCS=on: Build and/or install documentation
===> Use 'make config' to modify these settings
---End OPTIONS List---

--MAINTAINER--
mandree_at_FreeBSD.org
--End MAINTAINER--

--CONFIGURE_ARGS--

--End CONFIGURE_ARGS--

--CONFIGURE_ENV--
ac_cv_path_PERL=/usr/local/bin/perl ac_cv_path_PERL_PATH=/usr/local/bin/perl  PERL_USE_UNSAFE_INC=1 XDG_DATA_HOME=/wrkdirs/usr/ports/ftp/ftpcopy/work  XDG_CONFIG_HOME=/wrkdirs/usr/ports/ftp/ftpcopy/work  HOME=/wrkdirs/usr/ports/ftp/ftpcopy/work TMPDIR="/tmp" PATH=/wrkdirs/usr/ports/ftp/ftpcopy/work/.bin:/sbin:/bin:/usr/sbin:/usr/bin:/usr/local/sbin:/usr/local/bin:/root/bin SHELL=/bin/sh CONFIG_SHELL=/bin/sh
--End CONFIGURE_ENV--

--MAKE_ENV--
PERL_USE_UNSAFE_INC=1 XDG_DATA_HOME=/wrkdirs/usr/ports/ftp/ftpcopy/work  XDG_CONFIG_HOME=/wrkdirs/usr/ports/ftp/ftpcopy/work  HOME=/wrkdirs/usr/ports/ftp/ftpcopy/work TMPDIR="/tmp" PATH=/wrkdirs/usr/ports/ftp/ftpcopy/work/.bin:/sbin:/bin:/usr/sbin:/usr/bin:/usr/local/sbin:/usr/local/bin:/root/bin NO_PIE=yes MK_DEBUG_FILES=no MK_KERNEL_SYMBOLS=no SHELL=/bin/sh NO_LINT=YES PREFIX=/usr/local  LOCALBASE=/usr/local  CC="cc" CFLAGS="-O2 -pipe  -fstack-protector-strong -fno-strict-aliasing "  CPP="cpp" CPPFLAGS=""  LDFLAGS=" -fstack-protector-strong " LIBS=""  CXX="c++" CXXFLAGS="-O2 -pipe -fstack-protector-strong -fno-strict-aliasing  "  MANPREFIX="/usr/local" BSD_INSTALL_PROGRAM="install  -s -m 555"  BSD_INSTALL_LIB="install  -s -m 0644"  BSD_INSTALL_SCRIPT="install  -m 555"  BSD_INSTALL_DATA="install  -m 0644"  BSD_INSTALL_MAN="install  -m 444"
--End MAKE_ENV--

--PLIST_SUB--
PORTDOCS="" OSREL=13.0 PREFIX=%D LOCALBASE=/usr/local  RESETPREFIX=/usr/local LIB32DIR=lib PERL_VERSION=5.32.1  PERL_VER=5.32  PERL5_MAN1=lib/perl5/site_perl/man/man1  PERL5_MAN3=lib/perl5/site_perl/man/man3  SITE_PERL=lib/perl5/site_perl  SITE_ARCH=lib/perl5/site_perl/mach/5.32 DOCSDIR="share/doc/ftpcopy"  EXAMPLESDIR="share/examples/ftpcopy"  DATADIR="share/ftpcopy"  WWWDIR="www/ftpcopy"  ETCDIR="etc/ftpcopy"
--End PLIST_SUB--

--SUB_LIST--
PREFIX=/usr/local LOCALBASE=/usr/local  DATADIR=/usr/local/share/ftpcopy DOCSDIR=/usr/local/share/doc/ftpcopy EXAMPLESDIR=/usr/local/share/examples/ftpcopy  WWWDIR=/usr/local/www/ftpcopy ETCDIR=/usr/local/etc/ftpcopy
--End SUB_LIST--

---Begin make.conf---
USE_PACKAGE_DEPENDS=yes
BATCH=yes
WRKDIRPREFIX=/wrkdirs
PORTSDIR=/usr/ports
PACKAGES=/packages
DISTDIR=/distfiles
PACKAGE_BUILDING=yes
PACKAGE_BUILDING_FLAVORS=yes
#### /usr/local/etc/poudriere.d/make.conf ####
# XXX: We really need this but cannot use it while 'make checksum' does not
# try the next mirror on checksum failure.  It currently retries the same
# failed mirror and then fails rather then trying another.  It *does*
# try the next if the size is mismatched though.
#MASTER_SITE_FREEBSD=yes
# Build ALLOW_MAKE_JOBS_PACKAGES with 2 jobs
MAKE_JOBS_NUMBER=2
#### /usr/ports/Mk/Scripts/ports_env.sh ####
_CCVERSION_921dbbb2=FreeBSD clang version 11.0.1 (git_at_github.com:llvm/llvm-project.git llvmorg-11.0.1-0-g43ff75f2c3fe) Target: powerpc64-unknown-freebsd13.0 Thread model: posix InstalledDir: /usr/bin
_ALTCCVERSION_921dbbb2=none
_CXXINTERNAL_acaad9ca=FreeBSD clang version 11.0.1 (git_at_github.com:llvm/llvm-project.git llvmorg-11.0.1-0-g43ff75f2c3fe) Target: powerpc64-unknown-freebsd13.0 Thread model: posix InstalledDir: /usr/bin "/usr/bin/ld" "--eh-frame-hdr" "-dynamic-linker" "/libexec/ld-elf.so.1" "--enable-new-dtags" "-o" "a.out" "/usr/lib/crt1.o" "/usr/lib/crti.o" "/usr/lib/crtbegin.o" "-L/usr/lib" "/dev/null" "-lc++" "-lm" "-lgcc" "--as-needed" "-lgcc_s" "--no-as-needed" "-lc" "-lgcc" "--as-needed" "-lgcc_s" "--no-as-needed" "/usr/lib/crtend.o" "/usr/lib/crtn.o"
CC_OUTPUT_921dbbb2_58173849=yes
CC_OUTPUT_921dbbb2_9bdba57c=yes
CC_OUTPUT_921dbbb2_6a4fe7f5=yes
CC_OUTPUT_921dbbb2_6bcac02b=yes
CC_OUTPUT_921dbbb2_67d20829=yes
CC_OUTPUT_921dbbb2_bfa62e83=yes
CC_OUTPUT_921dbbb2_f0b4d593=yes
CC_OUTPUT_921dbbb2_308abb44=yes
CC_OUTPUT_921dbbb2_f00456e5=yes
CC_OUTPUT_921dbbb2_65ad290d=yes
CC_OUTPUT_921dbbb2_f2776b26=yes
CC_OUTPUT_921dbbb2_b2657cc3=yes
CC_OUTPUT_921dbbb2_380987f7=yes
CC_OUTPUT_921dbbb2_160933ec=yes
CC_OUTPUT_921dbbb2_fb62803b=yes
_OBJC_CCVERSION_921dbbb2=FreeBSD clang version 11.0.1 (git_at_github.com:llvm/llvm-project.git llvmorg-11.0.1-0-g43ff75f2c3fe) Target: powerpc64-unknown-freebsd13.0 Thread model: posix InstalledDir: /usr/bin
_OBJC_ALTCCVERSION_921dbbb2=none
ARCH=powerpc64
PPC_ABI=ELFv2
OPSYS=FreeBSD
_OSRELEASE=13.0-RELEASE
OSREL=13.0
OSVERSION=1300139
PYTHONBASE=/usr/local
CONFIGURE_MAX_CMD_LEN=524288
HAVE_PORTS_ENV=1
#### Misc Poudriere ####
GID=0
UID=0
---End make.conf---
--Resource limits--
cpu time               (seconds, -t)  unlimited
file size           (512-blocks, -f)  unlimited
data seg size           (kbytes, -d)  33554432
stack size              (kbytes, -s)  524288
core file size      (512-blocks, -c)  unlimited
max memory size         (kbytes, -m)  unlimited
locked memory           (kbytes, -l)  unlimited
max user processes              (-u)  89999
open files                      (-n)  1024
virtual mem size        (kbytes, -v)  unlimited
swap limit              (kbytes, -w)  unlimited
socket buffer size       (bytes, -b)  unlimited
pseudo-terminals                (-p)  unlimited
kqueues                         (-k)  unlimited
umtx shared locks               (-o)  unlimited
--End resource limits--
=======================<phase: check-sanity   >============================
===>  License GPLv2 accepted by the user
===========================================================================
=======================<phase: pkg-depends    >============================
===>   ftpcopy-0.6.7 depends on file: /usr/local/sbin/pkg - not found
===>   Installing existing package /packages/All/pkg-1.16.3.txz
[130powerpc64-quarterly-job-11] Installing pkg-1.16.3...
[130powerpc64-quarterly-job-11] Extracting pkg-1.16.3: .......... done
===>   ftpcopy-0.6.7 depends on file: /usr/local/sbin/pkg - found
===>   Returning to build of ftpcopy-0.6.7
===========================================================================
=======================<phase: fetch-depends  >============================
===========================================================================
=======================<phase: fetch          >============================
===>  License GPLv2 accepted by the user
===> Fetching all distfiles required by ftpcopy-0.6.7 for building
===========================================================================
=======================<phase: checksum       >============================
===>  License GPLv2 accepted by the user
===> Fetching all distfiles required by ftpcopy-0.6.7 for building
=> SHA256 Checksum OK for ftpcopy-0.6.7.tar.gz.
===========================================================================
=======================<phase: extract-depends>============================
===========================================================================
=======================<phase: extract        >============================
===>  License GPLv2 accepted by the user
===> Fetching all distfiles required by ftpcopy-0.6.7 for building
===>  Extracting for ftpcopy-0.6.7
=> SHA256 Checksum OK for ftpcopy-0.6.7.tar.gz.
===========================================================================
=======================<phase: patch-depends  >============================
===========================================================================
=======================<phase: patch          >============================
===>  Patching for ftpcopy-0.6.7
===>  Applying FreeBSD patches for ftpcopy-0.6.7 from /usr/ports/ftp/ftpcopy/files
===========================================================================
=======================<phase: build-depends  >============================
===>   ftpcopy-0.6.7 depends on package: perl5>=5.32.r0<5.33 - not found
===>   Installing existing package /packages/All/perl5-5.32.1_1.txz
[130powerpc64-quarterly-job-11] Installing perl5-5.32.1_1...
[130powerpc64-quarterly-job-11] Extracting perl5-5.32.1_1: .......... done
===>   ftpcopy-0.6.7 depends on package: perl5>=5.32.r0<5.33 - found
===>   Returning to build of ftpcopy-0.6.7
===========================================================================
=======================<phase: lib-depends    >============================
===========================================================================
=======================<phase: configure      >============================
===>  Configuring for ftpcopy-0.6.7
===========================================================================
=======================<phase: build          >============================
===>  Building for ftpcopy-0.6.7
echo "cc" >/wrkdirs/usr/ports/ftp/ftpcopy/work/web/ftpcopy-0.6.7/src/conf-cc
<snip>
./auto-compilew.sh  -c gen_alloc_lus.c
--- get_cwd.o ---
./auto-compilew.sh  -c get_cwd.c
--- getln.o ---
./auto-compilew.sh  -c getln.c
--- inq_winsize.o ---
./auto-compilew.sh  -c inq_winsize.c
--- ip4_constants.o ---
./auto-compilew.sh  -c ip4_constants.c
--- ip4_fmt.o ---
./auto-compilew.sh  -c ip4_fmt.c
--- ip6_constants.o ---
--- ip6_fmt.o ---
--- ip6_constants.o ---
./auto-compilew.sh  -c ip6_constants.c
--- ip6_fmt.o ---
./auto-compilew.sh  -c ip6_fmt.c
ip6_fmt.c:17:18: warning: passing 'const unsigned char [12]' to parameter of type 'const char *' converts between pointers to integer types with different sign [-Wpointer-sign]
    if (j==12 && ip6_isv4mapped(ip)) {
                 ^~~~~~~~~~~~~~~~~~
./ip6.h:23:29: note: expanded from macro 'ip6_isv4mapped'
#define ip6_isv4mapped(ip) (byte_equal(ip,12,V4mappedprefix))
                            ^~~~~~~~~~~~~~~~~~~~~~~~~~~~~~~~
./byte.h:15:47: note: expanded from macro 'byte_equal'
#define byte_equal(s,n,t) (!byte_diff((s),(n),(t)))
                                              ^~~
./byte.h:12:56: note: passing argument to parameter 't' here
int byte_diff(const char *s,unsigned int n,const char *t);
                                                       ^
1 warning generated.
--- ip6_scan.o ---
./auto-compilew.sh  -c ip6_scan.c
--- ndelay_off.o ---
./auto-compilew.sh  -c ndelay_off.c
--- ip6_scan.o ---
ip6_scan.c:25:17: warning: initializing 'const char *' with an expression of type 'const unsigned char [12]' converts between pointers to integer types with different sign [-Wpointer-sign]
    const char *c=V4mappedprefix;
                ^ ~~~~~~~~~~~~~~
ip6_scan.c:26:9: warning: passing 'const unsigned char [16]' to parameter of type 'const char *' converts between pointers to integer types with different sign [-Wpointer-sign]
    if (byte_equal(ip+12,4,V6any)) c=V6any;
        ^~~~~~~~~~~~~~~~~~~~~~~~~
./byte.h:15:47: note: expanded from macro 'byte_equal'
#define byte_equal(s,n,t) (!byte_diff((s),(n),(t)))
                                              ^~~
./byte.h:12:56: note: passing argument to parameter 't' here
int byte_diff(const char *s,unsigned int n,const char *t);
                                                       ^
ip6_scan.c:26:37: warning: assigning to 'const char *' from 'const unsigned char [16]' converts between pointers to integer types with different sign [-Wpointer-sign]
    if (byte_equal(ip+12,4,V6any)) c=V6any;
                                    ^~~~~~
3 warnings generated.
--- ndelay_on.o ---
./auto-compilew.sh  -c ndelay_on.c
--- open_append.o ---
./auto-compilew.sh  -c open_append.c
--- open_excl.o ---
./auto-compilew.sh  -c open_excl.c
--- open_read.o ---
./auto-compilew.sh  -c open_read.c
--- openreadclose.o ---
./auto-compilew.sh  -c openreadclose.c
--- readclose.o ---
./auto-compilew.sh  -c readclose.c
--- readclose_app.o ---
./auto-compilew.sh  -c readclose_app.c
--- scan_long.o ---
./auto-compilew.sh  -c scan_long.c
--- scan_sign.o ---
--- scan_ulong.o ---
--- scan_sign.o ---
./auto-compilew.sh  -c scan_sign.c
--- scan_ulong.o ---
./auto-compilew.sh  -c scan_ulong.c
--- scan_xlong.o ---
./auto-compilew.sh  -c scan_xlong.c
--- sockrecbuf.o ---
./auto-compilew.sh  -c sockrecbuf.c
--- str_chr.o ---
./auto-compilew.sh  -c str_chr.c
--- str_diff.o ---
./auto-compilew.sh  -c str_diff.c
--- str_len.o ---
./auto-compilew.sh  -c str_len.c
--- str_rchr.o ---
./auto-compilew.sh  -c str_rchr.c
--- str_start.o ---
--- stralloc_cat.o ---
--- str_start.o ---
./auto-compilew.sh  -c str_start.c
--- stralloc_cat.o ---
./auto-compilew.sh  -c stralloc_cat.c
--- stralloc_catb.o ---
./auto-compilew.sh  -c stralloc_catb.c
--- stralloc_cats.o ---
./auto-compilew.sh  -c stralloc_cats.c
--- stralloc_copy.o ---
./auto-compilew.sh  -c stralloc_copy.c
--- stralloc_eady.o ---
./auto-compilew.sh  -c stralloc_eady.c
--- stralloc_free.o ---
./auto-compilew.sh  -c stralloc_free.c
--- stralloc_opyb.o ---
./auto-compilew.sh  -c stralloc_opyb.c
--- stralloc_opys.o ---
./auto-compilew.sh  -c stralloc_opys.c
--- stralloc_pend.o ---
./auto-compilew.sh  -c stralloc_pend.c
--- stralloc_plus.o ---
--- uo_now.o ---
--- stralloc_plus.o ---
./auto-compilew.sh  -c stralloc_plus.c
--- uo_now.o ---
./auto-compilew.sh  -c uo_now.c
--- uo_sec702dt.o ---
--- uo_wildmat.o ---
--- uo_sec702dt.o ---
./auto-compilew.sh  -c uo_sec702dt.c
--- uo_wildmat.o ---
./auto-compilew.sh  -c uo_wildmat.c
--- uogetopt.o ---
./auto-compilew.sh  -c uogetopt.c
uogetopt.c:49:2: error: 'regparm' is not valid on this platform
        attribute_regparm(2);
        ^~~~~~~~~~~~~~~~~~~~
./attributes.h:71:46: note: expanded from macro 'attribute_regparm'
# define attribute_regparm(x) __attribute__((__regparm__((x))))
                                             ^           ~~~
uogetopt.c:51:2: error: 'regparm' is not valid on this platform
        attribute_regparm(2);
        ^~~~~~~~~~~~~~~~~~~~
./attributes.h:71:46: note: expanded from macro 'attribute_regparm'
# define attribute_regparm(x) __attribute__((__regparm__((x))))
                                             ^           ~~~
uogetopt.c:53:3: error: 'regparm' is not valid on this platform
  attribute_regparm(2);
  ^~~~~~~~~~~~~~~~~~~~
./attributes.h:71:46: note: expanded from macro 'attribute_regparm'
# define attribute_regparm(x) __attribute__((__regparm__((x))))
                                             ^           ~~~
uogetopt.c:55:2: error: 'regparm' is not valid on this platform
        attribute_regparm(2);
        ^~~~~~~~~~~~~~~~~~~~
./attributes.h:71:46: note: expanded from macro 'attribute_regparm'
# define attribute_regparm(x) __attribute__((__regparm__((x))))
                                             ^           ~~~
--- urlparse.o ---
--- uogetopt.o ---
uogetopt.c:182:13: error: 'regparm' is not valid on this platform
static void attribute_regparm(2)
            ^~~~~~~~~~~~~~~~~~~~
./attributes.h:71:46: note: expanded from macro 'attribute_regparm'
# define attribute_regparm(x) __attribute__((__regparm__((x))))
                                             ^           ~~~
uogetopt.c:342:17: warning: passing 'unsigned long *' to parameter of type 'long *' converts between pointers to integer types with different sign [-Wpointer-sign]
  l=scan_long(s,(unsigned long *)x->var);
                ^~~~~~~~~~~~~~~~~~~~~~~
./scan.h:14:50: note: passing argument to parameter here
extern unsigned int scan_long(const char *,long *);
                                                 ^
uogetopt.c:389:21: error: 'regparm' is not valid on this platform
static unsigned int attribute_regparm(2)
                    ^~~~~~~~~~~~~~~~~~~~
./attributes.h:71:46: note: expanded from macro 'attribute_regparm'
# define attribute_regparm(x) __attribute__((__regparm__((x))))
                                             ^           ~~~
uogetopt.c:398:13: error: 'regparm' is not valid on this platform
static void attribute_regparm(2)
            ^~~~~~~~~~~~~~~~~~~~
./attributes.h:71:46: note: expanded from macro 'attribute_regparm'
# define attribute_regparm(x) __attribute__((__regparm__((x))))
                                             ^           ~~~
uogetopt.c:416:14: error: 'regparm' is not valid on this platform
static void  attribute_regparm(2)
             ^~~~~~~~~~~~~~~~~~~~
./attributes.h:71:46: note: expanded from macro 'attribute_regparm'
# define attribute_regparm(x) __attribute__((__regparm__((x))))
                                             ^           ~~~
--- urlparse.o ---
./auto-compilew.sh  -c urlparse.c
--- uogetopt.o ---
1 warning and 8 errors generated.
*** [uogetopt.o] Error code 1

make[2]: stopped in /wrkdirs/usr/ports/ftp/ftpcopy/work/web/ftpcopy-0.6.7/compile
1 error

make[2]: stopped in /wrkdirs/usr/ports/ftp/ftpcopy/work/web/ftpcopy-0.6.7/compile
*** [all] Error code 1

make[1]: stopped in /wrkdirs/usr/ports/ftp/ftpcopy/work/web/ftpcopy-0.6.7
1 error

make[1]: stopped in /wrkdirs/usr/ports/ftp/ftpcopy/work/web/ftpcopy-0.6.7
===> Compilation failed unexpectedly.
Try to set MAKE_JOBS_UNSAFE=yes and rebuild before reporting the failure to
the maintainer.
*** Error code 1

Stop.
make: stopped in /usr/ports/ftp/ftpcopy
Received on Tue Jul 27 2021 - 06:36:35 UTC

Original text of this message