[package - 130powerpc64-quarterly][archivers/snappy-java] Failed for snappyjava-1.1.7.5 in build

From: <pkg-fallout_at_FreeBSD.org>
Date: Tue, 27 Jul 2021 06:17:46 GMT
You are receiving this mail as a port that you maintain
is failing to build on the FreeBSD package build server.
Please investigate the failure and submit a PR to fix
build.

Maintainer:     language.devel_at_gmail.com
Log URL:        http://foul1.nyi.freebsd.org/data/130powerpc64-quarterly/861e2a11357f/logs/snappyjava-1.1.7.5.log
Build URL:      http://foul1.nyi.freebsd.org/build.html?mastername=130powerpc64-quarterly&build=861e2a11357f
Log:

=>> Building archivers/snappy-java
build started at Tue Jul 27 06:16:26 UTC 2021
port directory: /usr/ports/archivers/snappy-java
package name: snappyjava-1.1.7.5
building for: FreeBSD 130powerpc64-quarterly-job-02 13.0-RELEASE FreeBSD 13.0-RELEASE powerpc
maintained by: language.devel_at_gmail.com
Makefile ident: 
Poudriere version: 3.2.8-16-g00a37fcb
Host OSVERSION: 1400008
Jail OSVERSION: 1300139
Job Id: 02

---Begin Environment---
SHELL=/bin/csh
OSVERSION=1300139
UNAME_v=FreeBSD 13.0-RELEASE
UNAME_r=13.0-RELEASE
BLOCKSIZE=K
MAIL=/var/mail/root
MM_CHARSET=UTF-8
LANG=C.UTF-8
STATUS=1
HOME=/root
PATH=/sbin:/bin:/usr/sbin:/usr/bin:/usr/local/sbin:/usr/local/bin:/root/bin
LOCALBASE=/usr/local
USER=root
LIBEXECPREFIX=/usr/local/libexec/poudriere
POUDRIERE_VERSION=3.2.8-16-g00a37fcb
MASTERMNT=/usr/local/poudriere/data/.m/130powerpc64-quarterly/ref
POUDRIERE_BUILD_TYPE=bulk
PACKAGE_BUILDING=yes
SAVED_TERM=
PWD=/usr/local/poudriere/data/.m/130powerpc64-quarterly/ref/.p/pool
P_PORTS_FEATURES=FLAVORS SELECTED_OPTIONS
MASTERNAME=130powerpc64-quarterly
SCRIPTPREFIX=/usr/local/share/poudriere
OLDPWD=/usr/local/poudriere/data/.m/130powerpc64-quarterly/ref/.p
SCRIPTPATH=/usr/local/share/poudriere/bulk.sh
POUDRIEREPATH=/usr/local/bin/poudriere
---End Environment---

---Begin Poudriere Port Flags/Env---
PORT_FLAGS=
PKGENV=
FLAVOR=
DEPENDS_ARGS=
MAKE_ARGS=
---End Poudriere Port Flags/Env---

---Begin OPTIONS List---
---End OPTIONS List---

--MAINTAINER--
language.devel_at_gmail.com
--End MAINTAINER--

--CONFIGURE_ARGS--

--End CONFIGURE_ARGS--

--CONFIGURE_ENV--
MAKE=gmake XDG_DATA_HOME=/wrkdirs/usr/ports/archivers/snappy-java/work  XDG_CONFIG_HOME=/wrkdirs/usr/ports/archivers/snappy-java/work  HOME=/wrkdirs/usr/ports/archivers/snappy-java/work TMPDIR="/tmp" PATH=/wrkdirs/usr/ports/archivers/snappy-java/work/.bin:/sbin:/bin:/usr/sbin:/usr/bin:/usr/local/sbin:/usr/local/bin:/root/bin SHELL=/bin/sh CONFIG_SHELL=/bin/sh
--End CONFIGURE_ENV--

--MAKE_ENV--
XDG_DATA_HOME=/wrkdirs/usr/ports/archivers/snappy-java/work  XDG_CONFIG_HOME=/wrkdirs/usr/ports/archivers/snappy-java/work  HOME=/wrkdirs/usr/ports/archivers/snappy-java/work TMPDIR="/tmp" PATH=/wrkdirs/usr/ports/archivers/snappy-java/work/.bin:/sbin:/bin:/usr/sbin:/usr/bin:/usr/local/sbin:/usr/local/bin:/root/bin NO_PIE=yes MK_DEBUG_FILES=no MK_KERNEL_SYMBOLS=no SHELL=/bin/sh NO_LINT=YES PREFIX=/usr/local  LOCALBASE=/usr/local  CC="cc" CFLAGS="-O2 -pipe  -fstack-protector-strong -fno-strict-aliasing "  CPP="cpp" CPPFLAGS=""  LDFLAGS=" -fstack-protector-strong " LIBS=""  CXX="c++" CXXFLAGS="-O2 -pipe -fstack-protector-strong -fno-strict-aliasing  "  MANPREFIX="/usr/local" BSD_INSTALL_PROGRAM="install  -s -m 555"  BSD_INSTALL_LIB="install  -s -m 0644"  BSD_INSTALL_SCRIPT="install  -m 555"  BSD_INSTALL_DATA="install  -m 0644"  BSD_INSTALL_MAN="install  -m 444"
--End MAKE_ENV--

--PLIST_SUB--
JAVASHAREDIR="share/java"  JAVAJARDIR="share/java/classes" OSREL=13.0 PREFIX=%D LOCALBASE=/usr/local  RESETPREFIX=/usr/local LIB32DIR=lib DOCSDIR="share/doc/snappy"  EXAMPLESDIR="share/examples/snappy"  DATADIR="share/snappy"  WWWDIR="www/snappy"  ETCDIR="etc/snappy"
--End PLIST_SUB--

--SUB_LIST--
JAVASHAREDIR="/usr/local/share/java"  JAVAJARDIR="/usr/local/share/java/classes"  JAVALIBDIR="/usr/local/share/java/classes" PREFIX=/usr/local LOCALBASE=/usr/local  DATADIR=/usr/local/share/snappy DOCSDIR=/usr/local/share/doc/snappy EXAMPLESDIR=/usr/local/share/examples/snappy  WWWDIR=/usr/local/www/snappy ETCDIR=/usr/local/etc/snappy
--End SUB_LIST--

---Begin make.conf---
USE_PACKAGE_DEPENDS=yes
BATCH=yes
WRKDIRPREFIX=/wrkdirs
PORTSDIR=/usr/ports
PACKAGES=/packages
DISTDIR=/distfiles
PACKAGE_BUILDING=yes
PACKAGE_BUILDING_FLAVORS=yes
#### /usr/local/etc/poudriere.d/make.conf ####
# XXX: We really need this but cannot use it while 'make checksum' does not
# try the next mirror on checksum failure.  It currently retries the same
# failed mirror and then fails rather then trying another.  It *does*
# try the next if the size is mismatched though.
#MASTER_SITE_FREEBSD=yes
# Build ALLOW_MAKE_JOBS_PACKAGES with 2 jobs
MAKE_JOBS_NUMBER=2
#### /usr/ports/Mk/Scripts/ports_env.sh ####
_CCVERSION_921dbbb2=FreeBSD clang version 11.0.1 (git_at_github.com:llvm/llvm-project.git llvmorg-11.0.1-0-g43ff75f2c3fe) Target: powerpc64-unknown-freebsd13.0 Thread model: posix InstalledDir: /usr/bin
_ALTCCVERSION_921dbbb2=none
_CXXINTERNAL_acaad9ca=FreeBSD clang version 11.0.1 (git_at_github.com:llvm/llvm-project.git llvmorg-11.0.1-0-g43ff75f2c3fe) Target: powerpc64-unknown-freebsd13.0 Thread model: posix InstalledDir: /usr/bin "/usr/bin/ld" "--eh-frame-hdr" "-dynamic-linker" "/libexec/ld-elf.so.1" "--enable-new-dtags" "-o" "a.out" "/usr/lib/crt1.o" "/usr/lib/crti.o" "/usr/lib/crtbegin.o" "-L/usr/lib" "/dev/null" "-lc++" "-lm" "-lgcc" "--as-needed" "-lgcc_s" "--no-as-needed" "-lc" "-lgcc" "--as-needed" "-lgcc_s" "--no-as-needed" "/usr/lib/crtend.o" "/usr/lib/crtn.o"
CC_OUTPUT_921dbbb2_58173849=yes
CC_OUTPUT_921dbbb2_9bdba57c=yes
CC_OUTPUT_921dbbb2_6a4fe7f5=yes
CC_OUTPUT_921dbbb2_6bcac02b=yes
CC_OUTPUT_921dbbb2_67d20829=yes
CC_OUTPUT_921dbbb2_bfa62e83=yes
CC_OUTPUT_921dbbb2_f0b4d593=yes
CC_OUTPUT_921dbbb2_308abb44=yes
CC_OUTPUT_921dbbb2_f00456e5=yes
CC_OUTPUT_921dbbb2_65ad290d=yes
CC_OUTPUT_921dbbb2_f2776b26=yes
CC_OUTPUT_921dbbb2_b2657cc3=yes
CC_OUTPUT_921dbbb2_380987f7=yes
CC_OUTPUT_921dbbb2_160933ec=yes
CC_OUTPUT_921dbbb2_fb62803b=yes
_OBJC_CCVERSION_921dbbb2=FreeBSD clang version 11.0.1 (git_at_github.com:llvm/llvm-project.git llvmorg-11.0.1-0-g43ff75f2c3fe) Target: powerpc64-unknown-freebsd13.0 Thread model: posix InstalledDir: /usr/bin
_OBJC_ALTCCVERSION_921dbbb2=none
ARCH=powerpc64
PPC_ABI=ELFv2
OPSYS=FreeBSD
_OSRELEASE=13.0-RELEASE
OSREL=13.0
OSVERSION=1300139
PYTHONBASE=/usr/local
CONFIGURE_MAX_CMD_LEN=524288
HAVE_PORTS_ENV=1
#### Misc Poudriere ####
GID=0
UID=0
---End make.conf---
--Resource limits--
cpu time               (seconds, -t)  unlimited
file size           (512-blocks, -f)  unlimited
data seg size           (kbytes, -d)  33554432
stack size              (kbytes, -s)  524288
core file size      (512-blocks, -c)  unlimited
max memory size         (kbytes, -m)  unlimited
locked memory           (kbytes, -l)  unlimited
max user processes              (-u)  89999
open files                      (-n)  1024
virtual mem size        (kbytes, -v)  unlimited
swap limit              (kbytes, -w)  unlimited
socket buffer size       (bytes, -b)  unlimited
pseudo-terminals                (-p)  unlimited
kqueues                         (-k)  unlimited
umtx shared locks               (-o)  unlimited
--End resource limits--
=======================<phase: check-sanity   >============================
===>  License APACHE20 accepted by the user
===========================================================================
=======================<phase: pkg-depends    >============================
===>   snappyjava-1.1.7.5 depends on file: /usr/local/sbin/pkg - not found
===>   Installing existing package /packages/All/pkg-1.16.3.txz
[130powerpc64-quarterly-job-02] Installing pkg-1.16.3...
[130powerpc64-quarterly-job-02] Extracting pkg-1.16.3: .......... done
===>   snappyjava-1.1.7.5 depends on file: /usr/local/sbin/pkg - found
===>   Returning to build of snappyjava-1.1.7.5
===========================================================================
=======================<phase: fetch-depends  >============================
===========================================================================
=======================<phase: fetch          >============================
===>  License APACHE20 accepted by the user
===> Fetching all distfiles required by snappyjava-1.1.7.5 for building
===========================================================================
=======================<phase: checksum       >============================
===>  License APACHE20 accepted by the user
===> Fetching all distfiles required by snappyjava-1.1.7.5 for building
=> SHA256 Checksum OK for snappy-java-repository-1.1.7.5.tar.gz.
=> SHA256 Checksum OK for xerial-snappy-java-1.1.7.5_GH0.tar.gz.
=> SHA256 Checksum OK for google-snappy-1.1.7_GH0.tar.gz.
=> SHA256 Checksum OK for kiyo-masui-bitshuffle-0.3.2_GH0.tar.gz.
===========================================================================
=======================<phase: extract-depends>============================
===========================================================================
=======================<phase: extract        >============================
===>  License APACHE20 accepted by the user
===> Fetching all distfiles required by snappyjava-1.1.7.5 for building
===>  Extracting for snappyjava-1.1.7.5
=> SHA256 Checksum OK for snappy-java-repository-1.1.7.5.tar.gz.
=> SHA256 Checksum OK for xerial-snappy-java-1.1.7.5_GH0.tar.gz.
=> SHA256 Checksum OK for google-snappy-1.1.7_GH0.tar.gz.
=> SHA256 Checksum OK for kiyo-masui-bitshuffle-0.3.2_GH0.tar.gz.
===========================================================================
=======================<phase: patch-depends  >============================
===========================================================================
=======================<phase: patch          >============================
===>  Patching for snappyjava-1.1.7.5
===>  Applying FreeBSD patches for snappyjava-1.1.7.5 from /usr/ports/archivers/snappy-java/files
===========================================================================
=======================<phase: build-depends  >============================
===>   snappyjava-1.1.7.5 depends on executable: cmake - not found
===>   Installing existing package /packages/All/cmake-3.20.4.txz
[130powerpc64-quarterly-job-02] Installing cmake-3.20.4...
[130powerpc64-quarterly-job-02] `-- Installing curl-7.77.0...
[130powerpc64-quarterly-job-02] |   `-- Installing ca_root_nss-3.63...
[130powerpc64-quarterly-job-02] |   `-- Extracting ca_root_nss-3.63: ........ done
[130powerpc64-quarterly-job-02] |   `-- Installing libnghttp2-1.43.0...
[130powerpc64-quarterly-job-02] |   `-- Extracting libnghttp2-1.43.0: .......... done
[130powerpc64-quarterly-job-02] `-- Extracting curl-7.77.0: .......... done
[130powerpc64-quarterly-job-02] `-- Installing expat-2.4.1...
[130powerpc64-quarterly-job-02] `-- Extracting expat-2.4.1: .......... done
[130powerpc64-quarterly-job-02] `-- Installing jsoncpp-1.9.4...
<snip>
[130powerpc64-quarterly-job-02] Installing gmake-4.3_2...
[130powerpc64-quarterly-job-02] Extracting gmake-4.3_2: .......... done
===>   snappyjava-1.1.7.5 depends on package: gmake>=4.3 - found
===>   Returning to build of snappyjava-1.1.7.5
===========================================================================
=======================<phase: lib-depends    >============================
===========================================================================
=======================<phase: configure      >============================
===>  Configuring for snappyjava-1.1.7.5
===========================================================================
=======================<phase: build          >============================
===>  Building for snappyjava-1.1.7.5
cd /wrkdirs/usr/ports/archivers/snappy-java/work/snappy-java-1.1.7.5 && /usr/bin/env JAVA_HOME=/usr/local/openjdk8 XDG_DATA_HOME=/wrkdirs/usr/ports/archivers/snappy-java/work  XDG_CONFIG_HOME=/wrkdirs/usr/ports/archivers/snappy-java/work  HOME=/wrkdirs/usr/ports/archivers/snappy-java/work TMPDIR="/tmp" PATH=/wrkdirs/usr/ports/archivers/snappy-java/work/.bin:/sbin:/bin:/usr/sbin:/usr/bin:/usr/local/sbin:/usr/local/bin:/root/bin NO_PIE=yes MK_DEBUG_FILES=no MK_KERNEL_SYMBOLS=no SHELL=/bin/sh NO_LINT=YES PREFIX=/usr/local  LOCALBASE=/usr/local  CC="cc" CFLAGS="-O2 -pipe  -fstack-protector-strong -fno-strict-aliasing "  CPP="cpp" CPPFLAGS=""  LDFLAGS=" -fstack-protector-strong " LIBS=""  CXX="c++" CXXFLAGS="-O2 -pipe -fstack-protector-strong -fno-strict-aliasing  "  MANPREFIX="/usr/local" BSD_INSTALL_PROGRAM="install  -s -m 555"  BSD_INSTALL_LIB="install  -s -m 0644"  BSD_INSTALL_SCRIPT="install  -m 555"  BSD_INSTALL_DATA="install  -m 0644"  BSD_INSTALL_MAN="install  -m 444"  gmake CXX="
 c++" DESTDIR=/wrkdirs/usr/ports/archivers/snappy-java/work/stage SBT_IVY_HOME=/wrkdirs/usr/ports/archivers/snappy-java/work/repository SBT_BOOT_DIR=/wrkdirs/usr/ports/archivers/snappy-java/work/sbt_boot SBT_GLOBAL_DIR=/wrkdirs/usr/ports/archivers/snappy-java/work/sbt_global
gmake[1]: Entering directory '/wrkdirs/usr/ports/archivers/snappy-java/work/snappy-java-1.1.7.5'
/bin/sh: perl: not found
tar xvfz target/snappy-1.1.7.tar.gz -C target
x snappy-1.1.7/
x snappy-1.1.7/.appveyor.yml
x snappy-1.1.7/.travis.yml
x snappy-1.1.7/AUTHORS
x snappy-1.1.7/CMakeLists.txt
x snappy-1.1.7/CONTRIBUTING.md
x snappy-1.1.7/COPYING
x snappy-1.1.7/NEWS
x snappy-1.1.7/README.md
x snappy-1.1.7/cmake/
x snappy-1.1.7/cmake/SnappyConfig.cmake
x snappy-1.1.7/cmake/config.h.in
x snappy-1.1.7/format_description.txt
x snappy-1.1.7/framing_format.txt
x snappy-1.1.7/snappy-c.cc
x snappy-1.1.7/snappy-c.h
x snappy-1.1.7/snappy-internal.h
x snappy-1.1.7/snappy-sinksource.cc
x snappy-1.1.7/snappy-sinksource.h
x snappy-1.1.7/snappy-stubs-internal.cc
x snappy-1.1.7/snappy-stubs-internal.h
x snappy-1.1.7/snappy-stubs-public.h.in
x snappy-1.1.7/snappy-test.cc
x snappy-1.1.7/snappy-test.h
x snappy-1.1.7/snappy.cc
x snappy-1.1.7/snappy.h
x snappy-1.1.7/snappy_unittest.cc
x snappy-1.1.7/testdata/
x snappy-1.1.7/testdata/alice29.txt
x snappy-1.1.7/testdata/asyoulik.txt
x snappy-1.1.7/testdata/baddata1.snappy
x snappy-1.1.7/testdata/baddata2.snappy
x snappy-1.1.7/testdata/baddata3.snappy
x snappy-1.1.7/testdata/fireworks.jpeg
x snappy-1.1.7/testdata/geo.protodata
x snappy-1.1.7/testdata/html
x snappy-1.1.7/testdata/html_x_4
x snappy-1.1.7/testdata/kppkn.gtb
x snappy-1.1.7/testdata/lcet10.txt
x snappy-1.1.7/testdata/paper-100k.pdf
x snappy-1.1.7/testdata/plrabn12.txt
x snappy-1.1.7/testdata/urls.10K
touch target/snappy-extracted.log
tar xvfz target/bitshuffle-0.3.2.tar.gz -C target
x bitshuffle-0.3.2/
x bitshuffle-0.3.2/.gitignore
x bitshuffle-0.3.2/.travis.yml
x bitshuffle-0.3.2/LICENSE
x bitshuffle-0.3.2/MANIFEST.in
x bitshuffle-0.3.2/README.rst
x bitshuffle-0.3.2/bitshuffle/
x bitshuffle-0.3.2/bitshuffle/__init__.py
x bitshuffle-0.3.2/bitshuffle/ext.pyx
x bitshuffle-0.3.2/bitshuffle/h5.pyx
x bitshuffle-0.3.2/bitshuffle/tests/
x bitshuffle-0.3.2/bitshuffle/tests/__init__.py
x bitshuffle-0.3.2/bitshuffle/tests/data/
x bitshuffle-0.3.2/bitshuffle/tests/data/regression_0.1.3.h5
x bitshuffle-0.3.2/bitshuffle/tests/make_regression_tdata.py
x bitshuffle-0.3.2/bitshuffle/tests/test_ext.py
x bitshuffle-0.3.2/bitshuffle/tests/test_h5filter.py
x bitshuffle-0.3.2/bitshuffle/tests/test_h5plugin.py
x bitshuffle-0.3.2/bitshuffle/tests/test_regression.py
x bitshuffle-0.3.2/conda-recipe/
x bitshuffle-0.3.2/conda-recipe/bld.bat
x bitshuffle-0.3.2/conda-recipe/build.sh
x bitshuffle-0.3.2/conda-recipe/meta.yaml
x bitshuffle-0.3.2/conda-recipe/setup.py.patch
x bitshuffle-0.3.2/lz4/
x bitshuffle-0.3.2/lz4/LICENSE
x bitshuffle-0.3.2/lz4/README.md
x bitshuffle-0.3.2/lz4/lz4.c
x bitshuffle-0.3.2/lz4/lz4.h
x bitshuffle-0.3.2/lzf/
x bitshuffle-0.3.2/lzf/LICENSE.txt
x bitshuffle-0.3.2/lzf/README.txt
x bitshuffle-0.3.2/lzf/README_bitshuffle.txt
x bitshuffle-0.3.2/lzf/example.c
x bitshuffle-0.3.2/lzf/lzf/
x bitshuffle-0.3.2/lzf/lzf/lzf.h
x bitshuffle-0.3.2/lzf/lzf/lzfP.h
x bitshuffle-0.3.2/lzf/lzf/lzf_c.c
x bitshuffle-0.3.2/lzf/lzf/lzf_d.c
x bitshuffle-0.3.2/lzf/lzf_filter.c
x bitshuffle-0.3.2/lzf/lzf_filter.h
x bitshuffle-0.3.2/requirements.txt
x bitshuffle-0.3.2/setup.cfg.example
x bitshuffle-0.3.2/setup.py
x bitshuffle-0.3.2/src/
x bitshuffle-0.3.2/src/bitshuffle.c
x bitshuffle-0.3.2/src/bitshuffle.h
x bitshuffle-0.3.2/src/bitshuffle_core.c
x bitshuffle-0.3.2/src/bitshuffle_core.h
x bitshuffle-0.3.2/src/bitshuffle_internals.h
x bitshuffle-0.3.2/src/bshuf_h5filter.c
x bitshuffle-0.3.2/src/bshuf_h5filter.h
x bitshuffle-0.3.2/src/bshuf_h5plugin.c
x bitshuffle-0.3.2/src/iochain.c
x bitshuffle-0.3.2/src/iochain.h
x bitshuffle-0.3.2/src/lzf_h5plugin.c
touch target/bitshuffle-extracted.log
"$JAVA_HOME/bin/javac" -source 1.7 -target 1.7 -h src/main/java/org/xerial/snappy/ -d target/jni-classes -sourcepath src/main/java src/main/java/org/xerial/snappy/SnappyNative.java
warning: [options] bootstrap class path not set in conjunction with -source 1.7
1 warning
"$JAVA_HOME/bin/javac" -source 1.7 -target 1.7 -h src/main/java/org/xerial/snappy/ -d target/jni-classes -sourcepath src/main/java src/main/java/org/xerial/snappy/BitShuffleNative.java
warning: [options] bootstrap class path not set in conjunction with -source 1.7
1 warning
cd target/snappy-1.1.7-Default && cmake  ../../target/snappy-1.1.7
-- The C compiler identification is Clang 11.0.1
-- The CXX compiler identification is Clang 11.0.1
-- Detecting C compiler ABI info
-- Detecting C compiler ABI info - done
-- Check for working C compiler: /usr/bin/cc - skipped
-- Detecting C compile features
-- Detecting C compile features - done
-- Detecting CXX compiler ABI info
-- Detecting CXX compiler ABI info - done
-- Check for working CXX compiler: /usr/bin/c++ - skipped
-- Detecting CXX compile features
-- Detecting CXX compile features - done
-- Looking for byteswap.h
-- Looking for byteswap.h - not found
-- Looking for stddef.h
-- Looking for stddef.h - found
-- Looking for stdint.h
-- Looking for stdint.h - found
-- Looking for sys/endian.h
-- Looking for sys/endian.h - found
-- Looking for sys/mman.h
-- Looking for sys/mman.h - found
-- Looking for sys/resource.h
-- Looking for sys/resource.h - found
-- Looking for sys/time.h
-- Looking for sys/time.h - found
-- Looking for sys/uio.h
-- Looking for sys/uio.h - found
-- Looking for unistd.h
-- Looking for unistd.h - found
-- Looking for windows.h
-- Looking for windows.h - not found
-- Looking for zlibVersion in z
-- Looking for zlibVersion in z - found
-- Looking for lzo1x_1_15_compress in lzo2
-- Looking for lzo1x_1_15_compress in lzo2 - not found
-- Performing Test HAVE_BUILTIN_EXPECT
-- Performing Test HAVE_BUILTIN_EXPECT - Success
-- Performing Test HAVE_BUILTIN_CTZ
-- Performing Test HAVE_BUILTIN_CTZ - Success
-- Looking for mmap
-- Looking for mmap - found
-- Looking for sysconf
-- Looking for sysconf - found
-- Configuring done
-- Generating done
-- Build files have been written to: /wrkdirs/usr/ports/archivers/snappy-java/work/snappy-java-1.1.7.5/target/snappy-1.1.7-Default
touch target/snappy-1.1.7-Default/CMakeCache.txt
c++  -I/usr/local/openjdk8/include -Ilib/inc_mac -O2 -fPIC -fvisibility=hidden -DHAVE_CONFIG_H -I"/usr/local/openjdk8/include/freebsd" -Itarget/snappy-1.1.7 -Itarget/snappy-1.1.7-Default -Itarget/bitshuffle-0.3.2/src -c target/snappy-1.1.7/snappy-sinksource.cc -o target/snappy-1.1.7-Default/snappy-sinksource.o
c++  -I/usr/local/openjdk8/include -Ilib/inc_mac -O2 -fPIC -fvisibility=hidden -DHAVE_CONFIG_H -I"/usr/local/openjdk8/include/freebsd" -Itarget/snappy-1.1.7 -Itarget/snappy-1.1.7-Default -Itarget/bitshuffle-0.3.2/src -c target/snappy-1.1.7/snappy-stubs-internal.cc -o target/snappy-1.1.7-Default/snappy-stubs-internal.o
c++  -I/usr/local/openjdk8/include -Ilib/inc_mac -O2 -fPIC -fvisibility=hidden -DHAVE_CONFIG_H -I"/usr/local/openjdk8/include/freebsd" -Itarget/snappy-1.1.7 -Itarget/snappy-1.1.7-Default -Itarget/bitshuffle-0.3.2/src -c target/snappy-1.1.7/snappy.cc -o target/snappy-1.1.7-Default/snappy.o
c++ -I/usr/local/openjdk8/include -Ilib/inc_mac -O2 -fPIC -fvisibility=hidden -DHAVE_CONFIG_H -I"/usr/local/openjdk8/include/freebsd" -Itarget/snappy-1.1.7 -Itarget/snappy-1.1.7-Default -Itarget/bitshuffle-0.3.2/src -U__AVX2__ -U__SSE2__ -c target/bitshuffle-0.3.2/src/bitshuffle_core.c -o target/snappy-1.1.7-Default/bitshuffle_core.o
c++: warning: treating 'c' input as 'c++' when in C++ mode, this behavior is deprecated [-Wdeprecated]
c++ -I/usr/local/openjdk8/include -Ilib/inc_mac -O2 -fPIC -fvisibility=hidden -DHAVE_CONFIG_H -I"/usr/local/openjdk8/include/freebsd" -Itarget/snappy-1.1.7 -Itarget/snappy-1.1.7-Default -Itarget/bitshuffle-0.3.2/src -U__AVX2__ -U__SSE2__ -c target/bitshuffle-0.3.2/src/iochain.c -o target/snappy-1.1.7-Default/iochain.o
c++: warning: treating 'c' input as 'c++' when in C++ mode, this behavior is deprecated [-Wdeprecated]
c++  -I/usr/local/openjdk8/include -Ilib/inc_mac -O2 -fPIC -fvisibility=hidden -DHAVE_CONFIG_H -I"/usr/local/openjdk8/include/freebsd" -Itarget/snappy-1.1.7 -Itarget/snappy-1.1.7-Default -Itarget/bitshuffle-0.3.2/src -c src/main/java/org/xerial/snappy/SnappyNative.cpp -o target/snappy-1.1.7-Default/SnappyNative.o
c++ -I/usr/local/openjdk8/include -Ilib/inc_mac -O2 -fPIC -fvisibility=hidden -DHAVE_CONFIG_H -I"/usr/local/openjdk8/include/freebsd" -Itarget/snappy-1.1.7 -Itarget/snappy-1.1.7-Default -Itarget/bitshuffle-0.3.2/src -c src/main/java/org/xerial/snappy/BitShuffleNative.cpp -o target/snappy-1.1.7-Default/BitShuffleNative.o
c++ -I/usr/local/openjdk8/include -Ilib/inc_mac -O2 -fPIC -fvisibility=hidden -DHAVE_CONFIG_H -I"/usr/local/openjdk8/include/freebsd" -Itarget/snappy-1.1.7 -Itarget/snappy-1.1.7-Default -Itarget/bitshuffle-0.3.2/src -o target/snappy-1.1.7-Default/libsnappyjava.so target/snappy-1.1.7-Default/snappy-sinksource.o target/snappy-1.1.7-Default/snappy-stubs-internal.o target/snappy-1.1.7-Default/snappy.o target/snappy-1.1.7-Default/bitshuffle_core.o target/snappy-1.1.7-Default/iochain.o target/snappy-1.1.7-Default/SnappyNative.o target/snappy-1.1.7-Default/BitShuffleNative.o -shared -static
ld: error: undefined symbol: environ
>>> referenced by auxv.c
>>>               auxv.o:(.toc+0x8) in archive /usr/lib/libc.a
>>> referenced by getenv.c
>>>               getenv.o:(.toc+0x0) in archive /usr/lib/libc.a
>>> referenced by exec.c
>>>               exec.o:(.toc+0x8) in archive /usr/lib/libc.a

ld: error: undefined symbol: __progname
>>> referenced by getprogname.c
>>>               getprogname.o:(.toc+0x0) in archive /usr/lib/libc.a
c++: error: linker command failed with exit code 1 (use -v to see invocation)
gmake[1]: *** [Makefile:123: target/snappy-1.1.7-Default/libsnappyjava.so] Error 1
gmake[1]: Leaving directory '/wrkdirs/usr/ports/archivers/snappy-java/work/snappy-java-1.1.7.5'
*** Error code 2

Stop.
make: stopped in /usr/ports/archivers/snappy-java
Received on Tue Jul 27 2021 - 06:17:46 UTC

Original text of this message