[package - 130powerpc64-quarterly][lang/libobjc2] Failed for libobjc2-2.1_3 in build

From: <pkg-fallout_at_FreeBSD.org>
Date: Tue, 27 Jul 2021 06:15:31 GMT
You are receiving this mail as a port that you maintain
is failing to build on the FreeBSD package build server.
Please investigate the failure and submit a PR to fix
build.

Maintainer:     ports_at_FreeBSD.org
Log URL:        http://foul1.nyi.freebsd.org/data/130powerpc64-quarterly/861e2a11357f/logs/libobjc2-2.1_3.log
Build URL:      http://foul1.nyi.freebsd.org/build.html?mastername=130powerpc64-quarterly&build=861e2a11357f
Log:

=>> Building lang/libobjc2
build started at Tue Jul 27 06:14:26 UTC 2021
port directory: /usr/ports/lang/libobjc2
package name: libobjc2-2.1_3
building for: FreeBSD 130powerpc64-quarterly-job-05 13.0-RELEASE FreeBSD 13.0-RELEASE powerpc
maintained by: ports_at_FreeBSD.org
Makefile ident: 
Poudriere version: 3.2.8-16-g00a37fcb
Host OSVERSION: 1400008
Jail OSVERSION: 1300139
Job Id: 05

---Begin Environment---
SHELL=/bin/csh
OSVERSION=1300139
UNAME_v=FreeBSD 13.0-RELEASE
UNAME_r=13.0-RELEASE
BLOCKSIZE=K
MAIL=/var/mail/root
MM_CHARSET=UTF-8
LANG=C.UTF-8
STATUS=1
HOME=/root
PATH=/sbin:/bin:/usr/sbin:/usr/bin:/usr/local/sbin:/usr/local/bin:/root/bin
LOCALBASE=/usr/local
USER=root
LIBEXECPREFIX=/usr/local/libexec/poudriere
POUDRIERE_VERSION=3.2.8-16-g00a37fcb
MASTERMNT=/usr/local/poudriere/data/.m/130powerpc64-quarterly/ref
POUDRIERE_BUILD_TYPE=bulk
PACKAGE_BUILDING=yes
SAVED_TERM=
PWD=/usr/local/poudriere/data/.m/130powerpc64-quarterly/ref/.p/pool
P_PORTS_FEATURES=FLAVORS SELECTED_OPTIONS
MASTERNAME=130powerpc64-quarterly
SCRIPTPREFIX=/usr/local/share/poudriere
OLDPWD=/usr/local/poudriere/data/.m/130powerpc64-quarterly/ref/.p
SCRIPTPATH=/usr/local/share/poudriere/bulk.sh
POUDRIEREPATH=/usr/local/bin/poudriere
---End Environment---

---Begin Poudriere Port Flags/Env---
PORT_FLAGS=
PKGENV=
FLAVOR=
DEPENDS_ARGS=
MAKE_ARGS=
---End Poudriere Port Flags/Env---

---Begin OPTIONS List---
---End OPTIONS List---

--MAINTAINER--
ports_at_FreeBSD.org
--End MAINTAINER--

--CONFIGURE_ARGS--

--End CONFIGURE_ARGS--

--CONFIGURE_ENV--
OBJC="cc" OBJCFLAGS=" -O2 -pipe  -fno-strict-aliasing  -Wno-import" XDG_DATA_HOME=/wrkdirs/usr/ports/lang/libobjc2/work  XDG_CONFIG_HOME=/wrkdirs/usr/ports/lang/libobjc2/work  HOME=/wrkdirs/usr/ports/lang/libobjc2/work TMPDIR="/tmp" PATH=/wrkdirs/usr/ports/lang/libobjc2/work/.bin:/sbin:/bin:/usr/sbin:/usr/bin:/usr/local/sbin:/usr/local/bin:/root/bin SHELL=/bin/sh CONFIG_SHELL=/bin/sh
--End CONFIGURE_ENV--

--MAKE_ENV--
NINJA_STATUS="[%p %s/%t] " OBJC="cc" OBJCFLAGS=" -O2 -pipe  -fno-strict-aliasing  -Wno-import" XDG_DATA_HOME=/wrkdirs/usr/ports/lang/libobjc2/work  XDG_CONFIG_HOME=/wrkdirs/usr/ports/lang/libobjc2/work  HOME=/wrkdirs/usr/ports/lang/libobjc2/work TMPDIR="/tmp" PATH=/wrkdirs/usr/ports/lang/libobjc2/work/.bin:/sbin:/bin:/usr/sbin:/usr/bin:/usr/local/sbin:/usr/local/bin:/root/bin NO_PIE=yes MK_DEBUG_FILES=no MK_KERNEL_SYMBOLS=no SHELL=/bin/sh NO_LINT=YES DESTDIR=/wrkdirs/usr/ports/lang/libobjc2/work/stage PREFIX=/usr/local  LOCALBASE=/usr/local  CC="cc" CFLAGS="-O2 -pipe  -fno-strict-aliasing "  CPP="cpp" CPPFLAGS=""  LDFLAGS=" -lm " LIBS=""  CXX="c++" CXXFLAGS="-O2 -pipe -fno-strict-aliasing  "  MANPREFIX="/usr/local" BSD_INSTALL_PROGRAM="install  -s -m 555"  BSD_INSTALL_LIB="install  -s -m 0644"  BSD_INSTALL_SCRIPT="install  -m 555"  BSD_INSTALL_DATA="install  -m 0644"  BSD_INSTALL_MAN="install  -m 444"
--End MAKE_ENV--

--PLIST_SUB--
SHLIB_MAJOR=4 SHLIB_MINOR=6 CMAKE_BUILD_TYPE="release" OSREL=13.0 PREFIX=%D LOCALBASE=/usr/local  RESETPREFIX=/usr/local LIB32DIR=lib DOCSDIR="share/doc/libobjc2"  EXAMPLESDIR="share/examples/libobjc2"  DATADIR="share/libobjc2"  WWWDIR="www/libobjc2"  ETCDIR="etc/libobjc2"
--End PLIST_SUB--

--SUB_LIST--
PREFIX=/usr/local LOCALBASE=/usr/local  DATADIR=/usr/local/share/libobjc2 DOCSDIR=/usr/local/share/doc/libobjc2 EXAMPLESDIR=/usr/local/share/examples/libobjc2  WWWDIR=/usr/local/www/libobjc2 ETCDIR=/usr/local/etc/libobjc2
--End SUB_LIST--

---Begin make.conf---
USE_PACKAGE_DEPENDS=yes
BATCH=yes
WRKDIRPREFIX=/wrkdirs
PORTSDIR=/usr/ports
PACKAGES=/packages
DISTDIR=/distfiles
PACKAGE_BUILDING=yes
PACKAGE_BUILDING_FLAVORS=yes
#### /usr/local/etc/poudriere.d/make.conf ####
# XXX: We really need this but cannot use it while 'make checksum' does not
# try the next mirror on checksum failure.  It currently retries the same
# failed mirror and then fails rather then trying another.  It *does*
# try the next if the size is mismatched though.
#MASTER_SITE_FREEBSD=yes
# Build ALLOW_MAKE_JOBS_PACKAGES with 2 jobs
MAKE_JOBS_NUMBER=2
#### /usr/ports/Mk/Scripts/ports_env.sh ####
_CCVERSION_921dbbb2=FreeBSD clang version 11.0.1 (git_at_github.com:llvm/llvm-project.git llvmorg-11.0.1-0-g43ff75f2c3fe) Target: powerpc64-unknown-freebsd13.0 Thread model: posix InstalledDir: /usr/bin
_ALTCCVERSION_921dbbb2=none
_CXXINTERNAL_acaad9ca=FreeBSD clang version 11.0.1 (git_at_github.com:llvm/llvm-project.git llvmorg-11.0.1-0-g43ff75f2c3fe) Target: powerpc64-unknown-freebsd13.0 Thread model: posix InstalledDir: /usr/bin "/usr/bin/ld" "--eh-frame-hdr" "-dynamic-linker" "/libexec/ld-elf.so.1" "--enable-new-dtags" "-o" "a.out" "/usr/lib/crt1.o" "/usr/lib/crti.o" "/usr/lib/crtbegin.o" "-L/usr/lib" "/dev/null" "-lc++" "-lm" "-lgcc" "--as-needed" "-lgcc_s" "--no-as-needed" "-lc" "-lgcc" "--as-needed" "-lgcc_s" "--no-as-needed" "/usr/lib/crtend.o" "/usr/lib/crtn.o"
CC_OUTPUT_921dbbb2_58173849=yes
CC_OUTPUT_921dbbb2_9bdba57c=yes
CC_OUTPUT_921dbbb2_6a4fe7f5=yes
CC_OUTPUT_921dbbb2_6bcac02b=yes
CC_OUTPUT_921dbbb2_67d20829=yes
CC_OUTPUT_921dbbb2_bfa62e83=yes
CC_OUTPUT_921dbbb2_f0b4d593=yes
CC_OUTPUT_921dbbb2_308abb44=yes
CC_OUTPUT_921dbbb2_f00456e5=yes
CC_OUTPUT_921dbbb2_65ad290d=yes
CC_OUTPUT_921dbbb2_f2776b26=yes
CC_OUTPUT_921dbbb2_b2657cc3=yes
CC_OUTPUT_921dbbb2_380987f7=yes
CC_OUTPUT_921dbbb2_160933ec=yes
CC_OUTPUT_921dbbb2_fb62803b=yes
_OBJC_CCVERSION_921dbbb2=FreeBSD clang version 11.0.1 (git_at_github.com:llvm/llvm-project.git llvmorg-11.0.1-0-g43ff75f2c3fe) Target: powerpc64-unknown-freebsd13.0 Thread model: posix InstalledDir: /usr/bin
_OBJC_ALTCCVERSION_921dbbb2=none
ARCH=powerpc64
PPC_ABI=ELFv2
OPSYS=FreeBSD
_OSRELEASE=13.0-RELEASE
OSREL=13.0
OSVERSION=1300139
PYTHONBASE=/usr/local
CONFIGURE_MAX_CMD_LEN=524288
HAVE_PORTS_ENV=1
#### Misc Poudriere ####
GID=0
UID=0
---End make.conf---
--Resource limits--
cpu time               (seconds, -t)  unlimited
file size           (512-blocks, -f)  unlimited
data seg size           (kbytes, -d)  33554432
stack size              (kbytes, -s)  524288
core file size      (512-blocks, -c)  unlimited
max memory size         (kbytes, -m)  unlimited
locked memory           (kbytes, -l)  unlimited
max user processes              (-u)  89999
open files                      (-n)  1024
virtual mem size        (kbytes, -v)  unlimited
swap limit              (kbytes, -w)  unlimited
socket buffer size       (bytes, -b)  unlimited
pseudo-terminals                (-p)  unlimited
kqueues                         (-k)  unlimited
umtx shared locks               (-o)  unlimited
--End resource limits--
=======================<phase: check-sanity   >============================
===>   NOTICE:

The libobjc2 port currently does not have a maintainer. As a result, it is
more likely to have unresolved issues, not be up-to-date, or even be removed in
the future. To volunteer to maintain this port, please create an issue at:

https://bugs.freebsd.org/bugzilla

More information about port maintainership is available at:

https://docs.freebsd.org/en/articles/contributing/#ports-contributing

===>  License MIT accepted by the user
===========================================================================
=======================<phase: pkg-depends    >============================
===>   libobjc2-2.1_3 depends on file: /usr/local/sbin/pkg - not found
===>   Installing existing package /packages/All/pkg-1.16.3.txz
[130powerpc64-quarterly-job-05] Installing pkg-1.16.3...
[130powerpc64-quarterly-job-05] Extracting pkg-1.16.3: .......... done
===>   libobjc2-2.1_3 depends on file: /usr/local/sbin/pkg - found
===>   Returning to build of libobjc2-2.1_3
===========================================================================
=======================<phase: fetch-depends  >============================
===========================================================================
=======================<phase: fetch          >============================
===>   NOTICE:

The libobjc2 port currently does not have a maintainer. As a result, it is
more likely to have unresolved issues, not be up-to-date, or even be removed in
the future. To volunteer to maintain this port, please create an issue at:

https://bugs.freebsd.org/bugzilla

More information about port maintainership is available at:

https://docs.freebsd.org/en/articles/contributing/#ports-contributing

===>  License MIT accepted by the user
===> Fetching all distfiles required by libobjc2-2.1_3 for building
===========================================================================
=======================<phase: checksum       >============================
===>   NOTICE:

The libobjc2 port currently does not have a maintainer. As a result, it is
more likely to have unresolved issues, not be up-to-date, or even be removed in
the future. To volunteer to maintain this port, please create an issue at:

https://bugs.freebsd.org/bugzilla

More information about port maintainership is available at:

https://docs.freebsd.org/en/articles/contributing/#ports-contributing

===>  License MIT accepted by the user
<snip>
[  3% 16/424] /usr/bin/cc -DCXA_ALLOCATE_EXCEPTION_SPECIFIER=noexcept -DGNUSTEP -DNO_LEGACY -DNO_SELECTOR_MISMATCH_WARNINGS -DOLDABI_COMPAT=1 -DTYPE_DEPENDENT_DISPATCH -D__OBJC_RUNTIME_INTERNAL__=1 -Dobjc_EXPORTS  -O2 -pipe  -fno-strict-aliasing -Xclang -fexceptions -Xclang -fobjc-exceptions -O3 -O2 -pipe  -fno-strict-aliasing -fPIC -MD -MT CMakeFiles/objc.dir/protocol.c.o -MF CMakeFiles/objc.dir/protocol.c.o.d -o CMakeFiles/objc.dir/protocol.c.o -c /wrkdirs/usr/ports/lang/libobjc2/work/libobjc2-2.1/protocol.c
[  3% 17/424] /usr/bin/cc -DCXA_ALLOCATE_EXCEPTION_SPECIFIER=noexcept -DGNUSTEP -DNO_LEGACY -DNO_SELECTOR_MISMATCH_WARNINGS -DOLDABI_COMPAT=1 -DTYPE_DEPENDENT_DISPATCH -D__OBJC_RUNTIME_INTERNAL__=1 -Dobjc_EXPORTS  -O2 -pipe  -fno-strict-aliasing -Xclang -fexceptions -Xclang -fobjc-exceptions -O3 -O2 -pipe  -fno-strict-aliasing -fPIC -MD -MT CMakeFiles/objc.dir/runtime.c.o -MF CMakeFiles/objc.dir/runtime.c.o.d -o CMakeFiles/objc.dir/runtime.c.o -c /wrkdirs/usr/ports/lang/libobjc2/work/libobjc2-2.1/runtime.c
[  4% 18/424] /usr/bin/cc -DCXA_ALLOCATE_EXCEPTION_SPECIFIER=noexcept -DGNUSTEP -DNO_LEGACY -DNO_SELECTOR_MISMATCH_WARNINGS -DOLDABI_COMPAT=1 -DTYPE_DEPENDENT_DISPATCH -D__OBJC_RUNTIME_INTERNAL__=1 -Dobjc_EXPORTS  -O2 -pipe  -fno-strict-aliasing -Xclang -fexceptions -Xclang -fobjc-exceptions -O3 -O2 -pipe  -fno-strict-aliasing -fPIC -MD -MT CMakeFiles/objc.dir/sarray2.c.o -MF CMakeFiles/objc.dir/sarray2.c.o.d -o CMakeFiles/objc.dir/sarray2.c.o -c /wrkdirs/usr/ports/lang/libobjc2/work/libobjc2-2.1/sarray2.c
[  4% 19/424] /usr/bin/cc -DCXA_ALLOCATE_EXCEPTION_SPECIFIER=noexcept -DGNUSTEP -DNO_LEGACY -DNO_SELECTOR_MISMATCH_WARNINGS -DOLDABI_COMPAT=1 -DTYPE_DEPENDENT_DISPATCH -D__OBJC_RUNTIME_INTERNAL__=1 -Dobjc_EXPORTS  -O2 -pipe  -fno-strict-aliasing -Xclang -fexceptions -Xclang -fobjc-exceptions -O3 -O2 -pipe  -fno-strict-aliasing -fPIC -MD -MT CMakeFiles/objc.dir/sendmsg2.c.o -MF CMakeFiles/objc.dir/sendmsg2.c.o.d -o CMakeFiles/objc.dir/sendmsg2.c.o -c /wrkdirs/usr/ports/lang/libobjc2/work/libobjc2-2.1/sendmsg2.c
[  4% 20/424] /usr/bin/cc -DCXA_ALLOCATE_EXCEPTION_SPECIFIER=noexcept -DGNUSTEP -DNO_LEGACY -DNO_SELECTOR_MISMATCH_WARNINGS -DOLDABI_COMPAT=1 -DTYPE_DEPENDENT_DISPATCH -D__OBJC_RUNTIME_INTERNAL__=1 -Dobjc_EXPORTS  -O2 -pipe  -fno-strict-aliasing -Xclang -fexceptions -Xclang -fobjc-exceptions -O3 -O2 -pipe  -fno-strict-aliasing -fPIC -MD -MT CMakeFiles/objc.dir/selector_table.c.o -MF CMakeFiles/objc.dir/selector_table.c.o.d -o CMakeFiles/objc.dir/selector_table.c.o -c /wrkdirs/usr/ports/lang/libobjc2/work/libobjc2-2.1/selector_table.c
[  4% 21/424] /usr/bin/cc -DCXA_ALLOCATE_EXCEPTION_SPECIFIER=noexcept -DGNUSTEP -DNO_LEGACY -DNO_SELECTOR_MISMATCH_WARNINGS -DOLDABI_COMPAT=1 -DTYPE_DEPENDENT_DISPATCH -D__OBJC_RUNTIME_INTERNAL__=1 -Dobjc_EXPORTS  -O2 -pipe  -fno-strict-aliasing -Xclang -fexceptions -Xclang -fobjc-exceptions -O3 -O2 -pipe  -fno-strict-aliasing -fPIC -MD -MT CMakeFiles/objc.dir/eh_personality.c.o -MF CMakeFiles/objc.dir/eh_personality.c.o.d -o CMakeFiles/objc.dir/eh_personality.c.o -c /wrkdirs/usr/ports/lang/libobjc2/work/libobjc2-2.1/eh_personality.c
[  4% 22/424] /usr/bin/cc -DCXA_ALLOCATE_EXCEPTION_SPECIFIER=noexcept -DGNUSTEP -DNO_LEGACY -DNO_SELECTOR_MISMATCH_WARNINGS -DOLDABI_COMPAT=1 -DTYPE_DEPENDENT_DISPATCH -D__OBJC_RUNTIME_INTERNAL__=1 -Dobjc_EXPORTS  -O2 -pipe  -fno-strict-aliasing -Xclang -fexceptions -Xclang -fobjc-exceptions -O3 -O2 -pipe  -fno-strict-aliasing -fPIC -MD -MT CMakeFiles/objc.dir/legacy.c.o -MF CMakeFiles/objc.dir/legacy.c.o.d -o CMakeFiles/objc.dir/legacy.c.o -c /wrkdirs/usr/ports/lang/libobjc2/work/libobjc2-2.1/legacy.c
[  5% 23/424] /usr/bin/cc -DCXA_ALLOCATE_EXCEPTION_SPECIFIER=noexcept -DGNUSTEP -DNO_LEGACY -DNO_SELECTOR_MISMATCH_WARNINGS -DOLDABI_COMPAT=1 -DTYPE_DEPENDENT_DISPATCH -D__OBJC_RUNTIME_INTERNAL__=1 -Dobjc_EXPORTS  -O2 -pipe  -fno-strict-aliasing -Xclang -fexceptions -Xclang -fobjc-exceptions -O3 -O2 -pipe  -fno-strict-aliasing -fPIC -MD -MT CMakeFiles/objc.dir/abi_version.c.o -MF CMakeFiles/objc.dir/abi_version.c.o.d -o CMakeFiles/objc.dir/abi_version.c.o -c /wrkdirs/usr/ports/lang/libobjc2/work/libobjc2-2.1/abi_version.c
[  5% 24/424] /usr/bin/cc -DCXA_ALLOCATE_EXCEPTION_SPECIFIER=noexcept -DGNUSTEP -DNO_LEGACY -DNO_SELECTOR_MISMATCH_WARNINGS -DOLDABI_COMPAT=1 -DTYPE_DEPENDENT_DISPATCH -D__OBJC_RUNTIME_INTERNAL__=1 -Dobjc_EXPORTS  -O2 -pipe  -fno-strict-aliasing -Xclang -fexceptions -Xclang -fobjc-exceptions -O3 -O2 -pipe  -fno-strict-aliasing -fPIC -MD -MT CMakeFiles/objc.dir/statics_loader.c.o -MF CMakeFiles/objc.dir/statics_loader.c.o.d -o CMakeFiles/objc.dir/statics_loader.c.o -c /wrkdirs/usr/ports/lang/libobjc2/work/libobjc2-2.1/statics_loader.c
[  5% 25/424] /usr/bin/cc -DCXA_ALLOCATE_EXCEPTION_SPECIFIER=noexcept -DGNUSTEP -DNO_LEGACY -DNO_SELECTOR_MISMATCH_WARNINGS -DOLDABI_COMPAT=1 -DTYPE_DEPENDENT_DISPATCH -D__OBJC_RUNTIME_INTERNAL__=1 -Dobjc_EXPORTS  -O3 -DNDEBUG -fPIC  -Wno-deprecated-objc-isa-usage -Wno-objc-root-class -fobjc-runtime=gnustep-2.0 -Xclang -x -Xclang assembler-with-cpp -MD -MT CMakeFiles/objc.dir/objc_msgSend.S.o -MF CMakeFiles/objc.dir/objc_msgSend.S.o.d -o CMakeFiles/objc.dir/objc_msgSend.S.o -c /wrkdirs/usr/ports/lang/libobjc2/work/libobjc2-2.1/objc_msgSend.S
/wrkdirs/usr/ports/lang/libobjc2/work/libobjc2-2.1/objc_msgSend.S:14:2: warning: objc_msgSend() not implemented for your architecture [-W#warnings]
#warning objc_msgSend() not implemented for your architecture
 ^
1 warning generated.
[  5% 26/424] /usr/bin/cc -DCXA_ALLOCATE_EXCEPTION_SPECIFIER=noexcept -DGNUSTEP -DNO_LEGACY -DNO_SELECTOR_MISMATCH_WARNINGS -DOLDABI_COMPAT=1 -DTYPE_DEPENDENT_DISPATCH -D__OBJC_RUNTIME_INTERNAL__=1 -Dobjc_EXPORTS  -O3 -DNDEBUG -fPIC  -Wno-deprecated-objc-isa-usage -Wno-objc-root-class -fobjc-runtime=gnustep-2.0 -Xclang -x -Xclang assembler-with-cpp -MD -MT CMakeFiles/objc.dir/block_trampolines.S.o -MF CMakeFiles/objc.dir/block_trampolines.S.o.d -o CMakeFiles/objc.dir/block_trampolines.S.o -c /wrkdirs/usr/ports/lang/libobjc2/work/libobjc2-2.1/block_trampolines.S
/wrkdirs/usr/ports/lang/libobjc2/work/libobjc2-2.1/block_trampolines.S:149:2: warning: imp_implementationWithBlock() not implemented for your architecture [-W#warnings]
#warning imp_implementationWithBlock() not implemented for your architecture
 ^
1 warning generated.
[  6% 27/424] /usr/bin/cc -DCXA_ALLOCATE_EXCEPTION_SPECIFIER=noexcept -DGNUSTEP -DNO_LEGACY -DNO_SELECTOR_MISMATCH_WARNINGS -DOLDABI_COMPAT=1 -DTYPE_DEPENDENT_DISPATCH -D__OBJC_RUNTIME_INTERNAL__=1 -Dobjc_EXPORTS  -O2 -pipe  -fno-strict-aliasing -Xclang -fexceptions -Xclang -fobjc-exceptions -O3 -O2 -pipe  -fno-strict-aliasing -fPIC  -Wno-deprecated-objc-isa-usage -Wno-objc-root-class -fobjc-runtime=gnustep-2.0 -Xclang -x -Xclang objective-c -MD -MT CMakeFiles/objc.dir/NSBlocks.m.o -MF CMakeFiles/objc.dir/NSBlocks.m.o.d -o CMakeFiles/objc.dir/NSBlocks.m.o -c /wrkdirs/usr/ports/lang/libobjc2/work/libobjc2-2.1/NSBlocks.m
[  6% 28/424] /usr/bin/cc -DCXA_ALLOCATE_EXCEPTION_SPECIFIER=noexcept -DGNUSTEP -DNO_LEGACY -DNO_SELECTOR_MISMATCH_WARNINGS -DOLDABI_COMPAT=1 -DTYPE_DEPENDENT_DISPATCH -D__OBJC_RUNTIME_INTERNAL__=1 -Dobjc_EXPORTS  -O3 -DNDEBUG -fPIC -MD -MT CMakeFiles/objc.dir/eh_trampoline.s.o -MF CMakeFiles/objc.dir/eh_trampoline.s.o.d -o CMakeFiles/objc.dir/eh_trampoline.s.o -c eh_trampoline.s
cc: warning: argument unused during compilation: '-D CXA_ALLOCATE_EXCEPTION_SPECIFIER=noexcept' [-Wunused-command-line-argument]
cc: warning: argument unused during compilation: '-D GNUSTEP' [-Wunused-command-line-argument]
cc: warning: argument unused during compilation: '-D NO_LEGACY' [-Wunused-command-line-argument]
cc: warning: argument unused during compilation: '-D NO_SELECTOR_MISMATCH_WARNINGS' [-Wunused-command-line-argument]
cc: warning: argument unused during compilation: '-D OLDABI_COMPAT=1' [-Wunused-command-line-argument]
cc: warning: argument unused during compilation: '-D TYPE_DEPENDENT_DISPATCH' [-Wunused-command-line-argument]
cc: warning: argument unused during compilation: '-D __OBJC_RUNTIME_INTERNAL__=1' [-Wunused-command-line-argument]
cc: warning: argument unused during compilation: '-D objc_EXPORTS' [-Wunused-command-line-argument]
cc: warning: argument unused during compilation: '-D NDEBUG' [-Wunused-command-line-argument]
cc: warning: argument unused during compilation: '-MD' [-Wunused-command-line-argument]
cc: warning: argument unused during compilation: '-MT CMakeFiles/objc.dir/eh_trampoline.s.o' [-Wunused-command-line-argument]
cc: warning: argument unused during compilation: '-MF CMakeFiles/objc.dir/eh_trampoline.s.o.d' [-Wunused-command-line-argument]
[  6% 29/424] /usr/bin/cc -DCXA_ALLOCATE_EXCEPTION_SPECIFIER=noexcept -DGNUSTEP -DNO_LEGACY -DNO_SELECTOR_MISMATCH_WARNINGS -DOLDABI_COMPAT=1 -DTYPE_DEPENDENT_DISPATCH -D__OBJC_RUNTIME_INTERNAL__=1 -Dobjc_EXPORTS  -O2 -pipe  -fno-strict-aliasing -Xclang -fexceptions -Xclang -fobjc-exceptions -O3 -O2 -pipe  -fno-strict-aliasing -fPIC  -Wno-deprecated-objc-isa-usage -Wno-objc-root-class -fobjc-runtime=gnustep-2.0 -Xclang -x -Xclang objective-c -MD -MT CMakeFiles/objc.dir/Protocol2.m.o -MF CMakeFiles/objc.dir/Protocol2.m.o.d -o CMakeFiles/objc.dir/Protocol2.m.o -c /wrkdirs/usr/ports/lang/libobjc2/work/libobjc2-2.1/Protocol2.m
[  6% 30/424] /usr/bin/cc -DCXA_ALLOCATE_EXCEPTION_SPECIFIER=noexcept -DGNUSTEP -DNO_LEGACY -DNO_SELECTOR_MISMATCH_WARNINGS -DOLDABI_COMPAT=1 -DTYPE_DEPENDENT_DISPATCH -D__OBJC_RUNTIME_INTERNAL__=1 -Dobjc_EXPORTS  -O2 -pipe  -fno-strict-aliasing -Xclang -fexceptions -Xclang -fobjc-exceptions -O3 -O2 -pipe  -fno-strict-aliasing -fPIC  -Wno-deprecated-objc-isa-usage -Wno-objc-root-class -fobjc-runtime=gnustep-2.0 -Xclang -x -Xclang objective-c -MD -MT CMakeFiles/objc.dir/associate.m.o -MF CMakeFiles/objc.dir/associate.m.o.d -o CMakeFiles/objc.dir/associate.m.o -c /wrkdirs/usr/ports/lang/libobjc2/work/libobjc2-2.1/associate.m
[  7% 31/424] /usr/bin/cc -DCXA_ALLOCATE_EXCEPTION_SPECIFIER=noexcept -DGNUSTEP -DNO_LEGACY -DNO_SELECTOR_MISMATCH_WARNINGS -DOLDABI_COMPAT=1 -DTYPE_DEPENDENT_DISPATCH -D__OBJC_RUNTIME_INTERNAL__=1 -Dobjc_EXPORTS  -O2 -pipe  -fno-strict-aliasing -Xclang -fexceptions -Xclang -fobjc-exceptions -O3 -O2 -pipe  -fno-strict-aliasing -fPIC  -Wno-deprecated-objc-isa-usage -Wno-objc-root-class -fobjc-runtime=gnustep-2.0 -Xclang -x -Xclang objective-c -MD -MT CMakeFiles/objc.dir/blocks_runtime.m.o -MF CMakeFiles/objc.dir/blocks_runtime.m.o.d -o CMakeFiles/objc.dir/blocks_runtime.m.o -c /wrkdirs/usr/ports/lang/libobjc2/work/libobjc2-2.1/blocks_runtime.m
[  7% 32/424] /usr/bin/cc -DCXA_ALLOCATE_EXCEPTION_SPECIFIER=noexcept -DGNUSTEP -DNO_LEGACY -DNO_SELECTOR_MISMATCH_WARNINGS -DOLDABI_COMPAT=1 -DTYPE_DEPENDENT_DISPATCH -D__OBJC_RUNTIME_INTERNAL__=1 -Dobjc_EXPORTS  -O2 -pipe  -fno-strict-aliasing -Xclang -fexceptions -Xclang -fobjc-exceptions -O3 -O2 -pipe  -fno-strict-aliasing -fPIC  -Wno-deprecated-objc-isa-usage -Wno-objc-root-class -fobjc-runtime=gnustep-2.0 -Xclang -x -Xclang objective-c -MD -MT CMakeFiles/objc.dir/gc_none.c.o -MF CMakeFiles/objc.dir/gc_none.c.o.d -o CMakeFiles/objc.dir/gc_none.c.o -c /wrkdirs/usr/ports/lang/libobjc2/work/libobjc2-2.1/gc_none.c
[  7% 33/424] /usr/bin/cc -DCXA_ALLOCATE_EXCEPTION_SPECIFIER=noexcept -DGNUSTEP -DNO_LEGACY -DNO_SELECTOR_MISMATCH_WARNINGS -DOLDABI_COMPAT=1 -DTYPE_DEPENDENT_DISPATCH -D__OBJC_RUNTIME_INTERNAL__=1 -Dobjc_EXPORTS  -O2 -pipe  -fno-strict-aliasing -Xclang -fexceptions -Xclang -fobjc-exceptions -O3 -O2 -pipe  -fno-strict-aliasing -fPIC  -Wno-deprecated-objc-isa-usage -Wno-objc-root-class -fobjc-runtime=gnustep-2.0 -Xclang -x -Xclang objective-c -MD -MT CMakeFiles/objc.dir/properties.m.o -MF CMakeFiles/objc.dir/properties.m.o.d -o CMakeFiles/objc.dir/properties.m.o -c /wrkdirs/usr/ports/lang/libobjc2/work/libobjc2-2.1/properties.m
[  7% 34/424] /usr/bin/c++ -DCXA_ALLOCATE_EXCEPTION_SPECIFIER=noexcept -DGNUSTEP -DNO_LEGACY -DNO_SELECTOR_MISMATCH_WARNINGS -DOLDABI_COMPAT=1 -DTYPE_DEPENDENT_DISPATCH -D__OBJC_RUNTIME_INTERNAL__=1 -Dobjc_EXPORTS  -O2 -pipe -fno-strict-aliasing -O2 -pipe -fno-strict-aliasing -fPIC -std=gnu++14 -MD -MT CMakeFiles/objc.dir/objcxx_eh.cc.o -MF CMakeFiles/objc.dir/objcxx_eh.cc.o.d -o CMakeFiles/objc.dir/objcxx_eh.cc.o -c /wrkdirs/usr/ports/lang/libobjc2/work/libobjc2-2.1/objcxx_eh.cc
[  8% 35/424] /usr/bin/c++ -DGNUSTEP -DNO_LEGACY -DNO_SELECTOR_MISMATCH_WARNINGS -DOLDABI_COMPAT=1 -DTYPE_DEPENDENT_DISPATCH -I/wrkdirs/usr/ports/lang/libobjc2/work/libobjc2-2.1 -O2 -pipe -fno-strict-aliasing -O2 -pipe -fno-strict-aliasing -Xclang -fblocks -Xclang -fobjc-exceptions -O3 -fobjc-runtime=gnustep-1.7 -UNDEBUG -std=gnu++14 -Xclang -fobjc-arc -MD -MT Test/CMakeFiles/ObjCXXEHInterop_arc_legacy_optimised.dir/ObjCXXEHInterop_arc.mm.o -MF Test/CMakeFiles/ObjCXXEHInterop_arc_legacy_optimised.dir/ObjCXXEHInterop_arc.mm.o.d -o Test/CMakeFiles/ObjCXXEHInterop_arc_legacy_optimised.dir/ObjCXXEHInterop_arc.mm.o -c /wrkdirs/usr/ports/lang/libobjc2/work/libobjc2-2.1/Test/ObjCXXEHInterop_arc.mm
[  8% 36/424] /usr/bin/cc -DGNUSTEP -DNO_LEGACY -DNO_SELECTOR_MISMATCH_WARNINGS -DOLDABI_COMPAT=1 -DTYPE_DEPENDENT_DISPATCH -I/wrkdirs/usr/ports/lang/libobjc2/work/libobjc2-2.1 -O2 -pipe  -fno-strict-aliasing -Xclang -fexceptions -Xclang -fobjc-exceptions -O3 -O2 -pipe  -fno-strict-aliasing -Xclang -fblocks -Xclang -fobjc-exceptions -O3 -fobjc-runtime=gnustep-1.7 -UNDEBUG -Xclang -fobjc-arc -MD -MT Test/CMakeFiles/ObjCXXEHInterop_arc_legacy_optimised.dir/ObjCXXEHInterop_arc.m.o -MF Test/CMakeFiles/ObjCXXEHInterop_arc_legacy_optimised.dir/ObjCXXEHInterop_arc.m.o.d -o Test/CMakeFiles/ObjCXXEHInterop_arc_legacy_optimised.dir/ObjCXXEHInterop_arc.m.o -c /wrkdirs/usr/ports/lang/libobjc2/work/libobjc2-2.1/Test/ObjCXXEHInterop_arc.m
[  8% 37/424] /usr/bin/c++ -DGNUSTEP -DNO_LEGACY -DNO_SELECTOR_MISMATCH_WARNINGS -DOLDABI_COMPAT=1 -DTYPE_DEPENDENT_DISPATCH -I/wrkdirs/usr/ports/lang/libobjc2/work/libobjc2-2.1 -O2 -pipe -fno-strict-aliasing -O2 -pipe -fno-strict-aliasing -Xclang -fblocks -Xclang -fobjc-exceptions -O0 -fobjc-runtime=gnustep-1.7 -UNDEBUG -std=gnu++14 -Xclang -fobjc-arc -MD -MT Test/CMakeFiles/ObjCXXEHInterop_arc_legacy.dir/ObjCXXEHInterop_arc.mm.o -MF Test/CMakeFiles/ObjCXXEHInterop_arc_legacy.dir/ObjCXXEHInterop_arc.mm.o.d -o Test/CMakeFiles/ObjCXXEHInterop_arc_legacy.dir/ObjCXXEHInterop_arc.mm.o -c /wrkdirs/usr/ports/lang/libobjc2/work/libobjc2-2.1/Test/ObjCXXEHInterop_arc.mm
[  8% 38/424] /usr/bin/cc -DGNUSTEP -DNO_LEGACY -DNO_SELECTOR_MISMATCH_WARNINGS -DOLDABI_COMPAT=1 -DTYPE_DEPENDENT_DISPATCH -I/wrkdirs/usr/ports/lang/libobjc2/work/libobjc2-2.1 -O2 -pipe  -fno-strict-aliasing -Xclang -fexceptions -Xclang -fobjc-exceptions -O3 -O2 -pipe  -fno-strict-aliasing -Xclang -fblocks -Xclang -fobjc-exceptions -O0 -fobjc-runtime=gnustep-1.7 -UNDEBUG -Xclang -fobjc-arc -MD -MT Test/CMakeFiles/ObjCXXEHInterop_arc_legacy.dir/ObjCXXEHInterop_arc.m.o -MF Test/CMakeFiles/ObjCXXEHInterop_arc_legacy.dir/ObjCXXEHInterop_arc.m.o.d -o Test/CMakeFiles/ObjCXXEHInterop_arc_legacy.dir/ObjCXXEHInterop_arc.m.o -c /wrkdirs/usr/ports/lang/libobjc2/work/libobjc2-2.1/Test/ObjCXXEHInterop_arc.m
[  8% 39/424] /usr/bin/c++ -DCXA_ALLOCATE_EXCEPTION_SPECIFIER=noexcept -DGNUSTEP -DNO_LEGACY -DNO_SELECTOR_MISMATCH_WARNINGS -DOLDABI_COMPAT=1 -DTYPE_DEPENDENT_DISPATCH -D__OBJC_RUNTIME_INTERNAL__=1 -Dobjc_EXPORTS  -O2 -pipe -fno-strict-aliasing -O2 -pipe -fno-strict-aliasing -fPIC -std=gnu++14  -Wno-deprecated-objc-isa-usage -Wno-objc-root-class -fobjc-runtime=gnustep-2.0 -Xclang -x -Xclang objective-c++ -MD -MT CMakeFiles/objc.dir/arc.mm.o -MF CMakeFiles/objc.dir/arc.mm.o.d -o CMakeFiles/objc.dir/arc.mm.o -c /wrkdirs/usr/ports/lang/libobjc2/work/libobjc2-2.1/arc.mm
[  9% 40/424] /usr/bin/c++ -DGNUSTEP -DNO_LEGACY -DNO_SELECTOR_MISMATCH_WARNINGS -DOLDABI_COMPAT=1 -DTYPE_DEPENDENT_DISPATCH -I/wrkdirs/usr/ports/lang/libobjc2/work/libobjc2-2.1 -O2 -pipe -fno-strict-aliasing -O2 -pipe -fno-strict-aliasing -Xclang -fblocks -Xclang -fobjc-exceptions -O3 -fobjc-runtime=gnustep-2.0 -UNDEBUG -DGS_RUNTIME_V2 -std=gnu++14 -Xclang -fobjc-arc -MD -MT Test/CMakeFiles/ObjCXXEHInterop_arc_optimised.dir/ObjCXXEHInterop_arc.mm.o -MF Test/CMakeFiles/ObjCXXEHInterop_arc_optimised.dir/ObjCXXEHInterop_arc.mm.o.d -o Test/CMakeFiles/ObjCXXEHInterop_arc_optimised.dir/ObjCXXEHInterop_arc.mm.o -c /wrkdirs/usr/ports/lang/libobjc2/work/libobjc2-2.1/Test/ObjCXXEHInterop_arc.mm
[  9% 41/424] /usr/bin/cc -DGNUSTEP -DNO_LEGACY -DNO_SELECTOR_MISMATCH_WARNINGS -DOLDABI_COMPAT=1 -DTYPE_DEPENDENT_DISPATCH -I/wrkdirs/usr/ports/lang/libobjc2/work/libobjc2-2.1 -O2 -pipe  -fno-strict-aliasing -Xclang -fexceptions -Xclang -fobjc-exceptions -O3 -O2 -pipe  -fno-strict-aliasing -Xclang -fblocks -Xclang -fobjc-exceptions -O3 -fobjc-runtime=gnustep-2.0 -UNDEBUG -DGS_RUNTIME_V2 -Xclang -fobjc-arc -MD -MT Test/CMakeFiles/ObjCXXEHInterop_arc_optimised.dir/ObjCXXEHInterop_arc.m.o -MF Test/CMakeFiles/ObjCXXEHInterop_arc_optimised.dir/ObjCXXEHInterop_arc.m.o.d -o Test/CMakeFiles/ObjCXXEHInterop_arc_optimised.dir/ObjCXXEHInterop_arc.m.o -c /wrkdirs/usr/ports/lang/libobjc2/work/libobjc2-2.1/Test/ObjCXXEHInterop_arc.m
[  9% 42/424] : && /usr/bin/cc -fPIC -O2 -pipe  -fno-strict-aliasing -Xclang -fexceptions -Xclang -fobjc-exceptions -O3 -O2 -pipe  -fno-strict-aliasing  -lm   -pthread -shared -Wl,-soname,libobjc.so.4.6 -o libobjc.so.4.6 CMakeFiles/objc.dir/alias_table.c.o CMakeFiles/objc.dir/block_to_imp.c.o CMakeFiles/objc.dir/caps.c.o CMakeFiles/objc.dir/category_loader.c.o CMakeFiles/objc.dir/class_table.c.o CMakeFiles/objc.dir/dtable.c.o CMakeFiles/objc.dir/encoding2.c.o CMakeFiles/objc.dir/hooks.c.o CMakeFiles/objc.dir/ivar.c.o CMakeFiles/objc.dir/loader.c.o CMakeFiles/objc.dir/mutation.m.o CMakeFiles/objc.dir/protocol.c.o CMakeFiles/objc.dir/runtime.c.o CMakeFiles/objc.dir/sarray2.c.o CMakeFiles/objc.dir/selector_table.c.o CMakeFiles/objc.dir/sendmsg2.c.o CMakeFiles/objc.dir/eh_personality.c.o CMakeFiles/objc.dir/legacy.c.o CMakeFiles/objc.dir/abi_version.c.o CMakeFiles/objc.dir/statics_loader.c.o CMakeFiles/objc.dir/block_trampolines.S.o CMakeFiles/objc.dir/objc_msgSend.S.o CMakeFiles/objc.di
 r/eh_trampoline.s.o CMakeFiles/objc.dir/NSBlocks.m.o CMakeFiles/objc.dir/Protocol2.m.o CMakeFiles/objc.dir/associate.m.o CMakeFiles/objc.dir/blocks_runtime.m.o CMakeFiles/objc.dir/properties.m.o CMakeFiles/objc.dir/gc_none.c.o CMakeFiles/objc.dir/arc.mm.o CMakeFiles/objc.dir/objcxx_eh.cc.o  -lcxxrt && :
[  9% 43/424] /usr/local/bin/cmake -E cmake_symlink_library libobjc.so.4.6 libobjc.so.4.6 libobjc.so && :
[ 10% 44/424] /usr/bin/c++ -DGNUSTEP -DNO_LEGACY -DNO_SELECTOR_MISMATCH_WARNINGS -DOLDABI_COMPAT=1 -DTYPE_DEPENDENT_DISPATCH -I/wrkdirs/usr/ports/lang/libobjc2/work/libobjc2-2.1 -O2 -pipe -fno-strict-aliasing -O2 -pipe -fno-strict-aliasing -Xclang -fblocks -Xclang -fobjc-exceptions -O0 -fobjc-runtime=gnustep-2.0 -UNDEBUG -DGS_RUNTIME_V2 -std=gnu++14 -Xclang -fobjc-arc -MD -MT Test/CMakeFiles/ObjCXXEHInterop_arc.dir/ObjCXXEHInterop_arc.mm.o -MF Test/CMakeFiles/ObjCXXEHInterop_arc.dir/ObjCXXEHInterop_arc.mm.o.d -o Test/CMakeFiles/ObjCXXEHInterop_arc.dir/ObjCXXEHInterop_arc.mm.o -c /wrkdirs/usr/ports/lang/libobjc2/work/libobjc2-2.1/Test/ObjCXXEHInterop_arc.mm
[ 10% 45/424] /usr/bin/cc -DGNUSTEP -DNO_LEGACY -DNO_SELECTOR_MISMATCH_WARNINGS -DOLDABI_COMPAT=1 -DTYPE_DEPENDENT_DISPATCH -I/wrkdirs/usr/ports/lang/libobjc2/work/libobjc2-2.1 -O2 -pipe  -fno-strict-aliasing -Xclang -fexceptions -Xclang -fobjc-exceptions -O3 -O2 -pipe  -fno-strict-aliasing -Xclang -fblocks -Xclang -fobjc-exceptions -O0 -fobjc-runtime=gnustep-2.0 -UNDEBUG -DGS_RUNTIME_V2 -Xclang -fobjc-arc -MD -MT Test/CMakeFiles/ObjCXXEHInterop_arc.dir/ObjCXXEHInterop_arc.m.o -MF Test/CMakeFiles/ObjCXXEHInterop_arc.dir/ObjCXXEHInterop_arc.m.o.d -o Test/CMakeFiles/ObjCXXEHInterop_arc.dir/ObjCXXEHInterop_arc.m.o -c /wrkdirs/usr/ports/lang/libobjc2/work/libobjc2-2.1/Test/ObjCXXEHInterop_arc.m
[ 10% 46/424] : && /usr/bin/cc -O2 -pipe  -fno-strict-aliasing -Xclang -fexceptions -Xclang -fobjc-exceptions -O3 -O2 -pipe  -fno-strict-aliasing -lm Test/CMakeFiles/test_runtime.dir/Test.m.o Test/CMakeFiles/ObjCXXEHInterop_arc_optimised.dir/ObjCXXEHInterop_arc.mm.o Test/CMakeFiles/ObjCXXEHInterop_arc_optimised.dir/ObjCXXEHInterop_arc.m.o -o Test/ObjCXXEHInterop_arc_optimised  -Wl,-rpath,/wrkdirs/usr/ports/lang/libobjc2/work/.build  libobjc.so.4.6  -lcxxrt && :
[ 10% 47/424] /usr/bin/c++ -DGNUSTEP -DNO_LEGACY -DNO_SELECTOR_MISMATCH_WARNINGS -DOLDABI_COMPAT=1 -DTYPE_DEPENDENT_DISPATCH -I/wrkdirs/usr/ports/lang/libobjc2/work/libobjc2-2.1 -O2 -pipe -fno-strict-aliasing -O2 -pipe -fno-strict-aliasing -Xclang -fblocks -Xclang -fobjc-exceptions -O3 -fobjc-runtime=gnustep-1.7 -UNDEBUG -std=gnu++14 -MD -MT Test/CMakeFiles/ObjCXXEHInterop_legacy_optimised.dir/ObjCXXEHInterop.mm.o -MF Test/CMakeFiles/ObjCXXEHInterop_legacy_optimised.dir/ObjCXXEHInterop.mm.o.d -o Test/CMakeFiles/ObjCXXEHInterop_legacy_optimised.dir/ObjCXXEHInterop.mm.o -c /wrkdirs/usr/ports/lang/libobjc2/work/libobjc2-2.1/Test/ObjCXXEHInterop.mm
[ 11% 48/424] : && /usr/bin/cc -O2 -pipe  -fno-strict-aliasing -Xclang -fexceptions -Xclang -fobjc-exceptions -O3 -O2 -pipe  -fno-strict-aliasing -lm Test/CMakeFiles/test_runtime.dir/Test.m.o Test/CMakeFiles/ObjCXXEHInterop_arc.dir/ObjCXXEHInterop_arc.mm.o Test/CMakeFiles/ObjCXXEHInterop_arc.dir/ObjCXXEHInterop_arc.m.o -o Test/ObjCXXEHInterop_arc  -Wl,-rpath,/wrkdirs/usr/ports/lang/libobjc2/work/.build  libobjc.so.4.6  -lcxxrt && :
[ 11% 49/424] /usr/bin/c++ -DGNUSTEP -DNO_LEGACY -DNO_SELECTOR_MISMATCH_WARNINGS -DOLDABI_COMPAT=1 -DTYPE_DEPENDENT_DISPATCH -I/wrkdirs/usr/ports/lang/libobjc2/work/libobjc2-2.1 -O2 -pipe -fno-strict-aliasing -O2 -pipe -fno-strict-aliasing -Xclang -fblocks -Xclang -fobjc-exceptions -O0 -fobjc-runtime=gnustep-1.7 -UNDEBUG -std=gnu++14 -MD -MT Test/CMakeFiles/ObjCXXEHInterop_legacy.dir/ObjCXXEHInterop.mm.o -MF Test/CMakeFiles/ObjCXXEHInterop_legacy.dir/ObjCXXEHInterop.mm.o.d -o Test/CMakeFiles/ObjCXXEHInterop_legacy.dir/ObjCXXEHInterop.mm.o -c /wrkdirs/usr/ports/lang/libobjc2/work/libobjc2-2.1/Test/ObjCXXEHInterop.mm
[ 11% 50/424] /usr/bin/cc -DGNUSTEP -DNO_LEGACY -DNO_SELECTOR_MISMATCH_WARNINGS -DOLDABI_COMPAT=1 -DTYPE_DEPENDENT_DISPATCH -I/wrkdirs/usr/ports/lang/libobjc2/work/libobjc2-2.1 -O2 -pipe  -fno-strict-aliasing -Xclang -fexceptions -Xclang -fobjc-exceptions -O3 -O2 -pipe  -fno-strict-aliasing -Xclang -fblocks -Xclang -fobjc-exceptions -O3 -fobjc-runtime=gnustep-1.7 -UNDEBUG -MD -MT Test/CMakeFiles/ObjCXXEHInterop_legacy_optimised.dir/ObjCXXEHInterop.m.o -MF Test/CMakeFiles/ObjCXXEHInterop_legacy_optimised.dir/ObjCXXEHInterop.m.o.d -o Test/CMakeFiles/ObjCXXEHInterop_legacy_optimised.dir/ObjCXXEHInterop.m.o -c /wrkdirs/usr/ports/lang/libobjc2/work/libobjc2-2.1/Test/ObjCXXEHInterop.m
[ 11% 51/424] /usr/bin/cc -DGNUSTEP -DNO_LEGACY -DNO_SELECTOR_MISMATCH_WARNINGS -DOLDABI_COMPAT=1 -DTYPE_DEPENDENT_DISPATCH -I/wrkdirs/usr/ports/lang/libobjc2/work/libobjc2-2.1 -O2 -pipe  -fno-strict-aliasing -Xclang -fexceptions -Xclang -fobjc-exceptions -O3 -O2 -pipe  -fno-strict-aliasing -Xclang -fblocks -Xclang -fobjc-exceptions -O0 -fobjc-runtime=gnustep-1.7 -UNDEBUG -MD -MT Test/CMakeFiles/ForwardDeclareProtocolAccess_legacy.dir/ForwardDeclareProtocolAccess.m.o -MF Test/CMakeFiles/ForwardDeclareProtocolAccess_legacy.dir/ForwardDeclareProtocolAccess.m.o.d -o Test/CMakeFiles/ForwardDeclareProtocolAccess_legacy.dir/ForwardDeclareProtocolAccess.m.o -c /wrkdirs/usr/ports/lang/libobjc2/work/libobjc2-2.1/Test/ForwardDeclareProtocolAccess.m
[ 12% 52/424] /usr/bin/cc -DGNUSTEP -DNO_LEGACY -DNO_SELECTOR_MISMATCH_WARNINGS -DOLDABI_COMPAT=1 -DTYPE_DEPENDENT_DISPATCH -I/wrkdirs/usr/ports/lang/libobjc2/work/libobjc2-2.1 -O2 -pipe  -fno-strict-aliasing -Xclang -fexceptions -Xclang -fobjc-exceptions -O3 -O2 -pipe  -fno-strict-aliasing -Xclang -fblocks -Xclang -fobjc-exceptions -O0 -fobjc-runtime=gnustep-1.7 -UNDEBUG -MD -MT Test/CMakeFiles/ObjCXXEHInterop_legacy.dir/ObjCXXEHInterop.m.o -MF Test/CMakeFiles/ObjCXXEHInterop_legacy.dir/ObjCXXEHInterop.m.o.d -o Test/CMakeFiles/ObjCXXEHInterop_legacy.dir/ObjCXXEHInterop.m.o -c /wrkdirs/usr/ports/lang/libobjc2/work/libobjc2-2.1/Test/ObjCXXEHInterop.m
[ 12% 53/424] /usr/bin/cc -DGNUSTEP -DNO_LEGACY -DNO_SELECTOR_MISMATCH_WARNINGS -DOLDABI_COMPAT=1 -DTYPE_DEPENDENT_DISPATCH -I/wrkdirs/usr/ports/lang/libobjc2/work/libobjc2-2.1 -O2 -pipe  -fno-strict-aliasing -Xclang -fexceptions -Xclang -fobjc-exceptions -O3 -O2 -pipe  -fno-strict-aliasing -Xclang -fblocks -Xclang -fobjc-exceptions -O0 -fobjc-runtime=gnustep-1.7 -UNDEBUG -MD -MT Test/CMakeFiles/ForwardDeclareProtocolAccess_legacy.dir/ForwardDeclareProtocol.m.o -MF Test/CMakeFiles/ForwardDeclareProtocolAccess_legacy.dir/ForwardDeclareProtocol.m.o.d -o Test/CMakeFiles/ForwardDeclareProtocolAccess_legacy.dir/ForwardDeclareProtocol.m.o -c /wrkdirs/usr/ports/lang/libobjc2/work/libobjc2-2.1/Test/ForwardDeclareProtocol.m
[ 12% 54/424] /usr/bin/cc -DGNUSTEP -DNO_LEGACY -DNO_SELECTOR_MISMATCH_WARNINGS -DOLDABI_COMPAT=1 -DTYPE_DEPENDENT_DISPATCH -I/wrkdirs/usr/ports/lang/libobjc2/work/libobjc2-2.1 -O2 -pipe  -fno-strict-aliasing -Xclang -fexceptions -Xclang -fobjc-exceptions -O3 -O2 -pipe  -fno-strict-aliasing -Xclang -fblocks -Xclang -fobjc-exceptions -O0 -fobjc-runtime=gnustep-2.0 -UNDEBUG -DGS_RUNTIME_V2 -MD -MT Test/CMakeFiles/ForwardDeclareProtocolAccess.dir/ForwardDeclareProtocolAccess.m.o -MF Test/CMakeFiles/ForwardDeclareProtocolAccess.dir/ForwardDeclareProtocolAccess.m.o.d -o Test/CMakeFiles/ForwardDeclareProtocolAccess.dir/ForwardDeclareProtocolAccess.m.o -c /wrkdirs/usr/ports/lang/libobjc2/work/libobjc2-2.1/Test/ForwardDeclareProtocolAccess.m
[ 12% 55/424] /usr/bin/cc -DGNUSTEP -DNO_LEGACY -DNO_SELECTOR_MISMATCH_WARNINGS -DOLDABI_COMPAT=1 -DTYPE_DEPENDENT_DISPATCH -I/wrkdirs/usr/ports/lang/libobjc2/work/libobjc2-2.1 -O2 -pipe  -fno-strict-aliasing -Xclang -fexceptions -Xclang -fobjc-exceptions -O3 -O2 -pipe  -fno-strict-aliasing -Xclang -fblocks -Xclang -fobjc-exceptions -O0 -fobjc-runtime=gnustep-2.0 -UNDEBUG -DGS_RUNTIME_V2 -MD -MT Test/CMakeFiles/ForwardDeclareProtocolAccess.dir/ForwardDeclareProtocol.m.o -MF Test/CMakeFiles/ForwardDeclareProtocolAccess.dir/ForwardDeclareProtocol.m.o.d -o Test/CMakeFiles/ForwardDeclareProtocolAccess.dir/ForwardDeclareProtocol.m.o -c /wrkdirs/usr/ports/lang/libobjc2/work/libobjc2-2.1/Test/ForwardDeclareProtocol.m
[ 12% 56/424] /usr/bin/cc -DGNUSTEP -DNO_LEGACY -DNO_SELECTOR_MISMATCH_WARNINGS -DOLDABI_COMPAT=1 -DTYPE_DEPENDENT_DISPATCH -I/wrkdirs/usr/ports/lang/libobjc2/work/libobjc2-2.1 -O2 -pipe  -fno-strict-aliasing -Xclang -fexceptions -Xclang -fobjc-exceptions -O3 -O2 -pipe  -fno-strict-aliasing -Xclang -fblocks -Xclang -fobjc-exceptions -O0 -fobjc-runtime=gnustep-1.7 -UNDEBUG -MD -MT Test/CMakeFiles/CXXExceptions_legacy.dir/CXXException.m.o -MF Test/CMakeFiles/CXXExceptions_legacy.dir/CXXException.m.o.d -o Test/CMakeFiles/CXXExceptions_legacy.dir/CXXException.m.o -c /wrkdirs/usr/ports/lang/libobjc2/work/libobjc2-2.1/Test/CXXException.m
[ 13% 57/424] /usr/bin/c++ -DGNUSTEP -DNO_LEGACY -DNO_SELECTOR_MISMATCH_WARNINGS -DOLDABI_COMPAT=1 -DTYPE_DEPENDENT_DISPATCH -I/wrkdirs/usr/ports/lang/libobjc2/work/libobjc2-2.1 -O2 -pipe -fno-strict-aliasing -O2 -pipe -fno-strict-aliasing -Xclang -fblocks -Xclang -fobjc-exceptions -O0 -fobjc-runtime=gnustep-1.7 -UNDEBUG -std=gnu++14 -MD -MT Test/CMakeFiles/CXXExceptions_legacy.dir/CXXException.cc.o -MF Test/CMakeFiles/CXXExceptions_legacy.dir/CXXException.cc.o.d -o Test/CMakeFiles/CXXExceptions_legacy.dir/CXXException.cc.o -c /wrkdirs/usr/ports/lang/libobjc2/work/libobjc2-2.1/Test/CXXException.cc
[ 13% 58/424] /usr/bin/cc -DGNUSTEP -DNO_LEGACY -DNO_SELECTOR_MISMATCH_WARNINGS -DOLDABI_COMPAT=1 -DTYPE_DEPENDENT_DISPATCH -I/wrkdirs/usr/ports/lang/libobjc2/work/libobjc2-2.1 -O2 -pipe  -fno-strict-aliasing -Xclang -fexceptions -Xclang -fobjc-exceptions -O3 -O2 -pipe  -fno-strict-aliasing -Xclang -fblocks -Xclang -fobjc-exceptions -O3 -fobjc-runtime=gnustep-2.0 -UNDEBUG -DGS_RUNTIME_V2 -MD -MT Test/CMakeFiles/CXXExceptions_optimised.dir/CXXException.m.o -MF Test/CMakeFiles/CXXExceptions_optimised.dir/CXXException.m.o.d -o Test/CMakeFiles/CXXExceptions_optimised.dir/CXXException.m.o -c /wrkdirs/usr/ports/lang/libobjc2/work/libobjc2-2.1/Test/CXXException.m
[ 13% 59/424] : && /usr/bin/cc -O2 -pipe  -fno-strict-aliasing -Xclang -fexceptions -Xclang -fobjc-exceptions -O3 -O2 -pipe  -fno-strict-aliasing -lm Test/CMakeFiles/test_runtime.dir/Test.m.o Test/CMakeFiles/ForwardDeclareProtocolAccess.dir/ForwardDeclareProtocolAccess.m.o Test/CMakeFiles/ForwardDeclareProtocolAccess.dir/ForwardDeclareProtocol.m.o -o Test/ForwardDeclareProtocolAccess  -Wl,-rpath,/wrkdirs/usr/ports/lang/libobjc2/work/.build  libobjc.so.4.6  -lcxxrt && :
[ 13% 60/424] /usr/bin/c++ -DGNUSTEP -DNO_LEGACY -DNO_SELECTOR_MISMATCH_WARNINGS -DOLDABI_COMPAT=1 -DTYPE_DEPENDENT_DISPATCH -I/wrkdirs/usr/ports/lang/libobjc2/work/libobjc2-2.1 -O2 -pipe -fno-strict-aliasing -O2 -pipe -fno-strict-aliasing -Xclang -fblocks -Xclang -fobjc-exceptions -O3 -fobjc-runtime=gnustep-2.0 -UNDEBUG -DGS_RUNTIME_V2 -std=gnu++14 -MD -MT Test/CMakeFiles/CXXExceptions_optimised.dir/CXXException.cc.o -MF Test/CMakeFiles/CXXExceptions_optimised.dir/CXXException.cc.o.d -o Test/CMakeFiles/CXXExceptions_optimised.dir/CXXException.cc.o -c /wrkdirs/usr/ports/lang/libobjc2/work/libobjc2-2.1/Test/CXXException.cc
[ 14% 61/424] /usr/bin/cc -DGNUSTEP -DNO_LEGACY -DNO_SELECTOR_MISMATCH_WARNINGS -DOLDABI_COMPAT=1 -DTYPE_DEPENDENT_DISPATCH -I/wrkdirs/usr/ports/lang/libobjc2/work/libobjc2-2.1 -O2 -pipe  -fno-strict-aliasing -Xclang -fexceptions -Xclang -fobjc-exceptions -O3 -O2 -pipe  -fno-strict-aliasing -Xclang -fblocks -Xclang -fobjc-exceptions -O3 -fobjc-runtime=gnustep-2.0 -UNDEBUG -DGS_RUNTIME_V2 -MD -MT Test/CMakeFiles/category_properties_optimised.dir/category_properties.m.o -MF Test/CMakeFiles/category_properties_optimised.dir/category_properties.m.o.d -o Test/CMakeFiles/category_properties_optimised.dir/category_properties.m.o -c /wrkdirs/usr/ports/lang/libobjc2/work/libobjc2-2.1/Test/category_properties.m
[ 14% 62/424] : && /usr/bin/cc -O2 -pipe  -fno-strict-aliasing -Xclang -fexceptions -Xclang -fobjc-exceptions -O3 -O2 -pipe  -fno-strict-aliasing -lm Test/CMakeFiles/test_runtime.dir/Test.m.o Test/CMakeFiles/category_properties_optimised.dir/category_properties.m.o -o Test/category_properties_optimised  -Wl,-rpath,/wrkdirs/usr/ports/lang/libobjc2/work/.build  libobjc.so.4.6  -lcxxrt && :
[ 14% 63/424] : && /usr/bin/cc -O2 -pipe  -fno-strict-aliasing -Xclang -fexceptions -Xclang -fobjc-exceptions -O3 -O2 -pipe  -fno-strict-aliasing -lm Test/CMakeFiles/test_runtime.dir/Test.m.o Test/CMakeFiles/CXXExceptions_optimised.dir/CXXException.m.o Test/CMakeFiles/CXXExceptions_optimised.dir/CXXException.cc.o -o Test/CXXExceptions_optimised  -Wl,-rpath,/wrkdirs/usr/ports/lang/libobjc2/work/.build  libobjc.so.4.6  -lcxxrt && :
[ 14% 64/424] /usr/bin/cc -DGNUSTEP -DNO_LEGACY -DNO_SELECTOR_MISMATCH_WARNINGS -DOLDABI_COMPAT=1 -DTYPE_DEPENDENT_DISPATCH -I/wrkdirs/usr/ports/lang/libobjc2/work/libobjc2-2.1 -O2 -pipe  -fno-strict-aliasing -Xclang -fexceptions -Xclang -fobjc-exceptions -O3 -O2 -pipe  -fno-strict-aliasing -Xclang -fblocks -Xclang -fobjc-exceptions -O3 -fobjc-runtime=gnustep-2.0 -UNDEBUG -DGS_RUNTIME_V2 -MD -MT Test/CMakeFiles/ForeignException_optimised.dir/ForeignException.m.o -MF Test/CMakeFiles/ForeignException_optimised.dir/ForeignException.m.o.d -o Test/CMakeFiles/ForeignException_optimised.dir/ForeignException.m.o -c /wrkdirs/usr/ports/lang/libobjc2/work/libobjc2-2.1/Test/ForeignException.m
[ 15% 65/424] /usr/bin/cc -DGNUSTEP -DNO_LEGACY -DNO_SELECTOR_MISMATCH_WARNINGS -DOLDABI_COMPAT=1 -DTYPE_DEPENDENT_DISPATCH -I/wrkdirs/usr/ports/lang/libobjc2/work/libobjc2-2.1 -O2 -pipe  -fno-strict-aliasing -Xclang -fexceptions -Xclang -fobjc-exceptions -O3 -O2 -pipe  -fno-strict-aliasing -Xclang -fblocks -Xclang -fobjc-exceptions -O0 -fobjc-runtime=gnustep-2.0 -UNDEBUG -DGS_RUNTIME_V2 -MD -MT Test/CMakeFiles/category_properties.dir/category_properties.m.o -MF Test/CMakeFiles/category_properties.dir/category_properties.m.o.d -o Test/CMakeFiles/category_properties.dir/category_properties.m.o -c /wrkdirs/usr/ports/lang/libobjc2/work/libobjc2-2.1/Test/category_properties.m
[ 15% 66/424] : && /usr/bin/cc -O2 -pipe  -fno-strict-aliasing -Xclang -fexceptions -Xclang -fobjc-exceptions -O3 -O2 -pipe  -fno-strict-aliasing -lm Test/CMakeFiles/test_runtime.dir/Test.m.o Test/CMakeFiles/ForeignException_optimised.dir/ForeignException.m.o -o Test/ForeignException_optimised  -Wl,-rpath,/wrkdirs/usr/ports/lang/libobjc2/work/.build  libobjc.so.4.6  -lcxxrt && :
[ 15% 67/424] : && /usr/bin/cc -O2 -pipe  -fno-strict-aliasing -Xclang -fexceptions -Xclang -fobjc-exceptions -O3 -O2 -pipe  -fno-strict-aliasing -lm Test/CMakeFiles/test_runtime.dir/Test.m.o Test/CMakeFiles/category_properties.dir/category_properties.m.o -o Test/category_properties  -Wl,-rpath,/wrkdirs/usr/ports/lang/libobjc2/work/.build  libobjc.so.4.6  -lcxxrt && :
[ 15% 68/424] /usr/bin/cc -DGNUSTEP -DNO_LEGACY -DNO_SELECTOR_MISMATCH_WARNINGS -DOLDABI_COMPAT=1 -DTYPE_DEPENDENT_DISPATCH -I/wrkdirs/usr/ports/lang/libobjc2/work/libobjc2-2.1 -O2 -pipe  -fno-strict-aliasing -Xclang -fexceptions -Xclang -fobjc-exceptions -O3 -O2 -pipe  -fno-strict-aliasing -Xclang -fblocks -Xclang -fobjc-exceptions -O0 -fobjc-runtime=gnustep-2.0 -UNDEBUG -DGS_RUNTIME_V2 -MD -MT Test/CMakeFiles/BoxedForeignException.dir/BoxedForeignException.m.o -MF Test/CMakeFiles/BoxedForeignException.dir/BoxedForeignException.m.o.d -o Test/CMakeFiles/BoxedForeignException.dir/BoxedForeignException.m.o -c /wrkdirs/usr/ports/lang/libobjc2/work/libobjc2-2.1/Test/BoxedForeignException.m
[ 16% 69/424] /usr/bin/cc -DGNUSTEP -DNO_LEGACY -DNO_SELECTOR_MISMATCH_WARNINGS -DOLDABI_COMPAT=1 -DTYPE_DEPENDENT_DISPATCH -I/wrkdirs/usr/ports/lang/libobjc2/work/libobjc2-2.1 -O2 -pipe  -fno-strict-aliasing -Xclang -fexceptions -Xclang -fobjc-exceptions -O3 -O2 -pipe  -fno-strict-aliasing -Xclang -fblocks -Xclang -fobjc-exceptions -O3 -fobjc-runtime=gnustep-1.7 -UNDEBUG -MD -MT Test/CMakeFiles/BoxedForeignException_legacy_optimised.dir/BoxedForeignException.m.o -MF Test/CMakeFiles/BoxedForeignException_legacy_optimised.dir/BoxedForeignException.m.o.d -o Test/CMakeFiles/BoxedForeignException_legacy_optimised.dir/BoxedForeignException.m.o -c /wrkdirs/usr/ports/lang/libobjc2/work/libobjc2-2.1/Test/BoxedForeignException.m
[ 16% 70/424] : && /usr/bin/cc -O2 -pipe  -fno-strict-aliasing -Xclang -fexceptions -Xclang -fobjc-exceptions -O3 -O2 -pipe  -fno-strict-aliasing -lm Test/CMakeFiles/test_runtime.dir/Test.m.o Test/CMakeFiles/BoxedForeignException.dir/BoxedForeignException.m.o -o Test/BoxedForeignException  -Wl,-rpath,/wrkdirs/usr/ports/lang/libobjc2/work/.build  libobjc.so.4.6  -lcxxrt && :
[ 16% 71/424] /usr/bin/cc -DGNUSTEP -DNO_LEGACY -DNO_SELECTOR_MISMATCH_WARNINGS -DOLDABI_COMPAT=1 -DTYPE_DEPENDENT_DISPATCH -I/wrkdirs/usr/ports/lang/libobjc2/work/libobjc2-2.1 -O2 -pipe  -fno-strict-aliasing -Xclang -fexceptions -Xclang -fobjc-exceptions -O3 -O2 -pipe  -fno-strict-aliasing -Xclang -fblocks -Xclang -fobjc-exceptions -O3 -fobjc-runtime=gnustep-2.0 -UNDEBUG -DGS_RUNTIME_V2 -MD -MT Test/CMakeFiles/setSuperclass_optimised.dir/setSuperclass.m.o -MF Test/CMakeFiles/setSuperclass_optimised.dir/setSuperclass.m.o.d -o Test/CMakeFiles/setSuperclass_optimised.dir/setSuperclass.m.o -c /wrkdirs/usr/ports/lang/libobjc2/work/libobjc2-2.1/Test/setSuperclass.m
[ 16% 72/424] /usr/bin/cc -DGNUSTEP -DNO_LEGACY -DNO_SELECTOR_MISMATCH_WARNINGS -DOLDABI_COMPAT=1 -DTYPE_DEPENDENT_DISPATCH -I/wrkdirs/usr/ports/lang/libobjc2/work/libobjc2-2.1 -O2 -pipe  -fno-strict-aliasing -Xclang -fexceptions -Xclang -fobjc-exceptions -O3 -O2 -pipe  -fno-strict-aliasing -Xclang -fblocks -Xclang -fobjc-exceptions -O0 -fobjc-runtime=gnustep-2.0 -UNDEBUG -DGS_RUNTIME_V2 -MD -MT Test/CMakeFiles/hash_test.dir/hash_test.c.o -MF Test/CMakeFiles/hash_test.dir/hash_test.c.o.d -o Test/CMakeFiles/hash_test.dir/hash_test.c.o -c /wrkdirs/usr/ports/lang/libobjc2/work/libobjc2-2.1/Test/hash_test.c
[ 16% 73/424] : && /usr/bin/cc -O2 -pipe  -fno-strict-aliasing -Xclang -fexceptions -Xclang -fobjc-exceptions -O3 -O2 -pipe  -fno-strict-aliasing -lm Test/CMakeFiles/test_runtime.dir/Test.m.o Test/CMakeFiles/setSuperclass_optimised.dir/setSuperclass.m.o -o Test/setSuperclass_optimised  -Wl,-rpath,/wrkdirs/usr/ports/lang/libobjc2/work/.build  libobjc.so.4.6  -lcxxrt && :
[ 17% 74/424] : && /usr/bin/cc -O2 -pipe  -fno-strict-aliasing -Xclang -fexceptions -Xclang -fobjc-exceptions -O3 -O2 -pipe  -fno-strict-aliasing -lm Test/CMakeFiles/test_runtime.dir/Test.m.o Test/CMakeFiles/hash_test.dir/hash_test.c.o -o Test/hash_test  -Wl,-rpath,/wrkdirs/usr/ports/lang/libobjc2/work/.build  libobjc.so.4.6  -lcxxrt && :
[ 17% 75/424] /usr/bin/cc -DGNUSTEP -DNO_LEGACY -DNO_SELECTOR_MISMATCH_WARNINGS -DOLDABI_COMPAT=1 -DTYPE_DEPENDENT_DISPATCH -I/wrkdirs/usr/ports/lang/libobjc2/work/libobjc2-2.1 -O2 -pipe  -fno-strict-aliasing -Xclang -fexceptions -Xclang -fobjc-exceptions -O3 -O2 -pipe  -fno-strict-aliasing -Xclang -fblocks -Xclang -fobjc-exceptions -O0 -fobjc-runtime=gnustep-2.0 -UNDEBUG -DGS_RUNTIME_V2 -MD -MT Test/CMakeFiles/hash_table_delete.dir/hash_table_delete.c.o -MF Test/CMakeFiles/hash_table_delete.dir/hash_table_delete.c.o.d -o Test/CMakeFiles/hash_table_delete.dir/hash_table_delete.c.o -c /wrkdirs/usr/ports/lang/libobjc2/work/libobjc2-2.1/Test/hash_table_delete.c
[ 17% 76/424] /usr/bin/cc -DGNUSTEP -DNO_LEGACY -DNO_SELECTOR_MISMATCH_WARNINGS -DOLDABI_COMPAT=1 -DTYPE_DEPENDENT_DISPATCH -I/wrkdirs/usr/ports/lang/libobjc2/work/libobjc2-2.1 -O2 -pipe  -fno-strict-aliasing -Xclang -fexceptions -Xclang -fobjc-exceptions -O3 -O2 -pipe  -fno-strict-aliasing -Xclang -fblocks -Xclang -fobjc-exceptions -O3 -fobjc-runtime=gnustep-1.7 -UNDEBUG -MD -MT Test/CMakeFiles/exchange_legacy_optimised.dir/exchange.m.o -MF Test/CMakeFiles/exchange_legacy_optimised.dir/exchange.m.o.d -o Test/CMakeFiles/exchange_legacy_optimised.dir/exchange.m.o -c /wrkdirs/usr/ports/lang/libobjc2/work/libobjc2-2.1/Test/exchange.m
[ 17% 77/424] /usr/bin/cc -DGNUSTEP -DNO_LEGACY -DNO_SELECTOR_MISMATCH_WARNINGS -DOLDABI_COMPAT=1 -DTYPE_DEPENDENT_DISPATCH -I/wrkdirs/usr/ports/lang/libobjc2/work/libobjc2-2.1 -O2 -pipe  -fno-strict-aliasing -Xclang -fexceptions -Xclang -fobjc-exceptions -O3 -O2 -pipe  -fno-strict-aliasing -Xclang -fblocks -Xclang -fobjc-exceptions -O0 -fobjc-runtime=gnustep-1.7 -UNDEBUG -MD -MT Test/CMakeFiles/exchange_legacy.dir/exchange.m.o -MF Test/CMakeFiles/exchange_legacy.dir/exchange.m.o.d -o Test/CMakeFiles/exchange_legacy.dir/exchange.m.o -c /wrkdirs/usr/ports/lang/libobjc2/work/libobjc2-2.1/Test/exchange.m
[ 18% 78/424] : && /usr/bin/cc -O2 -pipe  -fno-strict-aliasing -Xclang -fexceptions -Xclang -fobjc-exceptions -O3 -O2 -pipe  -fno-strict-aliasing -lm Test/CMakeFiles/test_runtime.dir/Test.m.o Test/CMakeFiles/hash_table_delete.dir/hash_table_delete.c.o -o Test/hash_table_delete  -Wl,-rpath,/wrkdirs/usr/ports/lang/libobjc2/work/.build  libobjc.so.4.6  -lcxxrt && :
[ 18% 79/424] /usr/bin/cc -DGNUSTEP -DNO_LEGACY -DNO_SELECTOR_MISMATCH_WARNINGS -DOLDABI_COMPAT=1 -DTYPE_DEPENDENT_DISPATCH -I/wrkdirs/usr/ports/lang/libobjc2/work/libobjc2-2.1 -O2 -pipe  -fno-strict-aliasing -Xclang -fexceptions -Xclang -fobjc-exceptions -O3 -O2 -pipe  -fno-strict-aliasing -Xclang -fblocks -Xclang -fobjc-exceptions -O3 -fobjc-runtime=gnustep-2.0 -UNDEBUG -DGS_RUNTIME_V2 -MD -MT Test/CMakeFiles/exchange_optimised.dir/exchange.m.o -MF Test/CMakeFiles/exchange_optimised.dir/exchange.m.o.d -o Test/CMakeFiles/exchange_optimised.dir/exchange.m.o -c /wrkdirs/usr/ports/lang/libobjc2/work/libobjc2-2.1/Test/exchange.m
[ 18% 80/424] /usr/bin/cc -DGNUSTEP -DNO_LEGACY -DNO_SELECTOR_MISMATCH_WARNINGS -DOLDABI_COMPAT=1 -DTYPE_DEPENDENT_DISPATCH -I/wrkdirs/usr/ports/lang/libobjc2/work/libobjc2-2.1 -O2 -pipe  -fno-strict-aliasing -Xclang -fexceptions -Xclang -fobjc-exceptions -O3 -O2 -pipe  -fno-strict-aliasing -Xclang -fblocks -Xclang -fobjc-exceptions -O3 -fobjc-runtime=gnustep-1.7 -UNDEBUG -MD -MT Test/CMakeFiles/zeroSizedIVar_legacy_optimised.dir/zeroSizedIVar.m.o -MF Test/CMakeFiles/zeroSizedIVar_legacy_optimised.dir/zeroSizedIVar.m.o.d -o Test/CMakeFiles/zeroSizedIVar_legacy_optimised.dir/zeroSizedIVar.m.o -c /wrkdirs/usr/ports/lang/libobjc2/work/libobjc2-2.1/Test/zeroSizedIVar.m
[ 18% 81/424] /usr/bin/cc -DGNUSTEP -DNO_LEGACY -DNO_SELECTOR_MISMATCH_WARNINGS -DOLDABI_COMPAT=1 -DTYPE_DEPENDENT_DISPATCH -I/wrkdirs/usr/ports/lang/libobjc2/work/libobjc2-2.1 -O2 -pipe  -fno-strict-aliasing -Xclang -fexceptions -Xclang -fobjc-exceptions -O3 -O2 -pipe  -fno-strict-aliasing -Xclang -fblocks -Xclang -fobjc-exceptions -O3 -fobjc-runtime=gnustep-1.7 -UNDEBUG -MD -MT Test/CMakeFiles/MethodArguments_legacy_optimised.dir/MethodArguments.m.o -MF Test/CMakeFiles/MethodArguments_legacy_optimised.dir/MethodArguments.m.o.d -o Test/CMakeFiles/MethodArguments_legacy_optimised.dir/MethodArguments.m.o -c /wrkdirs/usr/ports/lang/libobjc2/work/libobjc2-2.1/Test/MethodArguments.m
[ 19% 82/424] : && /usr/bin/cc -O2 -pipe  -fno-strict-aliasing -Xclang -fexceptions -Xclang -fobjc-exceptions -O3 -O2 -pipe  -fno-strict-aliasing -lm Test/CMakeFiles/test_runtime.dir/Test.m.o Test/CMakeFiles/exchange_optimised.dir/exchange.m.o -o Test/exchange_optimised  -Wl,-rpath,/wrkdirs/usr/ports/lang/libobjc2/work/.build  libobjc.so.4.6  -lcxxrt && :
[ 19% 83/424] /usr/bin/cc -DGNUSTEP -DNO_LEGACY -DNO_SELECTOR_MISMATCH_WARNINGS -DOLDABI_COMPAT=1 -DTYPE_DEPENDENT_DISPATCH -I/wrkdirs/usr/ports/lang/libobjc2/work/libobjc2-2.1 -O2 -pipe  -fno-strict-aliasing -Xclang -fexceptions -Xclang -fobjc-exceptions -O3 -O2 -pipe  -fno-strict-aliasing -Xclang -fblocks -Xclang -fobjc-exceptions -O0 -fobjc-runtime=gnustep-2.0 -UNDEBUG -DGS_RUNTIME_V2 -MD -MT Test/CMakeFiles/MethodArguments.dir/MethodArguments.m.o -MF Test/CMakeFiles/MethodArguments.dir/MethodArguments.m.o.d -o Test/CMakeFiles/MethodArguments.dir/MethodArguments.m.o -c /wrkdirs/usr/ports/lang/libobjc2/work/libobjc2-2.1/Test/MethodArguments.m
[ 19% 84/424] /usr/bin/cc -DGNUSTEP -DNO_LEGACY -DNO_SELECTOR_MISMATCH_WARNINGS -DOLDABI_COMPAT=1 -DTYPE_DEPENDENT_DISPATCH -I/wrkdirs/usr/ports/lang/libobjc2/work/libobjc2-2.1 -O2 -pipe  -fno-strict-aliasing -Xclang -fexceptions -Xclang -fobjc-exceptions -O3 -O2 -pipe  -fno-strict-aliasing -Xclang -fblocks -Xclang -fobjc-exceptions -O0 -fobjc-runtime=gnustep-1.7 -UNDEBUG -MD -MT Test/CMakeFiles/NilException_legacy.dir/NilException.m.o -MF Test/CMakeFiles/NilException_legacy.dir/NilException.m.o.d -o Test/CMakeFiles/NilException_legacy.dir/NilException.m.o -c /wrkdirs/usr/ports/lang/libobjc2/work/libobjc2-2.1/Test/NilException.m
[ 19% 85/424] /usr/bin/cc -DGNUSTEP -DNO_LEGACY -DNO_SELECTOR_MISMATCH_WARNINGS -DOLDABI_COMPAT=1 -DTYPE_DEPENDENT_DISPATCH -I/wrkdirs/usr/ports/lang/libobjc2/work/libobjc2-2.1 -O2 -pipe  -fno-strict-aliasing -Xclang -fexceptions -Xclang -fobjc-exceptions -O3 -O2 -pipe  -fno-strict-aliasing -Xclang -fblocks -Xclang -fobjc-exceptions -O3 -fobjc-runtime=gnustep-2.0 -UNDEBUG -DGS_RUNTIME_V2 -MD -MT Test/CMakeFiles/NilException_optimised.dir/NilException.m.o -MF Test/CMakeFiles/NilException_optimised.dir/NilException.m.o.d -o Test/CMakeFiles/NilException_optimised.dir/NilException.m.o -c /wrkdirs/usr/ports/lang/libobjc2/work/libobjc2-2.1/Test/NilException.m
[ 20% 86/424] : && /usr/bin/cc -O2 -pipe  -fno-strict-aliasing -Xclang -fexceptions -Xclang -fobjc-exceptions -O3 -O2 -pipe  -fno-strict-aliasing -lm Test/CMakeFiles/test_runtime.dir/Test.m.o Test/CMakeFiles/MethodArguments.dir/MethodArguments.m.o -o Test/MethodArguments  -Wl,-rpath,/wrkdirs/usr/ports/lang/libobjc2/work/.build  libobjc.so.4.6  -lcxxrt && :
[ 20% 87/424] /usr/bin/cc -DGNUSTEP -DNO_LEGACY -DNO_SELECTOR_MISMATCH_WARNINGS -DOLDABI_COMPAT=1 -DTYPE_DEPENDENT_DISPATCH -I/wrkdirs/usr/ports/lang/libobjc2/work/libobjc2-2.1 -O2 -pipe  -fno-strict-aliasing -Xclang -fexceptions -Xclang -fobjc-exceptions -O3 -O2 -pipe  -fno-strict-aliasing -Xclang -fblocks -Xclang -fobjc-exceptions -O0 -fobjc-runtime=gnustep-1.7 -UNDEBUG -MD -MT Test/CMakeFiles/msgInterpose_legacy.dir/msgInterpose.m.o -MF Test/CMakeFiles/msgInterpose_legacy.dir/msgInterpose.m.o.d -o Test/CMakeFiles/msgInterpose_legacy.dir/msgInterpose.m.o -c /wrkdirs/usr/ports/lang/libobjc2/work/libobjc2-2.1/Test/msgInterpose.m
[ 20% 88/424] : && /usr/bin/cc -O2 -pipe  -fno-strict-aliasing -Xclang -fexceptions -Xclang -fobjc-exceptions -O3 -O2 -pipe  -fno-strict-aliasing -lm Test/CMakeFiles/test_runtime.dir/Test.m.o Test/CMakeFiles/NilException_optimised.dir/NilException.m.o -o Test/NilException_optimised  -Wl,-rpath,/wrkdirs/usr/ports/lang/libobjc2/work/.build  libobjc.so.4.6  -lcxxrt && :
[ 20% 89/424] /usr/bin/cc -DGNUSTEP -DNO_LEGACY -DNO_SELECTOR_MISMATCH_WARNINGS -DOLDABI_COMPAT=1 -DTYPE_DEPENDENT_DISPATCH -I/wrkdirs/usr/ports/lang/libobjc2/work/libobjc2-2.1 -O2 -pipe  -fno-strict-aliasing -Xclang -fexceptions -Xclang -fobjc-exceptions -O3 -O2 -pipe  -fno-strict-aliasing -Xclang -fblocks -Xclang -fobjc-exceptions -O0 -fobjc-runtime=gnustep-1.7 -UNDEBUG -MD -MT Test/CMakeFiles/objc_msgSend_legacy.dir/objc_msgSend.m.o -MF Test/CMakeFiles/objc_msgSend_legacy.dir/objc_msgSend.m.o.d -o Test/CMakeFiles/objc_msgSend_legacy.dir/objc_msgSend.m.o -c /wrkdirs/usr/ports/lang/libobjc2/work/libobjc2-2.1/Test/objc_msgSend.m
/wrkdirs/usr/ports/lang/libobjc2/work/libobjc2-2.1/Test/objc_msgSend.m:183:3: warning: implicitly declaring library function 'objc_msgSend' with type 'id (id, SEL, ...)' [-Wimplicit-function-declaration]
                objc_msgSend(TestCls, _at_selector(foo));
                ^
/wrkdirs/usr/ports/lang/libobjc2/work/libobjc2-2.1/Test/objc_msgSend.m:183:3: note: include the header <objc/message.h> or explicitly provide a declaration for 'objc_msgSend'
/wrkdirs/usr/ports/lang/libobjc2/work/libobjc2-2.1/Test/objc_msgSend.m:202:26: warning: implicitly declaring library function 'objc_msgSend_stret' with type 'void (id, SEL, ...)' [-Wimplicit-function-declaration]
        s ret = ((s(*)(id, SEL))objc_msgSend_stret)(TestCls, _at_selector(sret));
                                ^
/wrkdirs/usr/ports/lang/libobjc2/work/libobjc2-2.1/Test/objc_msgSend.m:202:26: note: include the header <objc/message.h> or explicitly provide a declaration for 'objc_msgSend_stret'
2 warnings generated.
[ 20% 90/424] /usr/bin/cc -DGNUSTEP -DNO_LEGACY -DNO_SELECTOR_MISMATCH_WARNINGS -DOLDABI_COMPAT=1 -DTYPE_DEPENDENT_DISPATCH -I/wrkdirs/usr/ports/lang/libobjc2/work/libobjc2-2.1 -O2 -pipe  -fno-strict-aliasing -Xclang -fexceptions -Xclang -fobjc-exceptions -O3 -O2 -pipe  -fno-strict-aliasing -Xclang -fblocks -Xclang -fobjc-exceptions -O3 -fobjc-runtime=gnustep-1.7 -UNDEBUG -MD -MT Test/CMakeFiles/IVarSuperclassOverlap_legacy_optimised.dir/IVarSuperclassOverlap.m.o -MF Test/CMakeFiles/IVarSuperclassOverlap_legacy_optimised.dir/IVarSuperclassOverlap.m.o.d -o Test/CMakeFiles/IVarSuperclassOverlap_legacy_optimised.dir/IVarSuperclassOverlap.m.o -c /wrkdirs/usr/ports/lang/libobjc2/work/libobjc2-2.1/Test/IVarSuperclassOverlap.m
[ 21% 91/424] /usr/bin/cc -DGNUSTEP -DNO_LEGACY -DNO_SELECTOR_MISMATCH_WARNINGS -DOLDABI_COMPAT=1 -DTYPE_DEPENDENT_DISPATCH -I/wrkdirs/usr/ports/lang/libobjc2/work/libobjc2-2.1 -O2 -pipe  -fno-strict-aliasing -Xclang -fexceptions -Xclang -fobjc-exceptions -O3 -O2 -pipe  -fno-strict-aliasing -Xclang -fblocks -Xclang -fobjc-exceptions -O0 -fobjc-runtime=gnustep-1.7 -UNDEBUG -MD -MT Test/CMakeFiles/IVarSuperclassOverlap_legacy.dir/IVarSuperclassOverlap.m.o -MF Test/CMakeFiles/IVarSuperclassOverlap_legacy.dir/IVarSuperclassOverlap.m.o.d -o Test/CMakeFiles/IVarSuperclassOverlap_legacy.dir/IVarSuperclassOverlap.m.o -c /wrkdirs/usr/ports/lang/libobjc2/work/libobjc2-2.1/Test/IVarSuperclassOverlap.m
[ 21% 92/424] /usr/bin/cc -DGNUSTEP -DNO_LEGACY -DNO_SELECTOR_MISMATCH_WARNINGS -DOLDABI_COMPAT=1 -DTYPE_DEPENDENT_DISPATCH -I/wrkdirs/usr/ports/lang/libobjc2/work/libobjc2-2.1 -O2 -pipe  -fno-strict-aliasing -Xclang -fexceptions -Xclang -fobjc-exceptions -O3 -O2 -pipe  -fno-strict-aliasing -Xclang -fblocks -Xclang -fobjc-exceptions -O3 -fobjc-runtime=gnustep-1.7 -UNDEBUG -MD -MT Test/CMakeFiles/IVarOverlap_legacy_optimised.dir/IVarOverlap.m.o -MF Test/CMakeFiles/IVarOverlap_legacy_optimised.dir/IVarOverlap.m.o.d -o Test/CMakeFiles/IVarOverlap_legacy_optimised.dir/IVarOverlap.m.o -c /wrkdirs/usr/ports/lang/libobjc2/work/libobjc2-2.1/Test/IVarOverlap.m
[ 21% 93/424] /usr/bin/cc -DGNUSTEP -DNO_LEGACY -DNO_SELECTOR_MISMATCH_WARNINGS -DOLDABI_COMPAT=1 -DTYPE_DEPENDENT_DISPATCH -I/wrkdirs/usr/ports/lang/libobjc2/work/libobjc2-2.1 -O2 -pipe  -fno-strict-aliasing -Xclang -fexceptions -Xclang -fobjc-exceptions -O3 -O2 -pipe  -fno-strict-aliasing -Xclang -fblocks -Xclang -fobjc-exceptions -O3 -fobjc-runtime=gnustep-1.7 -UNDEBUG -MD -MT Test/CMakeFiles/ivar_atomic_legacy_optimised.dir/ivar_atomic.m.o -MF Test/CMakeFiles/ivar_atomic_legacy_optimised.dir/ivar_atomic.m.o.d -o Test/CMakeFiles/ivar_atomic_legacy_optimised.dir/ivar_atomic.m.o -c /wrkdirs/usr/ports/lang/libobjc2/work/libobjc2-2.1/Test/ivar_atomic.m
[ 21% 94/424] /usr/bin/cc -DGNUSTEP -DNO_LEGACY -DNO_SELECTOR_MISMATCH_WARNINGS -DOLDABI_COMPAT=1 -DTYPE_DEPENDENT_DISPATCH -I/wrkdirs/usr/ports/lang/libobjc2/work/libobjc2-2.1 -O2 -pipe  -fno-strict-aliasing -Xclang -fexceptions -Xclang -fobjc-exceptions -O3 -O2 -pipe  -fno-strict-aliasing -Xclang -fblocks -Xclang -fobjc-exceptions -O0 -fobjc-runtime=gnustep-1.7 -UNDEBUG -MD -MT Test/CMakeFiles/IVarOverlap_legacy.dir/IVarOverlap.m.o -MF Test/CMakeFiles/IVarOverlap_legacy.dir/IVarOverlap.m.o.d -o Test/CMakeFiles/IVarOverlap_legacy.dir/IVarOverlap.m.o -c /wrkdirs/usr/ports/lang/libobjc2/work/libobjc2-2.1/Test/IVarOverlap.m
[ 22% 95/424] /usr/bin/cc -DGNUSTEP -DNO_LEGACY -DNO_SELECTOR_MISMATCH_WARNINGS -DOLDABI_COMPAT=1 -DTYPE_DEPENDENT_DISPATCH -I/wrkdirs/usr/ports/lang/libobjc2/work/libobjc2-2.1 -O2 -pipe  -fno-strict-aliasing -Xclang -fexceptions -Xclang -fobjc-exceptions -O3 -O2 -pipe  -fno-strict-aliasing -Xclang -fblocks -Xclang -fobjc-exceptions -O0 -fobjc-runtime=gnustep-1.7 -UNDEBUG -MD -MT Test/CMakeFiles/ivar_atomic_legacy.dir/ivar_atomic.m.o -MF Test/CMakeFiles/ivar_atomic_legacy.dir/ivar_atomic.m.o.d -o Test/CMakeFiles/ivar_atomic_legacy.dir/ivar_atomic.m.o -c /wrkdirs/usr/ports/lang/libobjc2/work/libobjc2-2.1/Test/ivar_atomic.m
[ 22% 96/424] /usr/bin/cc -DGNUSTEP -DNO_LEGACY -DNO_SELECTOR_MISMATCH_WARNINGS -DOLDABI_COMPAT=1 -DTYPE_DEPENDENT_DISPATCH -I/wrkdirs/usr/ports/lang/libobjc2/work/libobjc2-2.1 -O2 -pipe  -fno-strict-aliasing -Xclang -fexceptions -Xclang -fobjc-exceptions -O3 -O2 -pipe  -fno-strict-aliasing -Xclang -fblocks -Xclang -fobjc-exceptions -O0 -fobjc-runtime=gnustep-1.7 -UNDEBUG -MD -MT Test/CMakeFiles/hash_test_legacy.dir/hash_test.c.o -MF Test/CMakeFiles/hash_test_legacy.dir/hash_test.c.o.d -o Test/CMakeFiles/hash_test_legacy.dir/hash_test.c.o -c /wrkdirs/usr/ports/lang/libobjc2/work/libobjc2-2.1/Test/hash_test.c
[ 22% 97/424] /usr/bin/cc -DGNUSTEP -DNO_LEGACY -DNO_SELECTOR_MISMATCH_WARNINGS -DOLDABI_COMPAT=1 -DTYPE_DEPENDENT_DISPATCH -I/wrkdirs/usr/ports/lang/libobjc2/work/libobjc2-2.1 -O2 -pipe  -fno-strict-aliasing -Xclang -fexceptions -Xclang -fobjc-exceptions -O3 -O2 -pipe  -fno-strict-aliasing -Xclang -fblocks -Xclang -fobjc-exceptions -O0 -fobjc-runtime=gnustep-2.0 -UNDEBUG -DGS_RUNTIME_V2 -MD -MT Test/CMakeFiles/ivar_atomic.dir/ivar_atomic.m.o -MF Test/CMakeFiles/ivar_atomic.dir/ivar_atomic.m.o.d -o Test/CMakeFiles/ivar_atomic.dir/ivar_atomic.m.o -c /wrkdirs/usr/ports/lang/libobjc2/work/libobjc2-2.1/Test/ivar_atomic.m
[ 22% 98/424] /usr/bin/cc -DGNUSTEP -DNO_LEGACY -DNO_SELECTOR_MISMATCH_WARNINGS -DOLDABI_COMPAT=1 -DTYPE_DEPENDENT_DISPATCH -I/wrkdirs/usr/ports/lang/libobjc2/work/libobjc2-2.1 -O2 -pipe  -fno-strict-aliasing -Xclang -fexceptions -Xclang -fobjc-exceptions -O3 -O2 -pipe  -fno-strict-aliasing -Xclang -fblocks -Xclang -fobjc-exceptions -O3 -fobjc-runtime=gnustep-1.7 -UNDEBUG -MD -MT Test/CMakeFiles/CXXExceptions_legacy_optimised.dir/CXXException.m.o -MF Test/CMakeFiles/CXXExceptions_legacy_optimised.dir/CXXException.m.o.d -o Test/CMakeFiles/CXXExceptions_legacy_optimised.dir/CXXException.m.o -c /wrkdirs/usr/ports/lang/libobjc2/work/libobjc2-2.1/Test/CXXException.m
[ 23% 99/424] /usr/bin/c++ -DGNUSTEP -DNO_LEGACY -DNO_SELECTOR_MISMATCH_WARNINGS -DOLDABI_COMPAT=1 -DTYPE_DEPENDENT_DISPATCH -I/wrkdirs/usr/ports/lang/libobjc2/work/libobjc2-2.1 -O2 -pipe -fno-strict-aliasing -O2 -pipe -fno-strict-aliasing -Xclang -fblocks -Xclang -fobjc-exceptions -O3 -fobjc-runtime=gnustep-1.7 -UNDEBUG -std=gnu++14 -MD -MT Test/CMakeFiles/CXXExceptions_legacy_optimised.dir/CXXException.cc.o -MF Test/CMakeFiles/CXXExceptions_legacy_optimised.dir/CXXException.cc.o.d -o Test/CMakeFiles/CXXExceptions_legacy_optimised.dir/CXXException.cc.o -c /wrkdirs/usr/ports/lang/libobjc2/work/libobjc2-2.1/Test/CXXException.cc
[ 23% 100/424] : && /usr/bin/cc -O2 -pipe  -fno-strict-aliasing -Xclang -fexceptions -Xclang -fobjc-exceptions -O3 -O2 -pipe  -fno-strict-aliasing -lm Test/CMakeFiles/test_runtime.dir/Test.m.o Test/CMakeFiles/ivar_atomic.dir/ivar_atomic.m.o -o Test/ivar_atomic  -Wl,-rpath,/wrkdirs/usr/ports/lang/libobjc2/work/.build  libobjc.so.4.6  -lcxxrt && :
[ 23% 101/424] /usr/bin/cc -DGNUSTEP -DNO_LEGACY -DNO_SELECTOR_MISMATCH_WARNINGS -DOLDABI_COMPAT=1 -DTYPE_DEPENDENT_DISPATCH -I/wrkdirs/usr/ports/lang/libobjc2/work/libobjc2-2.1 -O2 -pipe  -fno-strict-aliasing -Xclang -fexceptions -Xclang -fobjc-exceptions -O3 -O2 -pipe  -fno-strict-aliasing -Xclang -fblocks -Xclang -fobjc-exceptions -O3 -fobjc-runtime=gnustep-1.7 -UNDEBUG -Xclang -fobjc-arc -MD -MT Test/CMakeFiles/ivar_arc_legacy_optimised.dir/ivar_arc.m.o -MF Test/CMakeFiles/ivar_arc_legacy_optimised.dir/ivar_arc.m.o.d -o Test/CMakeFiles/ivar_arc_legacy_optimised.dir/ivar_arc.m.o -c /wrkdirs/usr/ports/lang/libobjc2/work/libobjc2-2.1/Test/ivar_arc.m
[ 23% 102/424] /usr/bin/cc -DGNUSTEP -DNO_LEGACY -DNO_SELECTOR_MISMATCH_WARNINGS -DOLDABI_COMPAT=1 -DTYPE_DEPENDENT_DISPATCH -I/wrkdirs/usr/ports/lang/libobjc2/work/libobjc2-2.1 -O2 -pipe  -fno-strict-aliasing -Xclang -fexceptions -Xclang -fobjc-exceptions -O3 -O2 -pipe  -fno-strict-aliasing -Xclang -fblocks -Xclang -fobjc-exceptions -O0 -fobjc-runtime=gnustep-1.7 -UNDEBUG -MD -MT Test/CMakeFiles/MethodArguments_legacy.dir/MethodArguments.m.o -MF Test/CMakeFiles/MethodArguments_legacy.dir/MethodArguments.m.o.d -o Test/CMakeFiles/MethodArguments_legacy.dir/MethodArguments.m.o -c /wrkdirs/usr/ports/lang/libobjc2/work/libobjc2-2.1/Test/MethodArguments.m
[ 24% 103/424] /usr/bin/cc -DGNUSTEP -DNO_LEGACY -DNO_SELECTOR_MISMATCH_WARNINGS -DOLDABI_COMPAT=1 -DTYPE_DEPENDENT_DISPATCH -I/wrkdirs/usr/ports/lang/libobjc2/work/libobjc2-2.1 -O2 -pipe  -fno-strict-aliasing -Xclang -fexceptions -Xclang -fobjc-exceptions -O3 -O2 -pipe  -fno-strict-aliasing -Xclang -fblocks -Xclang -fobjc-exceptions -O0 -fobjc-runtime=gnustep-1.7 -UNDEBUG -Xclang -fobjc-arc -MD -MT Test/CMakeFiles/ivar_arc_legacy.dir/ivar_arc.m.o -MF Test/CMakeFiles/ivar_arc_legacy.dir/ivar_arc.m.o.d -o Test/CMakeFiles/ivar_arc_legacy.dir/ivar_arc.m.o -c /wrkdirs/usr/ports/lang/libobjc2/work/libobjc2-2.1/Test/ivar_arc.m
[ 24% 104/424] /usr/bin/cc -DGNUSTEP -DNO_LEGACY -DNO_SELECTOR_MISMATCH_WARNINGS -DOLDABI_COMPAT=1 -DTYPE_DEPENDENT_DISPATCH -I/wrkdirs/usr/ports/lang/libobjc2/work/libobjc2-2.1 -O2 -pipe  -fno-strict-aliasing -Xclang -fexceptions -Xclang -fobjc-exceptions -O3 -O2 -pipe  -fno-strict-aliasing -Xclang -fblocks -Xclang -fobjc-exceptions -O3 -fobjc-runtime=gnustep-2.0 -UNDEBUG -DGS_RUNTIME_V2 -Xclang -fobjc-arc -MD -MT Test/CMakeFiles/ivar_arc_optimised.dir/ivar_arc.m.o -MF Test/CMakeFiles/ivar_arc_optimised.dir/ivar_arc.m.o.d -o Test/CMakeFiles/ivar_arc_optimised.dir/ivar_arc.m.o -c /wrkdirs/usr/ports/lang/libobjc2/work/libobjc2-2.1/Test/ivar_arc.m
[ 24% 105/424] /usr/bin/cc -DGNUSTEP -DNO_LEGACY -DNO_SELECTOR_MISMATCH_WARNINGS -DOLDABI_COMPAT=1 -DTYPE_DEPENDENT_DISPATCH -I/wrkdirs/usr/ports/lang/libobjc2/work/libobjc2-2.1 -O2 -pipe  -fno-strict-aliasing -Xclang -fexceptions -Xclang -fobjc-exceptions -O3 -O2 -pipe  -fno-strict-aliasing -Xclang -fblocks -Xclang -fobjc-exceptions -O3 -fobjc-runtime=gnustep-1.7 -UNDEBUG -MD -MT Test/CMakeFiles/WeakImportClass_legacy_optimised.dir/WeakImportClass.m.o -MF Test/CMakeFiles/WeakImportClass_legacy_optimised.dir/WeakImportClass.m.o.d -o Test/CMakeFiles/WeakImportClass_legacy_optimised.dir/WeakImportClass.m.o -c /wrkdirs/usr/ports/lang/libobjc2/work/libobjc2-2.1/Test/WeakImportClass.m
[ 24% 106/424] /usr/bin/cc -DGNUSTEP -DNO_LEGACY -DNO_SELECTOR_MISMATCH_WARNINGS -DOLDABI_COMPAT=1 -DTYPE_DEPENDENT_DISPATCH -I/wrkdirs/usr/ports/lang/libobjc2/work/libobjc2-2.1 -O2 -pipe  -fno-strict-aliasing -Xclang -fexceptions -Xclang -fobjc-exceptions -O3 -O2 -pipe  -fno-strict-aliasing -Xclang -fblocks -Xclang -fobjc-exceptions -O3 -fobjc-runtime=gnustep-1.7 -UNDEBUG -MD -MT Test/CMakeFiles/objc_msgSend_legacy_optimised.dir/objc_msgSend.m.o -MF Test/CMakeFiles/objc_msgSend_legacy_optimised.dir/objc_msgSend.m.o.d -o Test/CMakeFiles/objc_msgSend_legacy_optimised.dir/objc_msgSend.m.o -c /wrkdirs/usr/ports/lang/libobjc2/work/libobjc2-2.1/Test/objc_msgSend.m
/wrkdirs/usr/ports/lang/libobjc2/work/libobjc2-2.1/Test/objc_msgSend.m:183:3: warning: implicitly declaring library function 'objc_msgSend' with type 'id (id, SEL, ...)' [-Wimplicit-function-declaration]
                objc_msgSend(TestCls, _at_selector(foo));
                ^
/wrkdirs/usr/ports/lang/libobjc2/work/libobjc2-2.1/Test/objc_msgSend.m:183:3: note: include the header <objc/message.h> or explicitly provide a declaration for 'objc_msgSend'
/wrkdirs/usr/ports/lang/libobjc2/work/libobjc2-2.1/Test/objc_msgSend.m:202:26: warning: implicitly declaring library function 'objc_msgSend_stret' with type 'void (id, SEL, ...)' [-Wimplicit-function-declaration]
        s ret = ((s(*)(id, SEL))objc_msgSend_stret)(TestCls, _at_selector(sret));
                                ^
/wrkdirs/usr/ports/lang/libobjc2/work/libobjc2-2.1/Test/objc_msgSend.m:202:26: note: include the header <objc/message.h> or explicitly provide a declaration for 'objc_msgSend_stret'
2 warnings generated.
[ 25% 107/424] : && /usr/bin/cc -O2 -pipe  -fno-strict-aliasing -Xclang -fexceptions -Xclang -fobjc-exceptions -O3 -O2 -pipe  -fno-strict-aliasing -lm Test/CMakeFiles/test_runtime.dir/Test.m.o Test/CMakeFiles/ivar_arc_optimised.dir/ivar_arc.m.o -o Test/ivar_arc_optimised  -Wl,-rpath,/wrkdirs/usr/ports/lang/libobjc2/work/.build  libobjc.so.4.6  -lcxxrt && :
[ 25% 108/424] /usr/bin/cc -DGNUSTEP -DNO_LEGACY -DNO_SELECTOR_MISMATCH_WARNINGS -DOLDABI_COMPAT=1 -DTYPE_DEPENDENT_DISPATCH -I/wrkdirs/usr/ports/lang/libobjc2/work/libobjc2-2.1 -O2 -pipe  -fno-strict-aliasing -Xclang -fexceptions -Xclang -fobjc-exceptions -O3 -O2 -pipe  -fno-strict-aliasing -Xclang -fblocks -Xclang -fobjc-exceptions -O0 -fobjc-runtime=gnustep-2.0 -UNDEBUG -DGS_RUNTIME_V2 -MD -MT Test/CMakeFiles/WeakRefLoad.dir/WeakRefLoad.m.o -MF Test/CMakeFiles/WeakRefLoad.dir/WeakRefLoad.m.o.d -o Test/CMakeFiles/WeakRefLoad.dir/WeakRefLoad.m.o -c /wrkdirs/usr/ports/lang/libobjc2/work/libobjc2-2.1/Test/WeakRefLoad.m
[ 25% 109/424] /usr/bin/cc -DGNUSTEP -DNO_LEGACY -DNO_SELECTOR_MISMATCH_WARNINGS -DOLDABI_COMPAT=1 -DTYPE_DEPENDENT_DISPATCH -I/wrkdirs/usr/ports/lang/libobjc2/work/libobjc2-2.1 -O2 -pipe  -fno-strict-aliasing -Xclang -fexceptions -Xclang -fobjc-exceptions -O3 -O2 -pipe  -fno-strict-aliasing -Xclang -fblocks -Xclang -fobjc-exceptions -O3 -fobjc-runtime=gnustep-2.0 -UNDEBUG -DGS_RUNTIME_V2 -MD -MT Test/CMakeFiles/WeakRefLoad_optimised.dir/WeakRefLoad.m.o -MF Test/CMakeFiles/WeakRefLoad_optimised.dir/WeakRefLoad.m.o.d -o Test/CMakeFiles/WeakRefLoad_optimised.dir/WeakRefLoad.m.o -c /wrkdirs/usr/ports/lang/libobjc2/work/libobjc2-2.1/Test/WeakRefLoad.m
[ 25% 110/424] : && /usr/bin/cc -O2 -pipe  -fno-strict-aliasing -Xclang -fexceptions -Xclang -fobjc-exceptions -O3 -O2 -pipe  -fno-strict-aliasing -lm Test/CMakeFiles/test_runtime.dir/Test.m.o Test/CMakeFiles/WeakRefLoad_optimised.dir/WeakRefLoad.m.o -o Test/WeakRefLoad_optimised  -Wl,-rpath,/wrkdirs/usr/ports/lang/libobjc2/work/.build  libobjc.so.4.6  -lcxxrt && :
[ 25% 111/424] : && /usr/bin/cc -O2 -pipe  -fno-strict-aliasing -Xclang -fexceptions -Xclang -fobjc-exceptions -O3 -O2 -pipe  -fno-strict-aliasing -lm Test/CMakeFiles/test_runtime.dir/Test.m.o Test/CMakeFiles/WeakRefLoad.dir/WeakRefLoad.m.o -o Test/WeakRefLoad  -Wl,-rpath,/wrkdirs/usr/ports/lang/libobjc2/work/.build  libobjc.so.4.6  -lcxxrt && :
[ 26% 112/424] /usr/bin/cc -DGNUSTEP -DNO_LEGACY -DNO_SELECTOR_MISMATCH_WARNINGS -DOLDABI_COMPAT=1 -DTYPE_DEPENDENT_DISPATCH -I/wrkdirs/usr/ports/lang/libobjc2/work/libobjc2-2.1 -O2 -pipe  -fno-strict-aliasing -Xclang -fexceptions -Xclang -fobjc-exceptions -O3 -O2 -pipe  -fno-strict-aliasing -Xclang -fblocks -Xclang -fobjc-exceptions -O3 -fobjc-runtime=gnustep-1.7 -UNDEBUG -MD -MT Test/CMakeFiles/ForwardDeclareProtocolAccess_legacy_optimised.dir/ForwardDeclareProtocol.m.o -MF Test/CMakeFiles/ForwardDeclareProtocolAccess_legacy_optimised.dir/ForwardDeclareProtocol.m.o.d -o Test/CMakeFiles/ForwardDeclareProtocolAccess_legacy_optimised.dir/ForwardDeclareProtocol.m.o -c /wrkdirs/usr/ports/lang/libobjc2/work/libobjc2-2.1/Test/ForwardDeclareProtocol.m
[ 26% 113/424] /usr/bin/cc -DGNUSTEP -DNO_LEGACY -DNO_SELECTOR_MISMATCH_WARNINGS -DOLDABI_COMPAT=1 -DTYPE_DEPENDENT_DISPATCH -I/wrkdirs/usr/ports/lang/libobjc2/work/libobjc2-2.1 -O2 -pipe  -fno-strict-aliasing -Xclang -fexceptions -Xclang -fobjc-exceptions -O3 -O2 -pipe  -fno-strict-aliasing -Xclang -fblocks -Xclang -fobjc-exceptions -O3 -fobjc-runtime=gnustep-1.7 -UNDEBUG -MD -MT Test/CMakeFiles/ForwardDeclareProtocolAccess_legacy_optimised.dir/ForwardDeclareProtocolAccess.m.o -MF Test/CMakeFiles/ForwardDeclareProtocolAccess_legacy_optimised.dir/ForwardDeclareProtocolAccess.m.o.d -o Test/CMakeFiles/ForwardDeclareProtocolAccess_legacy_optimised.dir/ForwardDeclareProtocolAccess.m.o -c /wrkdirs/usr/ports/lang/libobjc2/work/libobjc2-2.1/Test/ForwardDeclareProtocolAccess.m
[ 26% 114/424] /usr/bin/cc -DGNUSTEP -DNO_LEGACY -DNO_SELECTOR_MISMATCH_WARNINGS -DOLDABI_COMPAT=1 -DTYPE_DEPENDENT_DISPATCH -I/wrkdirs/usr/ports/lang/libobjc2/work/libobjc2-2.1 -O2 -pipe  -fno-strict-aliasing -Xclang -fexceptions -Xclang -fobjc-exceptions -O3 -O2 -pipe  -fno-strict-aliasing -Xclang -fblocks -Xclang -fobjc-exceptions -O0 -fobjc-runtime=gnustep-2.0 -UNDEBUG -DGS_RUNTIME_V2 -Xclang -fobjc-arc -MD -MT Test/CMakeFiles/WeakBlock_arc.dir/WeakBlock_arc.m.o -MF Test/CMakeFiles/WeakBlock_arc.dir/WeakBlock_arc.m.o.d -o Test/CMakeFiles/WeakBlock_arc.dir/WeakBlock_arc.m.o -c /wrkdirs/usr/ports/lang/libobjc2/work/libobjc2-2.1/Test/WeakBlock_arc.m
[ 26% 115/424] /usr/bin/cc -DGNUSTEP -DNO_LEGACY -DNO_SELECTOR_MISMATCH_WARNINGS -DOLDABI_COMPAT=1 -DTYPE_DEPENDENT_DISPATCH -I/wrkdirs/usr/ports/lang/libobjc2/work/libobjc2-2.1 -O2 -pipe  -fno-strict-aliasing -Xclang -fexceptions -Xclang -fobjc-exceptions -O3 -O2 -pipe  -fno-strict-aliasing -Xclang -fblocks -Xclang -fobjc-exceptions -O3 -fobjc-runtime=gnustep-2.0 -UNDEBUG -DGS_RUNTIME_V2 -MD -MT Test/CMakeFiles/hash_test_optimised.dir/hash_test.c.o -MF Test/CMakeFiles/hash_test_optimised.dir/hash_test.c.o.d -o Test/CMakeFiles/hash_test_optimised.dir/hash_test.c.o -c /wrkdirs/usr/ports/lang/libobjc2/work/libobjc2-2.1/Test/hash_test.c
[ 27% 116/424] : && /usr/bin/cc -O2 -pipe  -fno-strict-aliasing -Xclang -fexceptions -Xclang -fobjc-exceptions -O3 -O2 -pipe  -fno-strict-aliasing -lm Test/CMakeFiles/test_runtime.dir/Test.m.o Test/CMakeFiles/WeakBlock_arc.dir/WeakBlock_arc.m.o -o Test/WeakBlock_arc  -Wl,-rpath,/wrkdirs/usr/ports/lang/libobjc2/work/.build  libobjc.so.4.6  -lcxxrt && :
[ 27% 117/424] /usr/bin/cc -DGNUSTEP -DNO_LEGACY -DNO_SELECTOR_MISMATCH_WARNINGS -DOLDABI_COMPAT=1 -DTYPE_DEPENDENT_DISPATCH -I/wrkdirs/usr/ports/lang/libobjc2/work/libobjc2-2.1 -O2 -pipe  -fno-strict-aliasing -Xclang -fexceptions -Xclang -fobjc-exceptions -O3 -O2 -pipe  -fno-strict-aliasing -Xclang -fblocks -Xclang -fobjc-exceptions -O3 -fobjc-runtime=gnustep-2.0 -UNDEBUG -DGS_RUNTIME_V2 -MD -MT Test/CMakeFiles/NestedExceptions_optimised.dir/NestedExceptions.m.o -MF Test/CMakeFiles/NestedExceptions_optimised.dir/NestedExceptions.m.o.d -o Test/CMakeFiles/NestedExceptions_optimised.dir/NestedExceptions.m.o -c /wrkdirs/usr/ports/lang/libobjc2/work/libobjc2-2.1/Test/NestedExceptions.m
[ 27% 118/424] : && /usr/bin/cc -O2 -pipe  -fno-strict-aliasing -Xclang -fexceptions -Xclang -fobjc-exceptions -O3 -O2 -pipe  -fno-strict-aliasing -lm Test/CMakeFiles/test_runtime.dir/Test.m.o Test/CMakeFiles/hash_test_optimised.dir/hash_test.c.o -o Test/hash_test_optimised  -Wl,-rpath,/wrkdirs/usr/ports/lang/libobjc2/work/.build  libobjc.so.4.6  -lcxxrt && :
[ 27% 119/424] /usr/bin/cc -DGNUSTEP -DNO_LEGACY -DNO_SELECTOR_MISMATCH_WARNINGS -DOLDABI_COMPAT=1 -DTYPE_DEPENDENT_DISPATCH -I/wrkdirs/usr/ports/lang/libobjc2/work/libobjc2-2.1 -O2 -pipe  -fno-strict-aliasing -Xclang -fexceptions -Xclang -fobjc-exceptions -O3 -O2 -pipe  -fno-strict-aliasing -Xclang -fblocks -Xclang -fobjc-exceptions -O0 -fobjc-runtime=gnustep-1.7 -UNDEBUG -MD -MT Test/CMakeFiles/SuperMethodMissing_legacy.dir/SuperMethodMissing.m.o -MF Test/CMakeFiles/SuperMethodMissing_legacy.dir/SuperMethodMissing.m.o.d -o Test/CMakeFiles/SuperMethodMissing_legacy.dir/SuperMethodMissing.m.o -c /wrkdirs/usr/ports/lang/libobjc2/work/libobjc2-2.1/Test/SuperMethodMissing.m
[ 28% 120/424] /usr/bin/cc -DGNUSTEP -DNO_LEGACY -DNO_SELECTOR_MISMATCH_WARNINGS -DOLDABI_COMPAT=1 -DTYPE_DEPENDENT_DISPATCH -I/wrkdirs/usr/ports/lang/libobjc2/work/libobjc2-2.1 -O2 -pipe  -fno-strict-aliasing -Xclang -fexceptions -Xclang -fobjc-exceptions -O3 -O2 -pipe  -fno-strict-aliasing -Xclang -fblocks -Xclang -fobjc-exceptions -O0 -fobjc-runtime=gnustep-2.0 -UNDEBUG -DGS_RUNTIME_V2 -MD -MT Test/CMakeFiles/CXXExceptions.dir/CXXException.m.o -MF Test/CMakeFiles/CXXExceptions.dir/CXXException.m.o.d -o Test/CMakeFiles/CXXExceptions.dir/CXXException.m.o -c /wrkdirs/usr/ports/lang/libobjc2/work/libobjc2-2.1/Test/CXXException.m
[ 28% 121/424] : && /usr/bin/cc -O2 -pipe  -fno-strict-aliasing -Xclang -fexceptions -Xclang -fobjc-exceptions -O3 -O2 -pipe  -fno-strict-aliasing -lm Test/CMakeFiles/test_runtime.dir/Test.m.o Test/CMakeFiles/NestedExceptions_optimised.dir/NestedExceptions.m.o -o Test/NestedExceptions_optimised  -Wl,-rpath,/wrkdirs/usr/ports/lang/libobjc2/work/.build  libobjc.so.4.6  -lcxxrt && :
[ 28% 122/424] /usr/bin/c++ -DGNUSTEP -DNO_LEGACY -DNO_SELECTOR_MISMATCH_WARNINGS -DOLDABI_COMPAT=1 -DTYPE_DEPENDENT_DISPATCH -I/wrkdirs/usr/ports/lang/libobjc2/work/libobjc2-2.1 -O2 -pipe -fno-strict-aliasing -O2 -pipe -fno-strict-aliasing -Xclang -fblocks -Xclang -fobjc-exceptions -O0 -fobjc-runtime=gnustep-2.0 -UNDEBUG -DGS_RUNTIME_V2 -std=gnu++14 -MD -MT Test/CMakeFiles/CXXExceptions.dir/CXXException.cc.o -MF Test/CMakeFiles/CXXExceptions.dir/CXXException.cc.o.d -o Test/CMakeFiles/CXXExceptions.dir/CXXException.cc.o -c /wrkdirs/usr/ports/lang/libobjc2/work/libobjc2-2.1/Test/CXXException.cc
[ 28% 123/424] /usr/bin/cc -DGNUSTEP -DNO_LEGACY -DNO_SELECTOR_MISMATCH_WARNINGS -DOLDABI_COMPAT=1 -DTYPE_DEPENDENT_DISPATCH -I/wrkdirs/usr/ports/lang/libobjc2/work/libobjc2-2.1 -O2 -pipe  -fno-strict-aliasing -Xclang -fexceptions -Xclang -fobjc-exceptions -O3 -O2 -pipe  -fno-strict-aliasing -Xclang -fblocks -Xclang -fobjc-exceptions -O0 -fobjc-runtime=gnustep-2.0 -UNDEBUG -DGS_RUNTIME_V2 -MD -MT Test/CMakeFiles/IVarOverlap.dir/IVarOverlap.m.o -MF Test/CMakeFiles/IVarOverlap.dir/IVarOverlap.m.o.d -o Test/CMakeFiles/IVarOverlap.dir/IVarOverlap.m.o -c /wrkdirs/usr/ports/lang/libobjc2/work/libobjc2-2.1/Test/IVarOverlap.m
[ 29% 124/424] : && /usr/bin/cc -O2 -pipe  -fno-strict-aliasing -Xclang -fexceptions -Xclang -fobjc-exceptions -O3 -O2 -pipe  -fno-strict-aliasing -lm Test/CMakeFiles/test_runtime.dir/Test.m.o Test/CMakeFiles/CXXExceptions.dir/CXXException.m.o Test/CMakeFiles/CXXExceptions.dir/CXXException.cc.o -o Test/CXXExceptions  -Wl,-rpath,/wrkdirs/usr/ports/lang/libobjc2/work/.build  libobjc.so.4.6  -lcxxrt && :
[ 29% 125/424] : && /usr/bin/cc -O2 -pipe  -fno-strict-aliasing -Xclang -fexceptions -Xclang -fobjc-exceptions -O3 -O2 -pipe  -fno-strict-aliasing -lm Test/CMakeFiles/test_runtime.dir/Test.m.o Test/CMakeFiles/IVarOverlap.dir/IVarOverlap.m.o -o Test/IVarOverlap  -Wl,-rpath,/wrkdirs/usr/ports/lang/libobjc2/work/.build  libobjc.so.4.6  -lcxxrt && :
[ 29% 126/424] /usr/bin/cc -DGNUSTEP -DNO_LEGACY -DNO_SELECTOR_MISMATCH_WARNINGS -DOLDABI_COMPAT=1 -DTYPE_DEPENDENT_DISPATCH -I/wrkdirs/usr/ports/lang/libobjc2/work/libobjc2-2.1 -O2 -pipe  -fno-strict-aliasing -Xclang -fexceptions -Xclang -fobjc-exceptions -O3 -O2 -pipe  -fno-strict-aliasing -Xclang -fblocks -Xclang -fobjc-exceptions -O0 -fobjc-runtime=gnustep-2.0 -UNDEBUG -DGS_RUNTIME_V2 -MD -MT Test/CMakeFiles/SuperMethodMissing.dir/SuperMethodMissing.m.o -MF Test/CMakeFiles/SuperMethodMissing.dir/SuperMethodMissing.m.o.d -o Test/CMakeFiles/SuperMethodMissing.dir/SuperMethodMissing.m.o -c /wrkdirs/usr/ports/lang/libobjc2/work/libobjc2-2.1/Test/SuperMethodMissing.m
[ 29% 127/424] /usr/bin/cc -DGNUSTEP -DNO_LEGACY -DNO_SELECTOR_MISMATCH_WARNINGS -DOLDABI_COMPAT=1 -DTYPE_DEPENDENT_DISPATCH -I/wrkdirs/usr/ports/lang/libobjc2/work/libobjc2-2.1 -O2 -pipe  -fno-strict-aliasing -Xclang -fexceptions -Xclang -fobjc-exceptions -O3 -O2 -pipe  -fno-strict-aliasing -Xclang -fblocks -Xclang -fobjc-exceptions -O0 -fobjc-runtime=gnustep-1.7 -UNDEBUG -MD -MT Test/CMakeFiles/alias_legacy.dir/alias.m.o -MF Test/CMakeFiles/alias_legacy.dir/alias.m.o.d -o Test/CMakeFiles/alias_legacy.dir/alias.m.o -c /wrkdirs/usr/ports/lang/libobjc2/work/libobjc2-2.1/Test/alias.m
[ 29% 128/424] /usr/bin/cc -DGNUSTEP -DNO_LEGACY -DNO_SELECTOR_MISMATCH_WARNINGS -DOLDABI_COMPAT=1 -DTYPE_DEPENDENT_DISPATCH -I/wrkdirs/usr/ports/lang/libobjc2/work/libobjc2-2.1 -O2 -pipe  -fno-strict-aliasing -Xclang -fexceptions -Xclang -fobjc-exceptions -O3 -O2 -pipe  -fno-strict-aliasing -Xclang -fblocks -Xclang -fobjc-exceptions -O0 -fobjc-runtime=gnustep-1.7 -UNDEBUG -MD -MT Test/CMakeFiles/RuntimeTest_legacy.dir/RuntimeTest.m.o -MF Test/CMakeFiles/RuntimeTest_legacy.dir/RuntimeTest.m.o.d -o Test/CMakeFiles/RuntimeTest_legacy.dir/RuntimeTest.m.o -c /wrkdirs/usr/ports/lang/libobjc2/work/libobjc2-2.1/Test/RuntimeTest.m
[ 30% 129/424] : && /usr/bin/cc -O2 -pipe  -fno-strict-aliasing -Xclang -fexceptions -Xclang -fobjc-exceptions -O3 -O2 -pipe  -fno-strict-aliasing -lm Test/CMakeFiles/test_runtime.dir/Test.m.o Test/CMakeFiles/SuperMethodMissing.dir/SuperMethodMissing.m.o -o Test/SuperMethodMissing  -Wl,-rpath,/wrkdirs/usr/ports/lang/libobjc2/work/.build  libobjc.so.4.6  -lcxxrt && :
[ 30% 130/424] /usr/bin/cc -DGNUSTEP -DNO_LEGACY -DNO_SELECTOR_MISMATCH_WARNINGS -DOLDABI_COMPAT=1 -DTYPE_DEPENDENT_DISPATCH -I/wrkdirs/usr/ports/lang/libobjc2/work/libobjc2-2.1 -O2 -pipe  -fno-strict-aliasing -Xclang -fexceptions -Xclang -fobjc-exceptions -O3 -O2 -pipe  -fno-strict-aliasing -Xclang -fblocks -Xclang -fobjc-exceptions -O0 -fobjc-runtime=gnustep-2.0 -UNDEBUG -DGS_RUNTIME_V2 -MD -MT Test/CMakeFiles/RuntimeTest.dir/RuntimeTest.m.o -MF Test/CMakeFiles/RuntimeTest.dir/RuntimeTest.m.o.d -o Test/CMakeFiles/RuntimeTest.dir/RuntimeTest.m.o -c /wrkdirs/usr/ports/lang/libobjc2/work/libobjc2-2.1/Test/RuntimeTest.m
[ 30% 131/424] /usr/bin/cc -DGNUSTEP -DNO_LEGACY -DNO_SELECTOR_MISMATCH_WARNINGS -DOLDABI_COMPAT=1 -DTYPE_DEPENDENT_DISPATCH -I/wrkdirs/usr/ports/lang/libobjc2/work/libobjc2-2.1 -O2 -pipe  -fno-strict-aliasing -Xclang -fexceptions -Xclang -fobjc-exceptions -O3 -O2 -pipe  -fno-strict-aliasing -Xclang -fblocks -Xclang -fobjc-exceptions -O0 -fobjc-runtime=gnustep-1.7 -UNDEBUG -Xclang -fobjc-arc -MD -MT Test/CMakeFiles/ResurrectInDealloc_arc_legacy.dir/ResurrectInDealloc_arc.m.o -MF Test/CMakeFiles/ResurrectInDealloc_arc_legacy.dir/ResurrectInDealloc_arc.m.o.d -o Test/CMakeFiles/ResurrectInDealloc_arc_legacy.dir/ResurrectInDealloc_arc.m.o -c /wrkdirs/usr/ports/lang/libobjc2/work/libobjc2-2.1/Test/ResurrectInDealloc_arc.m
[ 30% 132/424] /usr/bin/c++ -DGNUSTEP -DNO_LEGACY -DNO_SELECTOR_MISMATCH_WARNINGS -DOLDABI_COMPAT=1 -DTYPE_DEPENDENT_DISPATCH -I/wrkdirs/usr/ports/lang/libobjc2/work/libobjc2-2.1 -O2 -pipe -fno-strict-aliasing -O2 -pipe -fno-strict-aliasing -Xclang -fblocks -Xclang -fobjc-exceptions -O0 -fobjc-runtime=gnustep-2.0 -UNDEBUG -DGS_RUNTIME_V2 -std=gnu++14 -MD -MT Test/CMakeFiles/ObjCXXEHInterop.dir/ObjCXXEHInterop.mm.o -MF Test/CMakeFiles/ObjCXXEHInterop.dir/ObjCXXEHInterop.mm.o.d -o Test/CMakeFiles/ObjCXXEHInterop.dir/ObjCXXEHInterop.mm.o -c /wrkdirs/usr/ports/lang/libobjc2/work/libobjc2-2.1/Test/ObjCXXEHInterop.mm
[ 31% 133/424] /usr/bin/cc -DGNUSTEP -DNO_LEGACY -DNO_SELECTOR_MISMATCH_WARNINGS -DOLDABI_COMPAT=1 -DTYPE_DEPENDENT_DISPATCH -I/wrkdirs/usr/ports/lang/libobjc2/work/libobjc2-2.1 -O2 -pipe  -fno-strict-aliasing -Xclang -fexceptions -Xclang -fobjc-exceptions -O3 -O2 -pipe  -fno-strict-aliasing -Xclang -fblocks -Xclang -fobjc-exceptions -O0 -fobjc-runtime=gnustep-2.0 -UNDEBUG -DGS_RUNTIME_V2 -MD -MT Test/CMakeFiles/ObjCXXEHInterop.dir/ObjCXXEHInterop.m.o -MF Test/CMakeFiles/ObjCXXEHInterop.dir/ObjCXXEHInterop.m.o.d -o Test/CMakeFiles/ObjCXXEHInterop.dir/ObjCXXEHInterop.m.o -c /wrkdirs/usr/ports/lang/libobjc2/work/libobjc2-2.1/Test/ObjCXXEHInterop.m
[ 31% 134/424] : && /usr/bin/cc -O2 -pipe  -fno-strict-aliasing -Xclang -fexceptions -Xclang -fobjc-exceptions -O3 -O2 -pipe  -fno-strict-aliasing -lm Test/CMakeFiles/test_runtime.dir/Test.m.o Test/CMakeFiles/RuntimeTest.dir/RuntimeTest.m.o -o Test/RuntimeTest  -Wl,-rpath,/wrkdirs/usr/ports/lang/libobjc2/work/.build  libobjc.so.4.6  -lcxxrt && :
[ 31% 135/424] /usr/bin/cc -DGNUSTEP -DNO_LEGACY -DNO_SELECTOR_MISMATCH_WARNINGS -DOLDABI_COMPAT=1 -DTYPE_DEPENDENT_DISPATCH -I/wrkdirs/usr/ports/lang/libobjc2/work/libobjc2-2.1 -O2 -pipe  -fno-strict-aliasing -Xclang -fexceptions -Xclang -fobjc-exceptions -O3 -O2 -pipe  -fno-strict-aliasing -Xclang -fblocks -Xclang -fobjc-exceptions -O0 -fobjc-runtime=gnustep-2.0 -UNDEBUG -DGS_RUNTIME_V2 -Xclang -fobjc-arc -MD -MT Test/CMakeFiles/ResurrectInDealloc_arc.dir/ResurrectInDealloc_arc.m.o -MF Test/CMakeFiles/ResurrectInDealloc_arc.dir/ResurrectInDealloc_arc.m.o.d -o Test/CMakeFiles/ResurrectInDealloc_arc.dir/ResurrectInDealloc_arc.m.o -c /wrkdirs/usr/ports/lang/libobjc2/work/libobjc2-2.1/Test/ResurrectInDealloc_arc.m
[ 31% 136/424] : && /usr/bin/cc -O2 -pipe  -fno-strict-aliasing -Xclang -fexceptions -Xclang -fobjc-exceptions -O3 -O2 -pipe  -fno-strict-aliasing -lm Test/CMakeFiles/test_runtime.dir/Test.m.o Test/CMakeFiles/ObjCXXEHInterop.dir/ObjCXXEHInterop.mm.o Test/CMakeFiles/ObjCXXEHInterop.dir/ObjCXXEHInterop.m.o -o Test/ObjCXXEHInterop  -Wl,-rpath,/wrkdirs/usr/ports/lang/libobjc2/work/.build  libobjc.so.4.6  -lcxxrt && :
[ 32% 137/424] /usr/bin/cc -DGNUSTEP -DNO_LEGACY -DNO_SELECTOR_MISMATCH_WARNINGS -DOLDABI_COMPAT=1 -DTYPE_DEPENDENT_DISPATCH -I/wrkdirs/usr/ports/lang/libobjc2/work/libobjc2-2.1 -O2 -pipe  -fno-strict-aliasing -Xclang -fexceptions -Xclang -fobjc-exceptions -O3 -O2 -pipe  -fno-strict-aliasing -Xclang -fblocks -Xclang -fobjc-exceptions -O0 -fobjc-runtime=gnustep-1.7 -UNDEBUG -Xclang -fobjc-arc -MD -MT Test/CMakeFiles/WeakBlock_arc_legacy.dir/WeakBlock_arc.m.o -MF Test/CMakeFiles/WeakBlock_arc_legacy.dir/WeakBlock_arc.m.o.d -o Test/CMakeFiles/WeakBlock_arc_legacy.dir/WeakBlock_arc.m.o -c /wrkdirs/usr/ports/lang/libobjc2/work/libobjc2-2.1/Test/WeakBlock_arc.m
[ 32% 138/424] : && /usr/bin/cc -O2 -pipe  -fno-strict-aliasing -Xclang -fexceptions -Xclang -fobjc-exceptions -O3 -O2 -pipe  -fno-strict-aliasing -lm Test/CMakeFiles/test_runtime.dir/Test.m.o Test/CMakeFiles/ResurrectInDealloc_arc.dir/ResurrectInDealloc_arc.m.o -o Test/ResurrectInDealloc_arc  -Wl,-rpath,/wrkdirs/usr/ports/lang/libobjc2/work/.build  libobjc.so.4.6  -lcxxrt && :
[ 32% 139/424] /usr/bin/cc -DGNUSTEP -DNO_LEGACY -DNO_SELECTOR_MISMATCH_WARNINGS -DOLDABI_COMPAT=1 -DTYPE_DEPENDENT_DISPATCH -I/wrkdirs/usr/ports/lang/libobjc2/work/libobjc2-2.1 -O2 -pipe  -fno-strict-aliasing -Xclang -fexceptions -Xclang -fobjc-exceptions -O3 -O2 -pipe  -fno-strict-aliasing -Xclang -fblocks -Xclang -fobjc-exceptions -O3 -fobjc-runtime=gnustep-2.0 -UNDEBUG -DGS_RUNTIME_V2 -MD -MT Test/CMakeFiles/ivar_atomic_optimised.dir/ivar_atomic.m.o -MF Test/CMakeFiles/ivar_atomic_optimised.dir/ivar_atomic.m.o.d -o Test/CMakeFiles/ivar_atomic_optimised.dir/ivar_atomic.m.o -c /wrkdirs/usr/ports/lang/libobjc2/work/libobjc2-2.1/Test/ivar_atomic.m
[ 32% 140/424] /usr/bin/cc -DGNUSTEP -DNO_LEGACY -DNO_SELECTOR_MISMATCH_WARNINGS -DOLDABI_COMPAT=1 -DTYPE_DEPENDENT_DISPATCH -I/wrkdirs/usr/ports/lang/libobjc2/work/libobjc2-2.1 -O2 -pipe  -fno-strict-aliasing -Xclang -fexceptions -Xclang -fobjc-exceptions -O3 -O2 -pipe  -fno-strict-aliasing -Xclang -fblocks -Xclang -fobjc-exceptions -O3 -fobjc-runtime=gnustep-2.0 -UNDEBUG -DGS_RUNTIME_V2 -MD -MT Test/CMakeFiles/objc_msgSend_optimised.dir/objc_msgSend.m.o -MF Test/CMakeFiles/objc_msgSend_optimised.dir/objc_msgSend.m.o.d -o Test/CMakeFiles/objc_msgSend_optimised.dir/objc_msgSend.m.o -c /wrkdirs/usr/ports/lang/libobjc2/work/libobjc2-2.1/Test/objc_msgSend.m
/wrkdirs/usr/ports/lang/libobjc2/work/libobjc2-2.1/Test/objc_msgSend.m:183:3: warning: implicitly declaring library function 'objc_msgSend' with type 'id (id, SEL, ...)' [-Wimplicit-function-declaration]
                objc_msgSend(TestCls, _at_selector(foo));
                ^
/wrkdirs/usr/ports/lang/libobjc2/work/libobjc2-2.1/Test/objc_msgSend.m:183:3: note: include the header <objc/message.h> or explicitly provide a declaration for 'objc_msgSend'
/wrkdirs/usr/ports/lang/libobjc2/work/libobjc2-2.1/Test/objc_msgSend.m:202:26: warning: implicitly declaring library function 'objc_msgSend_stret' with type 'void (id, SEL, ...)' [-Wimplicit-function-declaration]
        s ret = ((s(*)(id, SEL))objc_msgSend_stret)(TestCls, _at_selector(sret));
                                ^
/wrkdirs/usr/ports/lang/libobjc2/work/libobjc2-2.1/Test/objc_msgSend.m:202:26: note: include the header <objc/message.h> or explicitly provide a declaration for 'objc_msgSend_stret'
2 warnings generated.
[ 33% 141/424] : && /usr/bin/cc -O2 -pipe  -fno-strict-aliasing -Xclang -fexceptions -Xclang -fobjc-exceptions -O3 -O2 -pipe  -fno-strict-aliasing -lm Test/CMakeFiles/test_runtime.dir/Test.m.o Test/CMakeFiles/ivar_atomic_optimised.dir/ivar_atomic.m.o -o Test/ivar_atomic_optimised  -Wl,-rpath,/wrkdirs/usr/ports/lang/libobjc2/work/.build  libobjc.so.4.6  -lcxxrt && :
[ 33% 142/424] : && /usr/bin/cc -O2 -pipe  -fno-strict-aliasing -Xclang -fexceptions -Xclang -fobjc-exceptions -O3 -O2 -pipe  -fno-strict-aliasing -lm Test/CMakeFiles/test_runtime.dir/Test.m.o Test/CMakeFiles/objc_msgSend_optimised.dir/objc_msgSend.m.o -o Test/objc_msgSend_optimised  -Wl,-rpath,/wrkdirs/usr/ports/lang/libobjc2/work/.build  libobjc.so.4.6  -lcxxrt && :
FAILED: Test/objc_msgSend_optimised 
: && /usr/bin/cc -O2 -pipe  -fno-strict-aliasing -Xclang -fexceptions -Xclang -fobjc-exceptions -O3 -O2 -pipe  -fno-strict-aliasing -lm Test/CMakeFiles/test_runtime.dir/Test.m.o Test/CMakeFiles/objc_msgSend_optimised.dir/objc_msgSend.m.o -o Test/objc_msgSend_optimised  -Wl,-rpath,/wrkdirs/usr/ports/lang/libobjc2/work/.build  libobjc.so.4.6  -lcxxrt && :
ld: error: undefined symbol: objc_msgSend
>>> referenced by objc_msgSend.m
>>>               Test/CMakeFiles/objc_msgSend_optimised.dir/objc_msgSend.m.o:(main)
>>> referenced by objc_msgSend.m
>>>               Test/CMakeFiles/objc_msgSend_optimised.dir/objc_msgSend.m.o:(main)
>>> referenced by objc_msgSend.m
>>>               Test/CMakeFiles/objc_msgSend_optimised.dir/objc_msgSend.m.o:(main)
>>> referenced 5 more times

ld: error: undefined symbol: objc_msgSend_stret
>>> referenced by objc_msgSend.m
>>>               Test/CMakeFiles/objc_msgSend_optimised.dir/objc_msgSend.m.o:(main)
>>> referenced by objc_msgSend.m
>>>               Test/CMakeFiles/objc_msgSend_optimised.dir/objc_msgSend.m.o:(main)
cc: error: linker command failed with exit code 1 (use -v to see invocation)
[ 33% 142/424] /usr/bin/cc -DGNUSTEP -DNO_LEGACY -DNO_SELECTOR_MISMATCH_WARNINGS -DOLDABI_COMPAT=1 -DTYPE_DEPENDENT_DISPATCH -I/wrkdirs/usr/ports/lang/libobjc2/work/libobjc2-2.1 -O2 -pipe  -fno-strict-aliasing -Xclang -fexceptions -Xclang -fobjc-exceptions -O3 -O2 -pipe  -fno-strict-aliasing -Xclang -fblocks -Xclang -fobjc-exceptions -O0 -fobjc-runtime=gnustep-1.7 -UNDEBUG -MD -MT Test/CMakeFiles/ProtocolCreation_legacy.dir/ProtocolCreation.m.o -MF Test/CMakeFiles/ProtocolCreation_legacy.dir/ProtocolCreation.m.o.d -o Test/CMakeFiles/ProtocolCreation_legacy.dir/ProtocolCreation.m.o -c /wrkdirs/usr/ports/lang/libobjc2/work/libobjc2-2.1/Test/ProtocolCreation.m
ninja: build stopped: subcommand failed.
===> Compilation failed unexpectedly.
Try to set MAKE_JOBS_UNSAFE=yes and rebuild before reporting the failure to
the maintainer.
*** Error code 1

Stop.
make: stopped in /usr/ports/lang/libobjc2
Received on Tue Jul 27 2021 - 06:15:31 UTC

Original text of this message