[package - 122arm64-quarterly][multimedia/obs-streamfx] Failed for obs-streamfx-0.9.3 in build

From: <pkg-fallout_at_FreeBSD.org>
Date: Tue, 27 Jul 2021 04:02:06 GMT
You are receiving this mail as a port that you maintain
is failing to build on the FreeBSD package build server.
Please investigate the failure and submit a PR to fix
build.

Maintainer:     yuri_at_FreeBSD.org
Log URL:        http://ampere1.nyi.freebsd.org/data/122arm64-quarterly/861e2a11357f/logs/obs-streamfx-0.9.3.log
Build URL:      http://ampere1.nyi.freebsd.org/build.html?mastername=122arm64-quarterly&build=861e2a11357f
Log:

=>> Building multimedia/obs-streamfx
build started at Tue Jul 27 04:00:59 UTC 2021
port directory: /usr/ports/multimedia/obs-streamfx
package name: obs-streamfx-0.9.3
building for: FreeBSD 122arm64-quarterly-job-11 12.2-RELEASE FreeBSD 12.2-RELEASE arm64
maintained by: yuri_at_FreeBSD.org
Makefile ident: 
Poudriere version: 3.2.8-16-g00a37fcb
Host OSVERSION: 1400008
Jail OSVERSION: 1202000
Job Id: 11

---Begin Environment---
SHELL=/bin/csh
OSVERSION=1202000
UNAME_v=FreeBSD 12.2-RELEASE
UNAME_r=12.2-RELEASE
BLOCKSIZE=K
MAIL=/var/mail/root
STATUS=1
HOME=/root
PATH=/sbin:/bin:/usr/sbin:/usr/bin:/usr/local/sbin:/usr/local/bin:/root/bin
LOCALBASE=/usr/local
USER=root
LIBEXECPREFIX=/usr/local/libexec/poudriere
POUDRIERE_VERSION=3.2.8-16-g00a37fcb
MASTERMNT=/usr/local/poudriere/data/.m/122arm64-quarterly/ref
POUDRIERE_BUILD_TYPE=bulk
PACKAGE_BUILDING=yes
SAVED_TERM=
PWD=/usr/local/poudriere/data/.m/122arm64-quarterly/ref/.p/pool
P_PORTS_FEATURES=FLAVORS SELECTED_OPTIONS
MASTERNAME=122arm64-quarterly
SCRIPTPREFIX=/usr/local/share/poudriere
OLDPWD=/usr/local/poudriere/data/.m/122arm64-quarterly/ref/.p
SCRIPTPATH=/usr/local/share/poudriere/bulk.sh
POUDRIEREPATH=/usr/local/bin/poudriere
---End Environment---

---Begin Poudriere Port Flags/Env---
PORT_FLAGS=
PKGENV=
FLAVOR=
DEPENDS_ARGS=
MAKE_ARGS=
---End Poudriere Port Flags/Env---

---Begin OPTIONS List---
---End OPTIONS List---

--MAINTAINER--
yuri_at_FreeBSD.org
--End MAINTAINER--

--CONFIGURE_ARGS--

--End CONFIGURE_ARGS--

--CONFIGURE_ENV--
XDG_DATA_HOME=/wrkdirs/usr/ports/multimedia/obs-streamfx/work  XDG_CONFIG_HOME=/wrkdirs/usr/ports/multimedia/obs-streamfx/work  HOME=/wrkdirs/usr/ports/multimedia/obs-streamfx/work TMPDIR="/tmp" PATH=/wrkdirs/usr/ports/multimedia/obs-streamfx/work/.bin:/sbin:/bin:/usr/sbin:/usr/bin:/usr/local/sbin:/usr/local/bin:/root/bin SHELL=/bin/sh CONFIG_SHELL=/bin/sh
--End CONFIGURE_ENV--

--MAKE_ENV--
NINJA_STATUS="[%p %s/%t] " XDG_DATA_HOME=/wrkdirs/usr/ports/multimedia/obs-streamfx/work  XDG_CONFIG_HOME=/wrkdirs/usr/ports/multimedia/obs-streamfx/work  HOME=/wrkdirs/usr/ports/multimedia/obs-streamfx/work TMPDIR="/tmp" PATH=/wrkdirs/usr/ports/multimedia/obs-streamfx/work/.bin:/sbin:/bin:/usr/sbin:/usr/bin:/usr/local/sbin:/usr/local/bin:/root/bin NO_PIE=yes MK_DEBUG_FILES=no MK_KERNEL_SYMBOLS=no SHELL=/bin/sh NO_LINT=YES DESTDIR=/wrkdirs/usr/ports/multimedia/obs-streamfx/work/stage PREFIX=/usr/local  LOCALBASE=/usr/local  CC="cc" CFLAGS="-O2 -pipe  -fstack-protector-strong -fno-strict-aliasing "  CPP="cpp" CPPFLAGS=""  LDFLAGS=" -fstack-protector-strong " LIBS=""  CXX="c++" CXXFLAGS="-O2 -pipe -fstack-protector-strong -fno-strict-aliasing  "  MANPREFIX="/usr/local" BSD_INSTALL_PROGRAM="install  -s -m 555"  BSD_INSTALL_LIB="install  -s -m 0644"  BSD_INSTALL_SCRIPT="install  -m 555"  BSD_INSTALL_DATA="install  -m 0644"  BSD_INSTALL_MAN="install  -m 444"
--End MAKE_ENV--

--PLIST_SUB--
CMAKE_BUILD_TYPE="release" OSREL=12.2 PREFIX=%D LOCALBASE=/usr/local  RESETPREFIX=/usr/local LIB32DIR=lib DOCSDIR="share/doc/obs-streamfx"  EXAMPLESDIR="share/examples/obs-streamfx"  DATADIR="share/obs-streamfx"  WWWDIR="www/obs-streamfx"  ETCDIR="etc/obs-streamfx"
--End PLIST_SUB--

--SUB_LIST--
PREFIX=/usr/local LOCALBASE=/usr/local  DATADIR=/usr/local/share/obs-streamfx DOCSDIR=/usr/local/share/doc/obs-streamfx EXAMPLESDIR=/usr/local/share/examples/obs-streamfx  WWWDIR=/usr/local/www/obs-streamfx ETCDIR=/usr/local/etc/obs-streamfx
--End SUB_LIST--

---Begin make.conf---
USE_PACKAGE_DEPENDS=yes
BATCH=yes
WRKDIRPREFIX=/wrkdirs
PORTSDIR=/usr/ports
PACKAGES=/packages
DISTDIR=/distfiles
PACKAGE_BUILDING=yes
PACKAGE_BUILDING_FLAVORS=yes
#### /usr/local/etc/poudriere.d/make.conf ####
# XXX: We really need this but cannot use it while 'make checksum' does not
# try the next mirror on checksum failure.  It currently retries the same
# failed mirror and then fails rather then trying another.  It *does*
# try the next if the size is mismatched though.
#MASTER_SITE_FREEBSD=yes
# Build ALLOW_MAKE_JOBS_PACKAGES with 2 jobs
MAKE_JOBS_NUMBER=2
#### /usr/ports/Mk/Scripts/ports_env.sh ####
_CCVERSION_921dbbb2=FreeBSD clang version 10.0.1 (git_at_github.com:llvm/llvm-project.git llvmorg-10.0.1-0-gef32c611aa2) Target: aarch64-unknown-freebsd12.2 Thread model: posix InstalledDir: /usr/bin
_ALTCCVERSION_921dbbb2=none
_CXXINTERNAL_acaad9ca=FreeBSD clang version 10.0.1 (git_at_github.com:llvm/llvm-project.git llvmorg-10.0.1-0-gef32c611aa2) Target: aarch64-unknown-freebsd12.2 Thread model: posix InstalledDir: /usr/bin "/usr/bin/ld" "--eh-frame-hdr" "-dynamic-linker" "/libexec/ld-elf.so.1" "--enable-new-dtags" "-o" "a.out" "/usr/lib/crt1.o" "/usr/lib/crti.o" "/usr/lib/crtbegin.o" "-L/usr/lib" "/dev/null" "-lc++" "-lm" "-lgcc" "--as-needed" "-lgcc_s" "--no-as-needed" "-lc" "-lgcc" "--as-needed" "-lgcc_s" "--no-as-needed" "/usr/lib/crtend.o" "/usr/lib/crtn.o"
CC_OUTPUT_921dbbb2_58173849=yes
CC_OUTPUT_921dbbb2_9bdba57c=yes
CC_OUTPUT_921dbbb2_6a4fe7f5=yes
CC_OUTPUT_921dbbb2_6bcac02b=yes
CC_OUTPUT_921dbbb2_67d20829=yes
CC_OUTPUT_921dbbb2_bfa62e83=yes
CC_OUTPUT_921dbbb2_f0b4d593=yes
CC_OUTPUT_921dbbb2_308abb44=yes
CC_OUTPUT_921dbbb2_f00456e5=yes
CC_OUTPUT_921dbbb2_65ad290d=yes
CC_OUTPUT_921dbbb2_f2776b26=yes
CC_OUTPUT_921dbbb2_b2657cc3=yes
CC_OUTPUT_921dbbb2_380987f7=yes
CC_OUTPUT_921dbbb2_160933ec=yes
CC_OUTPUT_921dbbb2_fb62803b=yes
_OBJC_CCVERSION_921dbbb2=FreeBSD clang version 10.0.1 (git_at_github.com:llvm/llvm-project.git llvmorg-10.0.1-0-gef32c611aa2) Target: aarch64-unknown-freebsd12.2 Thread model: posix InstalledDir: /usr/bin
_OBJC_ALTCCVERSION_921dbbb2=none
ARCH=aarch64
OPSYS=FreeBSD
_OSRELEASE=12.2-RELEASE
OSREL=12.2
OSVERSION=1202000
PYTHONBASE=/usr/local
CONFIGURE_MAX_CMD_LEN=524288
HAVE_PORTS_ENV=1
#### Misc Poudriere ####
GID=0
UID=0
---End make.conf---
--Resource limits--
cpu time               (seconds, -t)  unlimited
file size           (512-blocks, -f)  unlimited
data seg size           (kbytes, -d)  1048576
stack size              (kbytes, -s)  1048576
core file size      (512-blocks, -c)  unlimited
max memory size         (kbytes, -m)  unlimited
locked memory           (kbytes, -l)  unlimited
max user processes              (-u)  89999
open files                      (-n)  1024
virtual mem size        (kbytes, -v)  unlimited
swap limit              (kbytes, -w)  unlimited
socket buffer size       (bytes, -b)  unlimited
pseudo-terminals                (-p)  unlimited
kqueues                         (-k)  unlimited
umtx shared locks               (-o)  unlimited
--End resource limits--
=======================<phase: check-sanity   >============================
===>  License GPLv2 accepted by the user
===========================================================================
=======================<phase: pkg-depends    >============================
===>   obs-streamfx-0.9.3 depends on file: /usr/local/sbin/pkg - not found
===>   Installing existing package /packages/All/pkg-1.16.3.txz
[122arm64-quarterly-job-11] Installing pkg-1.16.3...
[122arm64-quarterly-job-11] Extracting pkg-1.16.3: .......... done
===>   obs-streamfx-0.9.3 depends on file: /usr/local/sbin/pkg - found
===>   Returning to build of obs-streamfx-0.9.3
===========================================================================
=======================<phase: fetch-depends  >============================
===========================================================================
=======================<phase: fetch          >============================
===>  License GPLv2 accepted by the user
===> Fetching all distfiles required by obs-streamfx-0.9.3 for building
===========================================================================
=======================<phase: checksum       >============================
===>  License GPLv2 accepted by the user
===> Fetching all distfiles required by obs-streamfx-0.9.3 for building
=> SHA256 Checksum OK for Xaymar-obs-StreamFX-0.9.3_GH0.tar.gz.
===========================================================================
=======================<phase: extract-depends>============================
===========================================================================
=======================<phase: extract        >============================
===>  License GPLv2 accepted by the user
===> Fetching all distfiles required by obs-streamfx-0.9.3 for building
===>  Extracting for obs-streamfx-0.9.3
=> SHA256 Checksum OK for Xaymar-obs-StreamFX-0.9.3_GH0.tar.gz.
===========================================================================
=======================<phase: patch-depends  >============================
===========================================================================
=======================<phase: patch          >============================
===>  Patching for obs-streamfx-0.9.3
===>  Applying FreeBSD patches for obs-streamfx-0.9.3 from /usr/ports/multimedia/obs-streamfx/files
===========================================================================
=======================<phase: build-depends  >============================
===>   obs-streamfx-0.9.3 depends on file: /usr/local/include/nlohmann/json.hpp - not found
===>   Installing existing package /packages/All/nlohmann-json-3.9.1_2.txz
[122arm64-quarterly-job-11] Installing nlohmann-json-3.9.1_2...
[122arm64-quarterly-job-11] Extracting nlohmann-json-3.9.1_2: .......... done
===>   obs-streamfx-0.9.3 depends on file: /usr/local/include/nlohmann/json.hpp - found
===>   Returning to build of obs-streamfx-0.9.3
===>   obs-streamfx-0.9.3 depends on file: /usr/local/bin/cmake - not found
===>   Installing existing package /packages/All/cmake-3.20.4.txz
[122arm64-quarterly-job-11] Installing cmake-3.20.4...
[122arm64-quarterly-job-11] `-- Installing curl-7.77.0...
[122arm64-quarterly-job-11] |   `-- Installing ca_root_nss-3.63...
[122arm64-quarterly-job-11] |   `-- Extracting ca_root_nss-3.63: ........ done
[122arm64-quarterly-job-11] |   `-- Installing libnghttp2-1.43.0...
[122arm64-quarterly-job-11] |   `-- Extracting libnghttp2-1.43.0: .......... done
[122arm64-quarterly-job-11] `-- Extracting curl-7.77.0: .......... done
[122arm64-quarterly-job-11] `-- Installing expat-2.4.1...
[122arm64-quarterly-job-11] `-- Extracting expat-2.4.1: .......... done
[122arm64-quarterly-job-11] `-- Installing jsoncpp-1.9.4...
[122arm64-quarterly-job-11] `-- Extracting jsoncpp-1.9.4: .......... done
[122arm64-quarterly-job-11] `-- Installing libarchive-3.5.1,1...
[122arm64-quarterly-job-11] |   `-- Installing liblz4-1.9.3,1...
<snip>
-- The C compiler identification is Clang 10.0.1
-- The CXX compiler identification is Clang 10.0.1
-- Detecting C compiler ABI info
-- Detecting C compiler ABI info - done
-- Check for working C compiler: /usr/bin/cc - skipped
-- Detecting C compile features
-- Detecting C compile features - done
-- Detecting CXX compiler ABI info
-- Detecting CXX compiler ABI info - done
-- Check for working CXX compiler: /usr/bin/c++ - skipped
-- Detecting CXX compile features
-- Detecting CXX compile features - done
-- StreamFX: Using packaged or remote obs-studio.
-- StreamFX: Using packaged obs-studio.
-- Found CURL: /usr/local/lib/libcurl.so (found version "7.77.0")  
-- Found FFmpeg: /usr/local/include/../lib/libavutil.so (found version "56.70.100") found components: avutil avcodec swscale 
-- Configuring done
-- Generating done
CMake Warning:
  Manually-specified variables were not used by the project:

    CMAKE_COLOR_MAKEFILE
    CMAKE_C_FLAGS_RELEASE
    CMAKE_SHARED_LINKER_FLAGS
    CMAKE_VERBOSE_MAKEFILE
    THREADS_HAVE_PTHREAD_ARG


-- Build files have been written to: /wrkdirs/usr/ports/multimedia/obs-streamfx/work/.build
===========================================================================
=======================<phase: build          >============================
===>  Building for obs-streamfx-0.9.3
[  1% 2/66] /usr/bin/c++ -DENABLE_ENCODER_FFMPEG -DENABLE_FILTER_BLUR -DENABLE_FILTER_COLOR_GRADE -DENABLE_FILTER_DISPLACEMENT -DENABLE_FILTER_DYNAMIC_MASK -DENABLE_FILTER_SDF_EFFECTS -DENABLE_FILTER_SHADER -DENABLE_FILTER_TRANSFORM -DENABLE_SOURCE_MIRROR -DENABLE_SOURCE_SHADER -DENABLE_TRANSITION_SHADER -DENABLE_UPDATER -DHAVE_OBSCONFIG_H -DStreamFX_EXPORTS -Igenerated -I/wrkdirs/usr/ports/multimedia/obs-streamfx/work/obs-StreamFX-0.9.3/source -I/usr/local/lib/include -I/usr/local/include -I/wrkdirs/usr/ports/multimedia/obs-streamfx/work/obs-StreamFX-0.9.3/third-party/nlohmann-json/single_include -isystem /usr/local/include/obs -O2 -pipe -fstack-protector-strong -fno-strict-aliasing -Wall -Wno-missing-braces -Wmissing-field-initializers -Wno-c++98-compat-pedantic -Wold-style-cast -Wno-documentation -Wno-documentation-unknown-command -Wno-covered-switch-default -Wno-switch-enum -O2 -pipe -fstack-protector-strong -fno-strict-aliasing -fPIC -pthread -std=c++17 -MD -MT CMakeFiles/Stream
 FX.dir/generated/module.cpp.o -MF CMakeFiles/StreamFX.dir/generated/module.cpp.o.d -o CMakeFiles/StreamFX.dir/generated/module.cpp.o -c generated/module.cpp
[  3% 3/66] /usr/bin/c++ -DENABLE_ENCODER_FFMPEG -DENABLE_FILTER_BLUR -DENABLE_FILTER_COLOR_GRADE -DENABLE_FILTER_DISPLACEMENT -DENABLE_FILTER_DYNAMIC_MASK -DENABLE_FILTER_SDF_EFFECTS -DENABLE_FILTER_SHADER -DENABLE_FILTER_TRANSFORM -DENABLE_SOURCE_MIRROR -DENABLE_SOURCE_SHADER -DENABLE_TRANSITION_SHADER -DENABLE_UPDATER -DHAVE_OBSCONFIG_H -DStreamFX_EXPORTS -Igenerated -I/wrkdirs/usr/ports/multimedia/obs-streamfx/work/obs-StreamFX-0.9.3/source -I/usr/local/lib/include -I/usr/local/include -I/wrkdirs/usr/ports/multimedia/obs-streamfx/work/obs-StreamFX-0.9.3/third-party/nlohmann-json/single_include -isystem /usr/local/include/obs -O2 -pipe -fstack-protector-strong -fno-strict-aliasing -Wall -Wno-missing-braces -Wmissing-field-initializers -Wno-c++98-compat-pedantic -Wold-style-cast -Wno-documentation -Wno-documentation-unknown-command -Wno-covered-switch-default -Wno-switch-enum -O2 -pipe -fstack-protector-strong -fno-strict-aliasing -fPIC -pthread -std=c++17 -MD -MT CMakeFiles/Stream
 FX.dir/source/util/util-curl.cpp.o -MF CMakeFiles/StreamFX.dir/source/util/util-curl.cpp.o.d -o CMakeFiles/StreamFX.dir/source/util/util-curl.cpp.o -c /wrkdirs/usr/ports/multimedia/obs-streamfx/work/obs-StreamFX-0.9.3/source/util/util-curl.cpp
[  4% 4/66] /usr/bin/c++ -DENABLE_ENCODER_FFMPEG -DENABLE_FILTER_BLUR -DENABLE_FILTER_COLOR_GRADE -DENABLE_FILTER_DISPLACEMENT -DENABLE_FILTER_DYNAMIC_MASK -DENABLE_FILTER_SDF_EFFECTS -DENABLE_FILTER_SHADER -DENABLE_FILTER_TRANSFORM -DENABLE_SOURCE_MIRROR -DENABLE_SOURCE_SHADER -DENABLE_TRANSITION_SHADER -DENABLE_UPDATER -DHAVE_OBSCONFIG_H -DStreamFX_EXPORTS -Igenerated -I/wrkdirs/usr/ports/multimedia/obs-streamfx/work/obs-StreamFX-0.9.3/source -I/usr/local/lib/include -I/usr/local/include -I/wrkdirs/usr/ports/multimedia/obs-streamfx/work/obs-StreamFX-0.9.3/third-party/nlohmann-json/single_include -isystem /usr/local/include/obs -O2 -pipe -fstack-protector-strong -fno-strict-aliasing -Wall -Wno-missing-braces -Wmissing-field-initializers -Wno-c++98-compat-pedantic -Wold-style-cast -Wno-documentation -Wno-documentation-unknown-command -Wno-covered-switch-default -Wno-switch-enum -O2 -pipe -fstack-protector-strong -fno-strict-aliasing -fPIC -pthread -std=c++17 -MD -MT CMakeFiles/Stream
 FX.dir/source/configuration.cpp.o -MF CMakeFiles/StreamFX.dir/source/configuration.cpp.o.d -o CMakeFiles/StreamFX.dir/source/configuration.cpp.o -c /wrkdirs/usr/ports/multimedia/obs-streamfx/work/obs-StreamFX-0.9.3/source/configuration.cpp
[  6% 5/66] /usr/bin/c++ -DENABLE_ENCODER_FFMPEG -DENABLE_FILTER_BLUR -DENABLE_FILTER_COLOR_GRADE -DENABLE_FILTER_DISPLACEMENT -DENABLE_FILTER_DYNAMIC_MASK -DENABLE_FILTER_SDF_EFFECTS -DENABLE_FILTER_SHADER -DENABLE_FILTER_TRANSFORM -DENABLE_SOURCE_MIRROR -DENABLE_SOURCE_SHADER -DENABLE_TRANSITION_SHADER -DENABLE_UPDATER -DHAVE_OBSCONFIG_H -DStreamFX_EXPORTS -Igenerated -I/wrkdirs/usr/ports/multimedia/obs-streamfx/work/obs-StreamFX-0.9.3/source -I/usr/local/lib/include -I/usr/local/include -I/wrkdirs/usr/ports/multimedia/obs-streamfx/work/obs-StreamFX-0.9.3/third-party/nlohmann-json/single_include -isystem /usr/local/include/obs -O2 -pipe -fstack-protector-strong -fno-strict-aliasing -Wall -Wno-missing-braces -Wmissing-field-initializers -Wno-c++98-compat-pedantic -Wold-style-cast -Wno-documentation -Wno-documentation-unknown-command -Wno-covered-switch-default -Wno-switch-enum -O2 -pipe -fstack-protector-strong -fno-strict-aliasing -fPIC -pthread -std=c++17 -MD -MT CMakeFiles/Stream
 FX.dir/source/plugin.cpp.o -MF CMakeFiles/StreamFX.dir/source/plugin.cpp.o.d -o CMakeFiles/StreamFX.dir/source/plugin.cpp.o -c /wrkdirs/usr/ports/multimedia/obs-streamfx/work/obs-StreamFX-0.9.3/source/plugin.cpp
FAILED: CMakeFiles/StreamFX.dir/source/plugin.cpp.o 
/usr/bin/c++ -DENABLE_ENCODER_FFMPEG -DENABLE_FILTER_BLUR -DENABLE_FILTER_COLOR_GRADE -DENABLE_FILTER_DISPLACEMENT -DENABLE_FILTER_DYNAMIC_MASK -DENABLE_FILTER_SDF_EFFECTS -DENABLE_FILTER_SHADER -DENABLE_FILTER_TRANSFORM -DENABLE_SOURCE_MIRROR -DENABLE_SOURCE_SHADER -DENABLE_TRANSITION_SHADER -DENABLE_UPDATER -DHAVE_OBSCONFIG_H -DStreamFX_EXPORTS -Igenerated -I/wrkdirs/usr/ports/multimedia/obs-streamfx/work/obs-StreamFX-0.9.3/source -I/usr/local/lib/include -I/usr/local/include -I/wrkdirs/usr/ports/multimedia/obs-streamfx/work/obs-StreamFX-0.9.3/third-party/nlohmann-json/single_include -isystem /usr/local/include/obs -O2 -pipe -fstack-protector-strong -fno-strict-aliasing -Wall -Wno-missing-braces -Wmissing-field-initializers -Wno-c++98-compat-pedantic -Wold-style-cast -Wno-documentation -Wno-documentation-unknown-command -Wno-covered-switch-default -Wno-switch-enum -O2 -pipe -fstack-protector-strong -fno-strict-aliasing -fPIC -pthread -std=c++17 -MD -MT CMakeFiles/StreamFX.dir/sourc
 e/plugin.cpp.o -MF CMakeFiles/StreamFX.dir/source/plugin.cpp.o.d -o CMakeFiles/StreamFX.dir/source/plugin.cpp.o -c /wrkdirs/usr/ports/multimedia/obs-streamfx/work/obs-StreamFX-0.9.3/source/plugin.cpp
In file included from /wrkdirs/usr/ports/multimedia/obs-streamfx/work/obs-StreamFX-0.9.3/source/plugin.cpp:24:
In file included from /wrkdirs/usr/ports/multimedia/obs-streamfx/work/obs-StreamFX-0.9.3/source/obs/gs/gs-vertexbuffer.hpp:23:
In file included from /wrkdirs/usr/ports/multimedia/obs-streamfx/work/obs-StreamFX-0.9.3/source/obs/gs/gs-vertex.hpp:22:
In file included from /usr/lib/clang/10.0.1/include/xmmintrin.h:13:
/usr/lib/clang/10.0.1/include/mmintrin.h:13:19: error: typedef redefinition with different types ('__attribute__((__vector_size__(1 * sizeof(long long)))) long long' (vector of 1 'long long' value) vs 'simde__m64' (aka 'int32x2_t'))
typedef long long __m64 __attribute__((__vector_size__(8), __aligned__(8)));
                  ^
/usr/local/include/obs/util/simde/x86/mmx.h:122:20: note: previous definition is here
typedef simde__m64 __m64;
                   ^
In file included from /wrkdirs/usr/ports/multimedia/obs-streamfx/work/obs-StreamFX-0.9.3/source/plugin.cpp:24:
In file included from /wrkdirs/usr/ports/multimedia/obs-streamfx/work/obs-StreamFX-0.9.3/source/obs/gs/gs-vertexbuffer.hpp:23:
In file included from /wrkdirs/usr/ports/multimedia/obs-streamfx/work/obs-StreamFX-0.9.3/source/obs/gs/gs-vertex.hpp:22:
In file included from /usr/lib/clang/10.0.1/include/xmmintrin.h:13:
/usr/lib/clang/10.0.1/include/mmintrin.h:31:11: error: too many arguments provided to function-like macro invocation
_mm_empty(void)
          ^
/usr/local/include/obs/util/simde/x86/mmx.h:783:9: note: macro '_mm_empty' defined here
#define _mm_empty() simde_mm_empty()
        ^
In file included from /wrkdirs/usr/ports/multimedia/obs-streamfx/work/obs-StreamFX-0.9.3/source/plugin.cpp:24:
In file included from /wrkdirs/usr/ports/multimedia/obs-streamfx/work/obs-StreamFX-0.9.3/source/obs/gs/gs-vertexbuffer.hpp:23:
In file included from /wrkdirs/usr/ports/multimedia/obs-streamfx/work/obs-StreamFX-0.9.3/source/obs/gs/gs-vertex.hpp:22:
In file included from /usr/lib/clang/10.0.1/include/xmmintrin.h:13:
/usr/lib/clang/10.0.1/include/mmintrin.h:30:72: error: '__target__' attribute only applies to functions
static __inline__ void  __attribute__((__always_inline__, __nodebug__, __target__("mmx")))
                                                                       ^
/usr/lib/clang/10.0.1/include/mmintrin.h:31:1: error: variable has incomplete type 'void'
_mm_empty(void)
^
/usr/lib/clang/10.0.1/include/mmintrin.h:33:5: error: use of undeclared identifier '__builtin_ia32_emms'; did you mean '__builtin_isless'?
    __builtin_ia32_emms();
    ^
/usr/include/c++/v1/math.h:651:12: note: '__builtin_isless' declared here
    return isless(__lcpp_x, __lcpp_y);
           ^
/usr/include/math.h:120:23: note: expanded from macro 'isless'
#define isless(x, y)            __builtin_isless((x), (y))
                                ^
In file included from /wrkdirs/usr/ports/multimedia/obs-streamfx/work/obs-StreamFX-0.9.3/source/plugin.cpp:24:
In file included from /wrkdirs/usr/ports/multimedia/obs-streamfx/work/obs-StreamFX-0.9.3/source/obs/gs/gs-vertexbuffer.hpp:23:
In file included from /wrkdirs/usr/ports/multimedia/obs-streamfx/work/obs-StreamFX-0.9.3/source/obs/gs/gs-vertex.hpp:22:
In file included from /usr/lib/clang/10.0.1/include/xmmintrin.h:13:
/usr/lib/clang/10.0.1/include/mmintrin.h:33:25: error: too few arguments to function call, expected 2, have 0
    __builtin_ia32_emms();
                        ^
/usr/lib/clang/10.0.1/include/mmintrin.h:34:2: error: expected ';' after top level declarator
}
 ^
/usr/lib/clang/10.0.1/include/mmintrin.h:48:1: error: redefinition of 'simde_mm_cvtsi32_si64'
_mm_cvtsi32_si64(int __i)
^
/usr/local/include/obs/util/simde/x86/mmx.h:719:29: note: expanded from macro '_mm_cvtsi32_si64'
#define _mm_cvtsi32_si64(a) simde_mm_cvtsi32_si64(a)
                            ^
/usr/local/include/obs/util/simde/x86/mmx.h:699:12: note: previous definition is here
simde__m64 simde_mm_cvtsi32_si64(int32_t a)
           ^
In file included from /wrkdirs/usr/ports/multimedia/obs-streamfx/work/obs-StreamFX-0.9.3/source/plugin.cpp:24:
In file included from /wrkdirs/usr/ports/multimedia/obs-streamfx/work/obs-StreamFX-0.9.3/source/obs/gs/gs-vertexbuffer.hpp:23:
In file included from /wrkdirs/usr/ports/multimedia/obs-streamfx/work/obs-StreamFX-0.9.3/source/obs/gs/gs-vertex.hpp:22:
In file included from /usr/lib/clang/10.0.1/include/xmmintrin.h:13:
/usr/lib/clang/10.0.1/include/mmintrin.h:50:19: error: use of undeclared identifier '__builtin_ia32_vec_init_v2si'
    return (__m64)__builtin_ia32_vec_init_v2si(__i, 0);
                  ^
/usr/lib/clang/10.0.1/include/mmintrin.h:65:1: error: redefinition of 'simde_mm_cvtsi64_si32'
_mm_cvtsi64_si32(__m64 __m)
^
/usr/local/include/obs/util/simde/x86/mmx.h:769:29: note: expanded from macro '_mm_cvtsi64_si32'
#define _mm_cvtsi64_si32(a) simde_mm_cvtsi64_si32(a)
                            ^
/usr/local/include/obs/util/simde/x86/mmx.h:748:9: note: previous definition is here
int32_t simde_mm_cvtsi64_si32(simde__m64 a)
        ^
In file included from /wrkdirs/usr/ports/multimedia/obs-streamfx/work/obs-StreamFX-0.9.3/source/plugin.cpp:24:
In file included from /wrkdirs/usr/ports/multimedia/obs-streamfx/work/obs-StreamFX-0.9.3/source/obs/gs/gs-vertexbuffer.hpp:23:
In file included from /wrkdirs/usr/ports/multimedia/obs-streamfx/work/obs-StreamFX-0.9.3/source/obs/gs/gs-vertex.hpp:22:
In file included from /usr/lib/clang/10.0.1/include/xmmintrin.h:13:
/usr/lib/clang/10.0.1/include/mmintrin.h:67:12: error: use of undeclared identifier '__builtin_ia32_vec_ext_v2si'
    return __builtin_ia32_vec_ext_v2si((__v2si)__m, 0);
           ^
/usr/lib/clang/10.0.1/include/mmintrin.h:97:1: error: functions that differ only in their return type cannot be overloaded
_mm_cvtm64_si64(__m64 __m)
^
/usr/local/include/obs/util/simde/x86/mmx.h:694:28: note: expanded from macro '_mm_cvtm64_si64'
#define _mm_cvtm64_si64(a) simde_mm_cvtm64_si64(a)
                           ^
/usr/local/include/obs/util/simde/x86/mmx.h:671:9: note: previous definition is here
int64_t simde_mm_cvtm64_si64(simde__m64 a)
~~~~~~~ ^
In file included from /wrkdirs/usr/ports/multimedia/obs-streamfx/work/obs-StreamFX-0.9.3/source/plugin.cpp:24:
In file included from /wrkdirs/usr/ports/multimedia/obs-streamfx/work/obs-StreamFX-0.9.3/source/obs/gs/gs-vertexbuffer.hpp:23:
In file included from /wrkdirs/usr/ports/multimedia/obs-streamfx/work/obs-StreamFX-0.9.3/source/obs/gs/gs-vertex.hpp:22:
In file included from /usr/lib/clang/10.0.1/include/xmmintrin.h:13:
/usr/lib/clang/10.0.1/include/mmintrin.h:127:1: error: redefinition of 'simde_mm_packs_pi16'
_mm_packs_pi16(__m64 __m1, __m64 __m2)
^
/usr/local/include/obs/util/simde/x86/mmx.h:956:30: note: expanded from macro '_mm_packs_pi16'
#define _mm_packs_pi16(a, b) simde_mm_packs_pi16(a, b)
                             ^
/usr/local/include/obs/util/simde/x86/mmx.h:914:12: note: previous definition is here
simde__m64 simde_mm_packs_pi16(simde__m64 a, simde__m64 b)
           ^
In file included from /wrkdirs/usr/ports/multimedia/obs-streamfx/work/obs-StreamFX-0.9.3/source/plugin.cpp:24:
In file included from /wrkdirs/usr/ports/multimedia/obs-streamfx/work/obs-StreamFX-0.9.3/source/obs/gs/gs-vertexbuffer.hpp:23:
In file included from /wrkdirs/usr/ports/multimedia/obs-streamfx/work/obs-StreamFX-0.9.3/source/obs/gs/gs-vertex.hpp:22:
In file included from /usr/lib/clang/10.0.1/include/xmmintrin.h:13:
/usr/lib/clang/10.0.1/include/mmintrin.h:129:19: error: use of undeclared identifier '__builtin_ia32_packsswb'
    return (__m64)__builtin_ia32_packsswb((__v4hi)__m1, (__v4hi)__m2);
                  ^
/usr/lib/clang/10.0.1/include/mmintrin.h:157:1: error: redefinition of 'simde_mm_packs_pi32'
_mm_packs_pi32(__m64 __m1, __m64 __m2)
^
/usr/local/include/obs/util/simde/x86/mmx.h:1003:30: note: expanded from macro '_mm_packs_pi32'
#define _mm_packs_pi32(a, b) simde_mm_packs_pi32(a, b)
                             ^
/usr/local/include/obs/util/simde/x86/mmx.h:961:12: note: previous definition is here
simde__m64 simde_mm_packs_pi32(simde__m64 a, simde__m64 b)
           ^
In file included from /wrkdirs/usr/ports/multimedia/obs-streamfx/work/obs-StreamFX-0.9.3/source/plugin.cpp:24:
In file included from /wrkdirs/usr/ports/multimedia/obs-streamfx/work/obs-StreamFX-0.9.3/source/obs/gs/gs-vertexbuffer.hpp:23:
In file included from /wrkdirs/usr/ports/multimedia/obs-streamfx/work/obs-StreamFX-0.9.3/source/obs/gs/gs-vertex.hpp:22:
In file included from /usr/lib/clang/10.0.1/include/xmmintrin.h:13:
/usr/lib/clang/10.0.1/include/mmintrin.h:159:19: error: use of undeclared identifier '__builtin_ia32_packssdw'
    return (__m64)__builtin_ia32_packssdw((__v2si)__m1, (__v2si)__m2);
                  ^
/usr/lib/clang/10.0.1/include/mmintrin.h:187:1: error: redefinition of 'simde_mm_packs_pu16'
_mm_packs_pu16(__m64 __m1, __m64 __m2)
^
/usr/local/include/obs/util/simde/x86/mmx.h:1069:30: note: expanded from macro '_mm_packs_pu16'
#define _mm_packs_pu16(a, b) simde_mm_packs_pu16(a, b)
                             ^
/usr/local/include/obs/util/simde/x86/mmx.h:1008:12: note: previous definition is here
simde__m64 simde_mm_packs_pu16(simde__m64 a, simde__m64 b)
           ^
In file included from /wrkdirs/usr/ports/multimedia/obs-streamfx/work/obs-StreamFX-0.9.3/source/plugin.cpp:24:
In file included from /wrkdirs/usr/ports/multimedia/obs-streamfx/work/obs-StreamFX-0.9.3/source/obs/gs/gs-vertexbuffer.hpp:23:
In file included from /wrkdirs/usr/ports/multimedia/obs-streamfx/work/obs-StreamFX-0.9.3/source/obs/gs/gs-vertex.hpp:22:
In file included from /usr/lib/clang/10.0.1/include/xmmintrin.h:13:
/usr/lib/clang/10.0.1/include/mmintrin.h:189:19: error: use of undeclared identifier '__builtin_ia32_packuswb'
    return (__m64)__builtin_ia32_packuswb((__v4hi)__m1, (__v4hi)__m2);
                  ^
/usr/lib/clang/10.0.1/include/mmintrin.h:214:1: error: redefinition of 'simde_mm_unpackhi_pi8'
_mm_unpackhi_pi8(__m64 __m1, __m64 __m2)
^
/usr/local/include/obs/util/simde/x86/mmx.h:2235:32: note: expanded from macro '_mm_unpackhi_pi8'
#define _mm_unpackhi_pi8(a, b) simde_mm_unpackhi_pi8(a, b)
                               ^
/usr/local/include/obs/util/simde/x86/mmx.h:2203:12: note: previous definition is here
simde__m64 simde_mm_unpackhi_pi8(simde__m64 a, simde__m64 b)
           ^
fatal error: too many errors emitted, stopping now [-ferror-limit=]
20 errors generated.
[  7% 5/66] /usr/bin/c++ -DENABLE_ENCODER_FFMPEG -DENABLE_FILTER_BLUR -DENABLE_FILTER_COLOR_GRADE -DENABLE_FILTER_DISPLACEMENT -DENABLE_FILTER_DYNAMIC_MASK -DENABLE_FILTER_SDF_EFFECTS -DENABLE_FILTER_SHADER -DENABLE_FILTER_TRANSFORM -DENABLE_SOURCE_MIRROR -DENABLE_SOURCE_SHADER -DENABLE_TRANSITION_SHADER -DENABLE_UPDATER -DHAVE_OBSCONFIG_H -DStreamFX_EXPORTS -Igenerated -I/wrkdirs/usr/ports/multimedia/obs-streamfx/work/obs-StreamFX-0.9.3/source -I/usr/local/lib/include -I/usr/local/include -I/wrkdirs/usr/ports/multimedia/obs-streamfx/work/obs-StreamFX-0.9.3/third-party/nlohmann-json/single_include -isystem /usr/local/include/obs -O2 -pipe -fstack-protector-strong -fno-strict-aliasing -Wall -Wno-missing-braces -Wmissing-field-initializers -Wno-c++98-compat-pedantic -Wold-style-cast -Wno-documentation -Wno-documentation-unknown-command -Wno-covered-switch-default -Wno-switch-enum -O2 -pipe -fstack-protector-strong -fno-strict-aliasing -fPIC -pthread -std=c++17 -MD -MT CMakeFiles/Stream
 FX.dir/source/util/utility.cpp.o -MF CMakeFiles/StreamFX.dir/source/util/utility.cpp.o.d -o CMakeFiles/StreamFX.dir/source/util/utility.cpp.o -c /wrkdirs/usr/ports/multimedia/obs-streamfx/work/obs-StreamFX-0.9.3/source/util/utility.cpp
ninja: build stopped: subcommand failed.
===> Compilation failed unexpectedly.
Try to set MAKE_JOBS_UNSAFE=yes and rebuild before reporting the failure to
the maintainer.
*** Error code 1

Stop.
make: stopped in /usr/ports/multimedia/obs-streamfx
Received on Tue Jul 27 2021 - 04:02:06 UTC

Original text of this message