[package - 122powerpc64-quarterly][emulators/ucon64] Failed for ucon64-2.2.1 in build

From: <pkg-fallout_at_FreeBSD.org>
Date: Tue, 27 Jul 2021 03:37:21 GMT
You are receiving this mail as a port that you maintain
is failing to build on the FreeBSD package build server.
Please investigate the failure and submit a PR to fix
build.

Maintainer:     root_at_cooltrainer.org
Log URL:        http://foul1.nyi.freebsd.org/data/122powerpc64-quarterly/861e2a11357f/logs/ucon64-2.2.1.log
Build URL:      http://foul1.nyi.freebsd.org/build.html?mastername=122powerpc64-quarterly&build=861e2a11357f
Log:

=>> Building emulators/ucon64
build started at Tue Jul 27 03:36:59 UTC 2021
port directory: /usr/ports/emulators/ucon64
package name: ucon64-2.2.1
building for: FreeBSD 122powerpc64-quarterly-job-02 12.2-RELEASE FreeBSD 12.2-RELEASE powerpc
maintained by: root_at_cooltrainer.org
Makefile ident: 
Poudriere version: 3.2.8-16-g00a37fcb
Host OSVERSION: 1400008
Jail OSVERSION: 1202000
Job Id: 02

---Begin Environment---
SHELL=/bin/csh
OSVERSION=1202000
UNAME_v=FreeBSD 12.2-RELEASE
UNAME_r=12.2-RELEASE
BLOCKSIZE=K
MAIL=/var/mail/root
STATUS=1
HOME=/root
PATH=/sbin:/bin:/usr/sbin:/usr/bin:/usr/local/sbin:/usr/local/bin:/root/bin
LOCALBASE=/usr/local
USER=root
LIBEXECPREFIX=/usr/local/libexec/poudriere
POUDRIERE_VERSION=3.2.8-16-g00a37fcb
MASTERMNT=/usr/local/poudriere/data/.m/122powerpc64-quarterly/ref
POUDRIERE_BUILD_TYPE=bulk
PACKAGE_BUILDING=yes
SAVED_TERM=
PWD=/usr/local/poudriere/data/.m/122powerpc64-quarterly/ref/.p/pool
P_PORTS_FEATURES=FLAVORS SELECTED_OPTIONS
MASTERNAME=122powerpc64-quarterly
SCRIPTPREFIX=/usr/local/share/poudriere
OLDPWD=/usr/local/poudriere/data/.m/122powerpc64-quarterly/ref/.p
SCRIPTPATH=/usr/local/share/poudriere/bulk.sh
POUDRIEREPATH=/usr/local/bin/poudriere
---End Environment---

---Begin Poudriere Port Flags/Env---
PORT_FLAGS=
PKGENV=
FLAVOR=
DEPENDS_ARGS=
MAKE_ARGS=
---End Poudriere Port Flags/Env---

---Begin OPTIONS List---
===> The following configuration options are available for ucon64-2.2.1:
     CD64=on: CD64 backup unit support
     COLOR=on: ANSI-colored output
     DEBUG=off: Additional debugging output
     DISCMAGE=on: ISO/BIN/CDI format support
     PARALLEL=on: Parallel port backup unit support
     USB=on: USB backup unit support
     ZLIB=on: ZIP/gzip archive support
===> Use 'make config' to modify these settings
---End OPTIONS List---

--MAINTAINER--
root_at_cooltrainer.org
--End MAINTAINER--

--CONFIGURE_ARGS--
--with-libcd64 --enable-ansi-color --disable-debug --with-libdiscmage --enable-parallel --with-libusb --with-zlib --prefix=/usr/local ${_LATE_CONFIGURE_ARGS}
--End CONFIGURE_ARGS--

--CONFIGURE_ENV--
MAKE=gmake XDG_DATA_HOME=/wrkdirs/usr/ports/emulators/ucon64/work  XDG_CONFIG_HOME=/wrkdirs/usr/ports/emulators/ucon64/work  HOME=/wrkdirs/usr/ports/emulators/ucon64/work TMPDIR="/tmp" PATH=/wrkdirs/usr/ports/emulators/ucon64/work/.bin:/sbin:/bin:/usr/sbin:/usr/bin:/usr/local/sbin:/usr/local/bin:/root/bin SHELL=/bin/sh CONFIG_SHELL=/bin/sh CONFIG_SITE=/usr/ports/Templates/config.site lt_cv_sys_max_cmd_len=524288
--End CONFIGURE_ENV--

--MAKE_ENV--
XDG_DATA_HOME=/wrkdirs/usr/ports/emulators/ucon64/work  XDG_CONFIG_HOME=/wrkdirs/usr/ports/emulators/ucon64/work  HOME=/wrkdirs/usr/ports/emulators/ucon64/work TMPDIR="/tmp" PATH=/wrkdirs/usr/ports/emulators/ucon64/work/.bin:/sbin:/bin:/usr/sbin:/usr/bin:/usr/local/sbin:/usr/local/bin:/root/bin NO_PIE=yes MK_DEBUG_FILES=no MK_KERNEL_SYMBOLS=no SHELL=/bin/sh NO_LINT=YES PREFIX=/usr/local  LOCALBASE=/usr/local  CC="cc" CFLAGS="-O2 -pipe  -fstack-protector-strong -fno-strict-aliasing "  CPP="cpp" CPPFLAGS=""  LDFLAGS=" -fstack-protector-strong " LIBS=""  CXX="c++" CXXFLAGS="-O2 -pipe -fstack-protector-strong -fno-strict-aliasing  "  MANPREFIX="/usr/local" BSD_INSTALL_PROGRAM="install  -s -m 555"  BSD_INSTALL_LIB="install  -s -m 0644"  BSD_INSTALL_SCRIPT="install  -m 555"  BSD_INSTALL_DATA="install  -m 0644"  BSD_INSTALL_MAN="install  -m 444"
--End MAKE_ENV--

--PLIST_SUB--
CD64="" NO_CD64="_at_comment " COLOR="" NO_COLOR="_at_comment " DEBUG="_at_comment " NO_DEBUG="" DISCMAGE="" NO_DISCMAGE="_at_comment " PARALLEL="" NO_PARALLEL="_at_comment " USB="" NO_USB="_at_comment " ZLIB="" NO_ZLIB="_at_comment " OSREL=12.2 PREFIX=%D LOCALBASE=/usr/local  RESETPREFIX=/usr/local LIB32DIR=lib DOCSDIR="share/doc/ucon64"  EXAMPLESDIR="share/examples/ucon64"  DATADIR="share/ucon64"  WWWDIR="www/ucon64"  ETCDIR="etc/ucon64"
--End PLIST_SUB--

--SUB_LIST--
CD64="" NO_CD64="_at_comment " COLOR="" NO_COLOR="_at_comment " DEBUG="_at_comment " NO_DEBUG="" DISCMAGE="" NO_DISCMAGE="_at_comment " PARALLEL="" NO_PARALLEL="_at_comment " USB="" NO_USB="_at_comment " ZLIB="" NO_ZLIB="_at_comment " PREFIX=/usr/local LOCALBASE=/usr/local  DATADIR=/usr/local/share/ucon64 DOCSDIR=/usr/local/share/doc/ucon64 EXAMPLESDIR=/usr/local/share/examples/ucon64  WWWDIR=/usr/local/www/ucon64 ETCDIR=/usr/local/etc/ucon64
--End SUB_LIST--

---Begin make.conf---
USE_PACKAGE_DEPENDS=yes
BATCH=yes
WRKDIRPREFIX=/wrkdirs
PORTSDIR=/usr/ports
PACKAGES=/packages
DISTDIR=/distfiles
PACKAGE_BUILDING=yes
PACKAGE_BUILDING_FLAVORS=yes
#### /usr/local/etc/poudriere.d/make.conf ####
# XXX: We really need this but cannot use it while 'make checksum' does not
# try the next mirror on checksum failure.  It currently retries the same
# failed mirror and then fails rather then trying another.  It *does*
# try the next if the size is mismatched though.
#MASTER_SITE_FREEBSD=yes
# Build ALLOW_MAKE_JOBS_PACKAGES with 2 jobs
MAKE_JOBS_NUMBER=2
#### /usr/ports/Mk/Scripts/ports_env.sh ####
_CCVERSION_921dbbb2=cc (GCC) 4.2.1 20070831 patched [FreeBSD] Copyright (C) 2007 Free Software Foundation, Inc. This is free software; see the source for copying conditions. There is NO warranty; not even for MERCHANTABILITY or FITNESS FOR A PARTICULAR PURPOSE.
_ALTCCVERSION_921dbbb2=none
_CXXINTERNAL_acaad9ca=Using built-in specs. Target: powerpc64-undermydesk-freebsd Configured with: FreeBSD/powerpc64 system compiler Thread model: posix gcc version 4.2.1 20070831 patched [FreeBSD] "/usr/bin/ld" "--eh-frame-hdr" "-Qy" "-melf64ppc_fbsd" "--enable-new-dtags" "-dynamic-linker" "/libexec/ld-elf.so.1" "/usr/lib/crt1.o" "/usr/lib/crti.o" "/usr/lib/crtbegin.o" "-L/usr/lib" "-L/usr/lib" "/dev/null" "-lstdc++" "-lm" "-lgcc_s" "-lgcc" "-lc" "-lgcc_s" "-lgcc" "/usr/lib/crtsavres.o" "/usr/lib/crtend.o" "/usr/lib/crtn.o"
CC_OUTPUT_921dbbb2_58173849=yes
CC_OUTPUT_921dbbb2_9bdba57c=yes
CC_OUTPUT_921dbbb2_6a4fe7f5=cc1: error: unrecognized command line option "-std=c11"
CC_OUTPUT_921dbbb2_6bcac02b=yes
CC_OUTPUT_921dbbb2_67d20829=yes
CC_OUTPUT_921dbbb2_bfa62e83=cc1: error: unrecognized command line option "-std=gnu11"
CC_OUTPUT_921dbbb2_f0b4d593=yes
CC_OUTPUT_921dbbb2_308abb44=cc1plus: error: unrecognized command line option "-std=c++0x"
CC_OUTPUT_921dbbb2_f00456e5=cc1plus: error: unrecognized command line option "-std=c++11"
CC_OUTPUT_921dbbb2_65ad290d=cc1plus: error: unrecognized command line option "-std=c++14"
CC_OUTPUT_921dbbb2_f2776b26=cc1plus: error: unrecognized command line option "-std=c++17"
CC_OUTPUT_921dbbb2_b2657cc3=yes
CC_OUTPUT_921dbbb2_380987f7=cc1plus: error: unrecognized command line option "-std=gnu++11"
CC_OUTPUT_921dbbb2_160933ec=cc1plus: error: unrecognized command line option "-std=gnu++14"
CC_OUTPUT_921dbbb2_fb62803b=cc1plus: error: unrecognized command line option "-std=gnu++17"
_OBJC_CCVERSION_921dbbb2=cc (GCC) 4.2.1 20070831 patched [FreeBSD] Copyright (C) 2007 Free Software Foundation, Inc. This is free software; see the source for copying conditions. There is NO warranty; not even for MERCHANTABILITY or FITNESS FOR A PARTICULAR PURPOSE.
_OBJC_ALTCCVERSION_921dbbb2=none
ARCH=powerpc64
PPC_ABI=ELFv1
OPSYS=FreeBSD
_OSRELEASE=12.2-RELEASE
OSREL=12.2
OSVERSION=1202000
PYTHONBASE=/usr/local
CONFIGURE_MAX_CMD_LEN=524288
HAVE_PORTS_ENV=1
#### Misc Poudriere ####
GID=0
UID=0
---End make.conf---
--Resource limits--
cpu time               (seconds, -t)  unlimited
file size           (512-blocks, -f)  unlimited
data seg size           (kbytes, -d)  33554432
stack size              (kbytes, -s)  524288
core file size      (512-blocks, -c)  unlimited
max memory size         (kbytes, -m)  unlimited
locked memory           (kbytes, -l)  unlimited
max user processes              (-u)  89999
open files                      (-n)  1024
virtual mem size        (kbytes, -v)  unlimited
swap limit              (kbytes, -w)  unlimited
socket buffer size       (bytes, -b)  unlimited
pseudo-terminals                (-p)  unlimited
kqueues                         (-k)  unlimited
umtx shared locks               (-o)  unlimited
--End resource limits--
=======================<phase: check-sanity   >============================
===>  License GPLv2+ accepted by the user
===========================================================================
=======================<phase: pkg-depends    >============================
===>   ucon64-2.2.1 depends on file: /usr/local/sbin/pkg - not found
===>   Installing existing package /packages/All/pkg-1.16.3.txz
[122powerpc64-quarterly-job-02] Installing pkg-1.16.3...
[122powerpc64-quarterly-job-02] Extracting pkg-1.16.3: .......... done
===>   ucon64-2.2.1 depends on file: /usr/local/sbin/pkg - found
===>   Returning to build of ucon64-2.2.1
===========================================================================
=======================<phase: fetch-depends  >============================
===========================================================================
=======================<phase: fetch          >============================
===>  License GPLv2+ accepted by the user
===> Fetching all distfiles required by ucon64-2.2.1 for building
===========================================================================
=======================<phase: checksum       >============================
===>  License GPLv2+ accepted by the user
===> Fetching all distfiles required by ucon64-2.2.1 for building
=> SHA256 Checksum OK for ucon64-2.2.1-src.tar.gz.
===========================================================================
=======================<phase: extract-depends>============================
===========================================================================
=======================<phase: extract        >============================
===>  License GPLv2+ accepted by the user
===> Fetching all distfiles required by ucon64-2.2.1 for building
===>  Extracting for ucon64-2.2.1
=> SHA256 Checksum OK for ucon64-2.2.1-src.tar.gz.
===========================================================================
=======================<phase: patch-depends  >============================
===========================================================================
=======================<phase: patch          >============================
===>  Patching for ucon64-2.2.1
===>  Applying FreeBSD patches for ucon64-2.2.1 from /usr/ports/emulators/ucon64/files
===========================================================================
=======================<phase: build-depends  >============================
===>   ucon64-2.2.1 depends on package: gmake>=4.3 - not found
===>   Installing existing package /packages/All/gmake-4.3_2.txz
[122powerpc64-quarterly-job-02] Installing gmake-4.3_2...
[122powerpc64-quarterly-job-02] `-- Installing gettext-runtime-0.21...
[122powerpc64-quarterly-job-02] |   `-- Installing indexinfo-0.3.1...
[122powerpc64-quarterly-job-02] |   `-- Extracting indexinfo-0.3.1: .... done
[122powerpc64-quarterly-job-02] `-- Extracting gettext-runtime-0.21: .......... done
[122powerpc64-quarterly-job-02] Extracting gmake-4.3_2: .......... done
===>   ucon64-2.2.1 depends on package: gmake>=4.3 - found
===>   Returning to build of ucon64-2.2.1
===========================================================================
=======================<phase: lib-depends    >============================
===========================================================================
=======================<phase: configure      >============================
===>  Configuring for ucon64-2.2.1
configure: loading site script /usr/ports/Templates/config.site
checking build system type... powerpc64-portbld-freebsd12.2
checking host system type... powerpc64-portbld-freebsd12.2
checking target system type... powerpc64-portbld-freebsd12.2
checking whether the C compiler works... yes
checking for C compiler default output file name... a.out
checking for suffix of executables... 
checking whether we are cross compiling... no
checking for suffix of object files... o
checking whether we are using the GNU C compiler... yes
checking whether cc accepts -g... yes
checking for cc option to accept ISO C89... none needed
checking how to run the C preprocessor... cpp
checking for grep that handles long lines and -e... (cached) /usr/bin/grep
checking for egrep... (cached) /usr/bin/egrep
checking whether cc needs -traditional... no
checking whether debug output is enabled... no
checking whether support for parallel port backup units is disabled... no
checking whether to use ppdev... no
checking whether the use of color is disabled... no
checking whether add-on libraries are dynamically linked... no
checking whether to build with libdiscmage support... yes
checking whether to build with libcd64 support... no
checking whether to build without gzip and zip support... no
checking whether to build with libusb support... yes
checking for dirent.h that defines DIR... yes
checking for library containing opendir... none required
checking for ANSI C header files... (cached) yes
checking for sys/types.h... (cached) yes
checking for sys/stat.h... (cached) yes
checking for stdlib.h... (cached) yes
checking for string.h... (cached) yes
checking for memory.h... (cached) yes
checking for strings.h... (cached) yes
checking for inttypes.h... (cached) yes
checking for stdint.h... (cached) yes
checking for unistd.h... (cached) yes
checking for fcntl.h... (cached) yes
checking for unistd.h... (cached) yes
checking for byteswap.h... (cached) no
checking for inttypes.h... (cached) yes
checking sys/io.h usability... no
checking sys/io.h presence... no
checking for sys/io.h... no
checking for an ANSI C-conforming const... yes
checking for uid_t in sys/types.h... (cached) yes
checking for inline... inline
checking for pid_t... (cached) yes
checking for size_t... (cached) yes
checking for working memcmp... yes
checking for strftime... (cached) yes
checking for vprintf... (cached) yes
checking for _doprnt... no
checking for realpath... (cached) yes
checking for clock_nanosleep... yes
checking for strnlen... (cached) yes
checking for sched_setscheduler... yes
checking for ranlib... ranlib
checking for a BSD-compatible install... /usr/bin/install -c
configure: creating ./config.status
config.status: creating config.mak
config.status: creating libdiscmage/Makefile
config.status: creating config.h
config.status: creating libdiscmage/config.h

NOTE: On non-Linux systems you may need to use gmake instead of make
===========================================================================
=======================<phase: build          >============================
===>  Building for ucon64-2.2.1
gmake[1]: Entering directory '/wrkdirs/usr/ports/emulators/ucon64/work/ucon64-2.2.1-src/src'
cd libdiscmage && CFLAGS="-O2 -pipe  -fstack-protector-strong -fno-strict-aliasing " LDFLAGS=" -fstack-protector-strong " gmake
cc -O2 -pipe  -fstack-protector-strong -fno-strict-aliasing  -I. -Wall -W -Wno-implicit-fallthrough -fsigned-char -DHAVE_CONFIG_H -c ucon64.c -o ucon64.o
cc1: error: unrecognized command line option "-Wno-implicit-fallthrough"
gmake[2]: Entering directory '/wrkdirs/usr/ports/emulators/ucon64/work/ucon64-2.2.1-src/src/libdiscmage'
gmake[1]: *** [Makefile:175: ucon64.o] Error 1
gmake[1]: *** Waiting for unfinished jobs....
cc -O2 -pipe  -fstack-protector-strong -fno-strict-aliasing  -I. -Wall -W -Wno-implicit-fallthrough -DHAVE_CONFIG_H -DDLL -DDLOPEN -fPIC -c libdm_misc.c -o libdm_misc.o
cc -O2 -pipe  -fstack-protector-strong -fno-strict-aliasing  -I. -Wall -W -Wno-implicit-fallthrough -DHAVE_CONFIG_H -DDLL -DDLOPEN -fPIC -c dllinit.c -o dllinit.o
cc1: error: unrecognized command line option "-Wno-implicit-fallthrough"
cc1: error: unrecognized command line option "-Wno-implicit-fallthrough"
gmake[2]: *** [Makefile:117: libdm_misc.o] Error 1
gmake[2]: *** Waiting for unfinished jobs....
gmake[2]: *** [Makefile:117: dllinit.o] Error 1
gmake[2]: Leaving directory '/wrkdirs/usr/ports/emulators/ucon64/work/ucon64-2.2.1-src/src/libdiscmage'
gmake[1]: *** [Makefile:194: libdiscmage/discmage.so] Error 2
gmake[1]: Leaving directory '/wrkdirs/usr/ports/emulators/ucon64/work/ucon64-2.2.1-src/src'
===> Compilation failed unexpectedly.
Try to set MAKE_JOBS_UNSAFE=yes and rebuild before reporting the failure to
the maintainer.
*** Error code 1

Stop.
make: stopped in /usr/ports/emulators/ucon64
Received on Tue Jul 27 2021 - 03:37:21 UTC

Original text of this message