[package - 122powerpc64-quarterly][astro/swe] Failed for swe-2.10.1 in build

From: <pkg-fallout_at_FreeBSD.org>
Date: Tue, 27 Jul 2021 03:32:13 GMT
You are receiving this mail as a port that you maintain
is failing to build on the FreeBSD package build server.
Please investigate the failure and submit a PR to fix
build.

Maintainer:     bofh_at_FreeBSD.org
Log URL:        http://foul1.nyi.freebsd.org/data/122powerpc64-quarterly/861e2a11357f/logs/swe-2.10.1.log
Build URL:      http://foul1.nyi.freebsd.org/build.html?mastername=122powerpc64-quarterly&build=861e2a11357f
Log:

=>> Building astro/swe
build started at Tue Jul 27 03:32:01 UTC 2021
port directory: /usr/ports/astro/swe
package name: swe-2.10.1
building for: FreeBSD 122powerpc64-quarterly-job-01 12.2-RELEASE FreeBSD 12.2-RELEASE powerpc
maintained by: bofh_at_FreeBSD.org
Makefile ident: 
Poudriere version: 3.2.8-16-g00a37fcb
Host OSVERSION: 1400008
Jail OSVERSION: 1202000
Job Id: 01

---Begin Environment---
SHELL=/bin/csh
OSVERSION=1202000
UNAME_v=FreeBSD 12.2-RELEASE
UNAME_r=12.2-RELEASE
BLOCKSIZE=K
MAIL=/var/mail/root
STATUS=1
HOME=/root
PATH=/sbin:/bin:/usr/sbin:/usr/bin:/usr/local/sbin:/usr/local/bin:/root/bin
LOCALBASE=/usr/local
USER=root
LIBEXECPREFIX=/usr/local/libexec/poudriere
POUDRIERE_VERSION=3.2.8-16-g00a37fcb
MASTERMNT=/usr/local/poudriere/data/.m/122powerpc64-quarterly/ref
POUDRIERE_BUILD_TYPE=bulk
PACKAGE_BUILDING=yes
SAVED_TERM=
PWD=/usr/local/poudriere/data/.m/122powerpc64-quarterly/ref/.p/pool
P_PORTS_FEATURES=FLAVORS SELECTED_OPTIONS
MASTERNAME=122powerpc64-quarterly
SCRIPTPREFIX=/usr/local/share/poudriere
OLDPWD=/usr/local/poudriere/data/.m/122powerpc64-quarterly/ref/.p
SCRIPTPATH=/usr/local/share/poudriere/bulk.sh
POUDRIEREPATH=/usr/local/bin/poudriere
---End Environment---

---Begin Poudriere Port Flags/Env---
PORT_FLAGS=
PKGENV=
FLAVOR=
DEPENDS_ARGS=
MAKE_ARGS=
---End Poudriere Port Flags/Env---

---Begin OPTIONS List---
===> The following configuration options are available for swe-2.10.1:
     DOCS=on: Build and/or install documentation
===> Use 'make config' to modify these settings
---End OPTIONS List---

--MAINTAINER--
bofh_at_FreeBSD.org
--End MAINTAINER--

--CONFIGURE_ARGS--

--End CONFIGURE_ARGS--

--CONFIGURE_ENV--
MAKE=gmake XDG_DATA_HOME=/wrkdirs/usr/ports/astro/swe/work  XDG_CONFIG_HOME=/wrkdirs/usr/ports/astro/swe/work  HOME=/wrkdirs/usr/ports/astro/swe/work TMPDIR="/tmp" PATH=/wrkdirs/usr/ports/astro/swe/work/.bin:/sbin:/bin:/usr/sbin:/usr/bin:/usr/local/sbin:/usr/local/bin:/root/bin SHELL=/bin/sh CONFIG_SHELL=/bin/sh
--End CONFIGURE_ENV--

--MAKE_ENV--
XDG_DATA_HOME=/wrkdirs/usr/ports/astro/swe/work  XDG_CONFIG_HOME=/wrkdirs/usr/ports/astro/swe/work  HOME=/wrkdirs/usr/ports/astro/swe/work TMPDIR="/tmp" PATH=/wrkdirs/usr/ports/astro/swe/work/.bin:/sbin:/bin:/usr/sbin:/usr/bin:/usr/local/sbin:/usr/local/bin:/root/bin NO_PIE=yes MK_DEBUG_FILES=no MK_KERNEL_SYMBOLS=no SHELL=/bin/sh NO_LINT=YES PREFIX=/usr/local  LOCALBASE=/usr/local  CC="cc" CFLAGS="-O2 -pipe  -fstack-protector-strong -fno-strict-aliasing "  CPP="cpp" CPPFLAGS=""  LDFLAGS=" -fstack-protector-strong " LIBS=""  CXX="c++" CXXFLAGS="-O2 -pipe -fstack-protector-strong -fno-strict-aliasing  "  MANPREFIX="/usr/local" BSD_INSTALL_PROGRAM="install  -s -m 555"  BSD_INSTALL_LIB="install  -s -m 0644"  BSD_INSTALL_SCRIPT="install  -m 555"  BSD_INSTALL_DATA="install  -m 0644"  BSD_INSTALL_MAN="install  -m 444"
--End MAKE_ENV--

--PLIST_SUB--
PORTDOCS="" OSREL=12.2 PREFIX=%D LOCALBASE=/usr/local  RESETPREFIX=/usr/local LIB32DIR=lib DOCSDIR="share/doc/swe"  EXAMPLESDIR="share/examples/swe"  DATADIR="share/swe"  WWWDIR="www/swe"  ETCDIR="etc/swe"
--End PLIST_SUB--

--SUB_LIST--
PREFIX=/usr/local LOCALBASE=/usr/local  DATADIR=/usr/local/share/swe DOCSDIR=/usr/local/share/doc/swe EXAMPLESDIR=/usr/local/share/examples/swe  WWWDIR=/usr/local/www/swe ETCDIR=/usr/local/etc/swe
--End SUB_LIST--

---Begin make.conf---
USE_PACKAGE_DEPENDS=yes
BATCH=yes
WRKDIRPREFIX=/wrkdirs
PORTSDIR=/usr/ports
PACKAGES=/packages
DISTDIR=/distfiles
PACKAGE_BUILDING=yes
PACKAGE_BUILDING_FLAVORS=yes
#### /usr/local/etc/poudriere.d/make.conf ####
# XXX: We really need this but cannot use it while 'make checksum' does not
# try the next mirror on checksum failure.  It currently retries the same
# failed mirror and then fails rather then trying another.  It *does*
# try the next if the size is mismatched though.
#MASTER_SITE_FREEBSD=yes
# Build ALLOW_MAKE_JOBS_PACKAGES with 2 jobs
MAKE_JOBS_NUMBER=2
#### /usr/ports/Mk/Scripts/ports_env.sh ####
_CCVERSION_921dbbb2=cc (GCC) 4.2.1 20070831 patched [FreeBSD] Copyright (C) 2007 Free Software Foundation, Inc. This is free software; see the source for copying conditions. There is NO warranty; not even for MERCHANTABILITY or FITNESS FOR A PARTICULAR PURPOSE.
_ALTCCVERSION_921dbbb2=none
_CXXINTERNAL_acaad9ca=Using built-in specs. Target: powerpc64-undermydesk-freebsd Configured with: FreeBSD/powerpc64 system compiler Thread model: posix gcc version 4.2.1 20070831 patched [FreeBSD] "/usr/bin/ld" "--eh-frame-hdr" "-Qy" "-melf64ppc_fbsd" "--enable-new-dtags" "-dynamic-linker" "/libexec/ld-elf.so.1" "/usr/lib/crt1.o" "/usr/lib/crti.o" "/usr/lib/crtbegin.o" "-L/usr/lib" "-L/usr/lib" "/dev/null" "-lstdc++" "-lm" "-lgcc_s" "-lgcc" "-lc" "-lgcc_s" "-lgcc" "/usr/lib/crtsavres.o" "/usr/lib/crtend.o" "/usr/lib/crtn.o"
CC_OUTPUT_921dbbb2_58173849=yes
CC_OUTPUT_921dbbb2_9bdba57c=yes
CC_OUTPUT_921dbbb2_6a4fe7f5=cc1: error: unrecognized command line option "-std=c11"
CC_OUTPUT_921dbbb2_6bcac02b=yes
CC_OUTPUT_921dbbb2_67d20829=yes
CC_OUTPUT_921dbbb2_bfa62e83=cc1: error: unrecognized command line option "-std=gnu11"
CC_OUTPUT_921dbbb2_f0b4d593=yes
CC_OUTPUT_921dbbb2_308abb44=cc1plus: error: unrecognized command line option "-std=c++0x"
CC_OUTPUT_921dbbb2_f00456e5=cc1plus: error: unrecognized command line option "-std=c++11"
CC_OUTPUT_921dbbb2_65ad290d=cc1plus: error: unrecognized command line option "-std=c++14"
CC_OUTPUT_921dbbb2_f2776b26=cc1plus: error: unrecognized command line option "-std=c++17"
CC_OUTPUT_921dbbb2_b2657cc3=yes
CC_OUTPUT_921dbbb2_380987f7=cc1plus: error: unrecognized command line option "-std=gnu++11"
CC_OUTPUT_921dbbb2_160933ec=cc1plus: error: unrecognized command line option "-std=gnu++14"
CC_OUTPUT_921dbbb2_fb62803b=cc1plus: error: unrecognized command line option "-std=gnu++17"
_OBJC_CCVERSION_921dbbb2=cc (GCC) 4.2.1 20070831 patched [FreeBSD] Copyright (C) 2007 Free Software Foundation, Inc. This is free software; see the source for copying conditions. There is NO warranty; not even for MERCHANTABILITY or FITNESS FOR A PARTICULAR PURPOSE.
_OBJC_ALTCCVERSION_921dbbb2=none
ARCH=powerpc64
PPC_ABI=ELFv1
OPSYS=FreeBSD
_OSRELEASE=12.2-RELEASE
OSREL=12.2
OSVERSION=1202000
PYTHONBASE=/usr/local
CONFIGURE_MAX_CMD_LEN=524288
HAVE_PORTS_ENV=1
#### Misc Poudriere ####
GID=0
UID=0
---End make.conf---
--Resource limits--
cpu time               (seconds, -t)  unlimited
file size           (512-blocks, -f)  unlimited
data seg size           (kbytes, -d)  33554432
stack size              (kbytes, -s)  524288
core file size      (512-blocks, -c)  unlimited
max memory size         (kbytes, -m)  unlimited
locked memory           (kbytes, -l)  unlimited
max user processes              (-u)  89999
open files                      (-n)  1024
virtual mem size        (kbytes, -v)  unlimited
swap limit              (kbytes, -w)  unlimited
socket buffer size       (bytes, -b)  unlimited
pseudo-terminals                (-p)  unlimited
kqueues                         (-k)  unlimited
umtx shared locks               (-o)  unlimited
--End resource limits--
=======================<phase: check-sanity   >============================
===>  License AGPLv3 accepted by the user
===========================================================================
=======================<phase: pkg-depends    >============================
===>   swe-2.10.1 depends on file: /usr/local/sbin/pkg - not found
===>   Installing existing package /packages/All/pkg-1.16.3.txz
[122powerpc64-quarterly-job-01] Installing pkg-1.16.3...
[122powerpc64-quarterly-job-01] Extracting pkg-1.16.3: .......... done
===>   swe-2.10.1 depends on file: /usr/local/sbin/pkg - found
===>   Returning to build of swe-2.10.1
===========================================================================
=======================<phase: fetch-depends  >============================
===========================================================================
=======================<phase: fetch          >============================
===>  License AGPLv3 accepted by the user
===> Fetching all distfiles required by swe-2.10.1 for building
===========================================================================
=======================<phase: checksum       >============================
===>  License AGPLv3 accepted by the user
===> Fetching all distfiles required by swe-2.10.1 for building
=> SHA256 Checksum OK for aloistr-swisseph-v2.10.1_GH0.tar.gz.
=> SHA256 Checksum OK for aloistr-swisseph_doc-v2,10,1_GH0.tar.gz.
===========================================================================
=======================<phase: extract-depends>============================
===========================================================================
=======================<phase: extract        >============================
===>  License AGPLv3 accepted by the user
===> Fetching all distfiles required by swe-2.10.1 for building
===>  Extracting for swe-2.10.1
=> SHA256 Checksum OK for aloistr-swisseph-v2.10.1_GH0.tar.gz.
=> SHA256 Checksum OK for aloistr-swisseph_doc-v2,10,1_GH0.tar.gz.
===========================================================================
=======================<phase: patch-depends  >============================
===========================================================================
=======================<phase: patch          >============================
===>  Patching for swe-2.10.1
===========================================================================
=======================<phase: build-depends  >============================
===>   swe-2.10.1 depends on package: gmake>=4.3 - not found
===>   Installing existing package /packages/All/gmake-4.3_2.txz
[122powerpc64-quarterly-job-01] Installing gmake-4.3_2...
[122powerpc64-quarterly-job-01] `-- Installing gettext-runtime-0.21...
[122powerpc64-quarterly-job-01] |   `-- Installing indexinfo-0.3.1...
[122powerpc64-quarterly-job-01] |   `-- Extracting indexinfo-0.3.1: .... done
[122powerpc64-quarterly-job-01] `-- Extracting gettext-runtime-0.21: .......... done
[122powerpc64-quarterly-job-01] Extracting gmake-4.3_2: .......... done
===>   swe-2.10.1 depends on package: gmake>=4.3 - found
===>   Returning to build of swe-2.10.1
===========================================================================
=======================<phase: lib-depends    >============================
===========================================================================
=======================<phase: configure      >============================
===>  Configuring for swe-2.10.1
===========================================================================
=======================<phase: build          >============================
===>  Building for swe-2.10.1
gmake[1]: Entering directory '/wrkdirs/usr/ports/astro/swe/work/swisseph-2.10.1'
cc	 -c -g -Wall -fPIC  	   swetest.c     
cc	 -c -g -Wall -fPIC  	   swedate.c     
cc	 -c -g -Wall -fPIC  	   swehouse.c     
cc	 -c -g -Wall -fPIC  	   swejpl.c     
cc	 -c -g -Wall -fPIC  	   swemmoon.c     
cc	 -c -g -Wall -fPIC  	   swemplan.c     
cc	 -c -g -Wall -fPIC  	   sweph.c     
cc	 -c -g -Wall -fPIC  	   swephlib.c     
cc	 -c -g -Wall -fPIC  	   swecl.c     
cc	 -c -g -Wall -fPIC  	   swehel.c     
ar r libswe.a	swedate.o swehouse.o swejpl.o swemmoon.o swemplan.o sweph.o swephlib.o swecl.o swehel.o
ar: warning: creating libswe.a
cc	 -g -Wall -fPIC  	   -o swetest swetest.o -L. -lswe -lm 
cc: Internal error: Segmentation fault (program ld)
Please submit a full bug report.
See <URL:http://www.freebsd.org/support.html> for instructions.
gmake[1]: *** [makefile:30: swetest] Error 1
gmake[1]: Leaving directory '/wrkdirs/usr/ports/astro/swe/work/swisseph-2.10.1'
===> Compilation failed unexpectedly.
Try to set MAKE_JOBS_UNSAFE=yes and rebuild before reporting the failure to
the maintainer.
*** Error code 1

Stop.
make: stopped in /usr/ports/astro/swe
Received on Tue Jul 27 2021 - 03:32:13 UTC

Original text of this message