[package - 122powerpc64-quarterly][games/stockfish] Failed for stockfish-13 in build

From: <pkg-fallout_at_FreeBSD.org>
Date: Tue, 27 Jul 2021 03:28:35 GMT
You are receiving this mail as a port that you maintain
is failing to build on the FreeBSD package build server.
Please investigate the failure and submit a PR to fix
build.

Maintainer:     execve_at_gmail.com
Log URL:        http://foul1.nyi.freebsd.org/data/122powerpc64-quarterly/861e2a11357f/logs/stockfish-13.log
Build URL:      http://foul1.nyi.freebsd.org/build.html?mastername=122powerpc64-quarterly&build=861e2a11357f
Log:

=>> Building games/stockfish
build started at Tue Jul 27 03:27:16 UTC 2021
port directory: /usr/ports/games/stockfish
package name: stockfish-13
building for: FreeBSD 122powerpc64-quarterly-job-05 12.2-RELEASE FreeBSD 12.2-RELEASE powerpc
maintained by: execve_at_gmail.com
Makefile ident: 
Poudriere version: 3.2.8-16-g00a37fcb
Host OSVERSION: 1400008
Jail OSVERSION: 1202000
Job Id: 05

---Begin Environment---
SHELL=/bin/csh
OSVERSION=1202000
UNAME_v=FreeBSD 12.2-RELEASE
UNAME_r=12.2-RELEASE
BLOCKSIZE=K
MAIL=/var/mail/root
STATUS=1
HOME=/root
PATH=/sbin:/bin:/usr/sbin:/usr/bin:/usr/local/sbin:/usr/local/bin:/root/bin
LOCALBASE=/usr/local
USER=root
LIBEXECPREFIX=/usr/local/libexec/poudriere
POUDRIERE_VERSION=3.2.8-16-g00a37fcb
MASTERMNT=/usr/local/poudriere/data/.m/122powerpc64-quarterly/ref
POUDRIERE_BUILD_TYPE=bulk
PACKAGE_BUILDING=yes
SAVED_TERM=
PWD=/usr/local/poudriere/data/.m/122powerpc64-quarterly/ref/.p/pool
P_PORTS_FEATURES=FLAVORS SELECTED_OPTIONS
MASTERNAME=122powerpc64-quarterly
SCRIPTPREFIX=/usr/local/share/poudriere
OLDPWD=/usr/local/poudriere/data/.m/122powerpc64-quarterly/ref/.p
SCRIPTPATH=/usr/local/share/poudriere/bulk.sh
POUDRIEREPATH=/usr/local/bin/poudriere
---End Environment---

---Begin Poudriere Port Flags/Env---
PORT_FLAGS=
PKGENV=
FLAVOR=
DEPENDS_ARGS=
MAKE_ARGS=
---End Poudriere Port Flags/Env---

---Begin OPTIONS List---
===> The following configuration options are available for stockfish-13:
     DOCS=on: Build and/or install documentation
===> Use 'make config' to modify these settings
---End OPTIONS List---

--MAINTAINER--
execve_at_gmail.com
--End MAINTAINER--

--CONFIGURE_ARGS--

--End CONFIGURE_ARGS--

--CONFIGURE_ENV--
MAKE=gmake ac_cv_path_PERL=/usr/local/bin/perl ac_cv_path_PERL_PATH=/usr/local/bin/perl  PERL_USE_UNSAFE_INC=1 XDG_DATA_HOME=/wrkdirs/usr/ports/games/stockfish/work  XDG_CONFIG_HOME=/wrkdirs/usr/ports/games/stockfish/work  HOME=/wrkdirs/usr/ports/games/stockfish/work TMPDIR="/tmp" PATH=/wrkdirs/usr/ports/games/stockfish/work/.bin:/sbin:/bin:/usr/sbin:/usr/bin:/usr/local/sbin:/usr/local/bin:/root/bin SHELL=/bin/sh CONFIG_SHELL=/bin/sh
--End CONFIGURE_ENV--

--MAKE_ENV--
PERL_USE_UNSAFE_INC=1 XDG_DATA_HOME=/wrkdirs/usr/ports/games/stockfish/work  XDG_CONFIG_HOME=/wrkdirs/usr/ports/games/stockfish/work  HOME=/wrkdirs/usr/ports/games/stockfish/work TMPDIR="/tmp" PATH=/wrkdirs/usr/ports/games/stockfish/work/.bin:/sbin:/bin:/usr/sbin:/usr/bin:/usr/local/sbin:/usr/local/bin:/root/bin NO_PIE=yes MK_DEBUG_FILES=no MK_KERNEL_SYMBOLS=no SHELL=/bin/sh NO_LINT=YES ADDR2LINE="/usr/local/bin/addr2line" AR="/usr/local/bin/ar" AS="/usr/local/bin/as" CPPFILT="/usr/local/bin/c++filt" GPROF="/usr/local/bin/gprof" LD="/usr/local/bin/ld" NM="/usr/local/bin/nm" OBJCOPY="/usr/local/bin/objcopy" OBJDUMP="/usr/local/bin/objdump" RANLIB="/usr/local/bin/ranlib" READELF="/usr/local/bin/readelf" SIZE="/usr/local/bin/size" STRINGS="/usr/local/bin/strings" PREFIX=/usr/local  LOCALBASE=/usr/local  CC="gcc10" CFLAGS="-O2 -pipe  -fstack-protector-strong -Wl,-rpath=/usr/local/lib/gcc10 -fno-strict-aliasing "  CPP="cpp10" CPPFLAGS=""  LDFLAGS=" -fuse-ld=lld -fstack-protector-strong -W
 l,-rpath=/usr/local/lib/gcc10 -L/usr/local/lib/gcc10 " LIBS=""  CXX="g++10" CXXFLAGS="-O2 -pipe  -fstack-protector-strong -Wl,-rpath=/usr/local/lib/gcc10  -Wl,-rpath=/usr/local/lib/gcc10 "  MANPREFIX="/usr/local" BSD_INSTALL_PROGRAM="install  -s -m 555"  BSD_INSTALL_LIB="install  -s -m 0644"  BSD_INSTALL_SCRIPT="install  -m 555"  BSD_INSTALL_DATA="install  -m 0644"  BSD_INSTALL_MAN="install  -m 444"
--End MAKE_ENV--

--PLIST_SUB--
PORTDOCS="" OSREL=12.2 PREFIX=%D LOCALBASE=/usr/local  RESETPREFIX=/usr/local LIB32DIR=lib PERL_VERSION=5.32.1  PERL_VER=5.32  PERL5_MAN1=lib/perl5/site_perl/man/man1  PERL5_MAN3=lib/perl5/site_perl/man/man3  SITE_PERL=lib/perl5/site_perl  SITE_ARCH=lib/perl5/site_perl/mach/5.32 DOCSDIR="share/doc/stockfish"  EXAMPLESDIR="share/examples/stockfish"  DATADIR="share/stockfish"  WWWDIR="www/stockfish"  ETCDIR="etc/stockfish"
--End PLIST_SUB--

--SUB_LIST--
PREFIX=/usr/local LOCALBASE=/usr/local  DATADIR=/usr/local/share/stockfish DOCSDIR=/usr/local/share/doc/stockfish EXAMPLESDIR=/usr/local/share/examples/stockfish  WWWDIR=/usr/local/www/stockfish ETCDIR=/usr/local/etc/stockfish
--End SUB_LIST--

---Begin make.conf---
USE_PACKAGE_DEPENDS=yes
BATCH=yes
WRKDIRPREFIX=/wrkdirs
PORTSDIR=/usr/ports
PACKAGES=/packages
DISTDIR=/distfiles
PACKAGE_BUILDING=yes
PACKAGE_BUILDING_FLAVORS=yes
#### /usr/local/etc/poudriere.d/make.conf ####
# XXX: We really need this but cannot use it while 'make checksum' does not
# try the next mirror on checksum failure.  It currently retries the same
# failed mirror and then fails rather then trying another.  It *does*
# try the next if the size is mismatched though.
#MASTER_SITE_FREEBSD=yes
# Build ALLOW_MAKE_JOBS_PACKAGES with 2 jobs
MAKE_JOBS_NUMBER=2
#### /usr/ports/Mk/Scripts/ports_env.sh ####
_CCVERSION_921dbbb2=cc (GCC) 4.2.1 20070831 patched [FreeBSD] Copyright (C) 2007 Free Software Foundation, Inc. This is free software; see the source for copying conditions. There is NO warranty; not even for MERCHANTABILITY or FITNESS FOR A PARTICULAR PURPOSE.
_ALTCCVERSION_921dbbb2=none
_CXXINTERNAL_acaad9ca=Using built-in specs. Target: powerpc64-undermydesk-freebsd Configured with: FreeBSD/powerpc64 system compiler Thread model: posix gcc version 4.2.1 20070831 patched [FreeBSD] "/usr/bin/ld" "--eh-frame-hdr" "-Qy" "-melf64ppc_fbsd" "--enable-new-dtags" "-dynamic-linker" "/libexec/ld-elf.so.1" "/usr/lib/crt1.o" "/usr/lib/crti.o" "/usr/lib/crtbegin.o" "-L/usr/lib" "-L/usr/lib" "/dev/null" "-lstdc++" "-lm" "-lgcc_s" "-lgcc" "-lc" "-lgcc_s" "-lgcc" "/usr/lib/crtsavres.o" "/usr/lib/crtend.o" "/usr/lib/crtn.o"
CC_OUTPUT_921dbbb2_58173849=yes
CC_OUTPUT_921dbbb2_9bdba57c=yes
CC_OUTPUT_921dbbb2_6a4fe7f5=cc1: error: unrecognized command line option "-std=c11"
CC_OUTPUT_921dbbb2_6bcac02b=yes
CC_OUTPUT_921dbbb2_67d20829=yes
CC_OUTPUT_921dbbb2_bfa62e83=cc1: error: unrecognized command line option "-std=gnu11"
CC_OUTPUT_921dbbb2_f0b4d593=yes
CC_OUTPUT_921dbbb2_308abb44=cc1plus: error: unrecognized command line option "-std=c++0x"
CC_OUTPUT_921dbbb2_f00456e5=cc1plus: error: unrecognized command line option "-std=c++11"
CC_OUTPUT_921dbbb2_65ad290d=cc1plus: error: unrecognized command line option "-std=c++14"
CC_OUTPUT_921dbbb2_f2776b26=cc1plus: error: unrecognized command line option "-std=c++17"
CC_OUTPUT_921dbbb2_b2657cc3=yes
CC_OUTPUT_921dbbb2_380987f7=cc1plus: error: unrecognized command line option "-std=gnu++11"
CC_OUTPUT_921dbbb2_160933ec=cc1plus: error: unrecognized command line option "-std=gnu++14"
CC_OUTPUT_921dbbb2_fb62803b=cc1plus: error: unrecognized command line option "-std=gnu++17"
_OBJC_CCVERSION_921dbbb2=cc (GCC) 4.2.1 20070831 patched [FreeBSD] Copyright (C) 2007 Free Software Foundation, Inc. This is free software; see the source for copying conditions. There is NO warranty; not even for MERCHANTABILITY or FITNESS FOR A PARTICULAR PURPOSE.
_OBJC_ALTCCVERSION_921dbbb2=none
ARCH=powerpc64
PPC_ABI=ELFv1
OPSYS=FreeBSD
_OSRELEASE=12.2-RELEASE
OSREL=12.2
OSVERSION=1202000
PYTHONBASE=/usr/local
CONFIGURE_MAX_CMD_LEN=524288
HAVE_PORTS_ENV=1
#### Misc Poudriere ####
GID=0
UID=0
---End make.conf---
--Resource limits--
cpu time               (seconds, -t)  unlimited
file size           (512-blocks, -f)  unlimited
data seg size           (kbytes, -d)  33554432
stack size              (kbytes, -s)  524288
core file size      (512-blocks, -c)  unlimited
max memory size         (kbytes, -m)  unlimited
locked memory           (kbytes, -l)  unlimited
max user processes              (-u)  89999
open files                      (-n)  1024
virtual mem size        (kbytes, -v)  unlimited
swap limit              (kbytes, -w)  unlimited
socket buffer size       (bytes, -b)  unlimited
pseudo-terminals                (-p)  unlimited
kqueues                         (-k)  unlimited
umtx shared locks               (-o)  unlimited
--End resource limits--
=======================<phase: check-sanity   >============================
===>  License GPLv3 accepted by the user
===========================================================================
=======================<phase: pkg-depends    >============================
===>   stockfish-13 depends on file: /usr/local/sbin/pkg - not found
===>   Installing existing package /packages/All/pkg-1.16.3.txz
[122powerpc64-quarterly-job-05] Installing pkg-1.16.3...
[122powerpc64-quarterly-job-05] Extracting pkg-1.16.3: .......... done
===>   stockfish-13 depends on file: /usr/local/sbin/pkg - found
===>   Returning to build of stockfish-13
===========================================================================
=======================<phase: fetch-depends  >============================
===========================================================================
=======================<phase: fetch          >============================
===>  License GPLv3 accepted by the user
===> Fetching all distfiles required by stockfish-13 for building
===========================================================================
=======================<phase: checksum       >============================
===>  License GPLv3 accepted by the user
===> Fetching all distfiles required by stockfish-13 for building
=> SHA256 Checksum OK for nn-62ef826d1a6d.nnue.
=> SHA256 Checksum OK for official-stockfish-Stockfish-sf_13_GH0.tar.gz.
===========================================================================
=======================<phase: extract-depends>============================
===========================================================================
=======================<phase: extract        >============================
===>  License GPLv3 accepted by the user
===> Fetching all distfiles required by stockfish-13 for building
===>  Extracting for stockfish-13
=> SHA256 Checksum OK for nn-62ef826d1a6d.nnue.
=> SHA256 Checksum OK for official-stockfish-Stockfish-sf_13_GH0.tar.gz.
===========================================================================
=======================<phase: patch-depends  >============================
===========================================================================
=======================<phase: patch          >============================
===>  Patching for stockfish-13
===========================================================================
=======================<phase: build-depends  >============================
===>   stockfish-13 depends on package: gmake>=4.3 - not found
===>   Installing existing package /packages/All/gmake-4.3_2.txz
[122powerpc64-quarterly-job-05] Installing gmake-4.3_2...
[122powerpc64-quarterly-job-05] `-- Installing gettext-runtime-0.21...
[122powerpc64-quarterly-job-05] |   `-- Installing indexinfo-0.3.1...
[122powerpc64-quarterly-job-05] |   `-- Extracting indexinfo-0.3.1: .... done
[122powerpc64-quarterly-job-05] `-- Extracting gettext-runtime-0.21: .......... done
[122powerpc64-quarterly-job-05] Extracting gmake-4.3_2: .......... done
===>   stockfish-13 depends on package: gmake>=4.3 - found
===>   Returning to build of stockfish-13
===>   stockfish-13 depends on executable: gcc10 - not found
===>   Installing existing package /packages/All/gcc10-10.3.0.txz
[122powerpc64-quarterly-job-05] Installing gcc10-10.3.0...
[122powerpc64-quarterly-job-05] `-- Installing binutils-2.33.1_4,1...
[122powerpc64-quarterly-job-05] `-- Extracting binutils-2.33.1_4,1: .......... done
[122powerpc64-quarterly-job-05] `-- Installing gcc9-9.4.0...
[122powerpc64-quarterly-job-05] |   `-- Installing gmp-6.2.1...
[122powerpc64-quarterly-job-05] |   `-- Extracting gmp-6.2.1: .......... done
[122powerpc64-quarterly-job-05] |   `-- Installing mpc-1.2.0...
[122powerpc64-quarterly-job-05] |   | `-- Installing mpfr-4.1.0...
[122powerpc64-quarterly-job-05] |   | `-- Extracting mpfr-4.1.0: .......... done
[122powerpc64-quarterly-job-05] |   `-- Extracting mpc-1.2.0: ......... done
[122powerpc64-quarterly-job-05] `-- Extracting gcc9-9.4.0: .......... done
[122powerpc64-quarterly-job-05] Extracting gcc10-10.3.0: .......... done
=====
Message from gcc9-9.4.0:

--
To ensure binaries built with this toolchain find appropriate versions
of the necessary run-time libraries, you may want to link using

  -Wl,-rpath=/usr/local/lib/gcc9

For ports leveraging USE_GCC, USES=compiler, or USES=fortran this happens
transparently.
=====
Message from gcc10-10.3.0:

--
To ensure binaries built with this toolchain find appropriate versions
of the necessary run-time libraries, you may want to link using

  -Wl,-rpath=/usr/local/lib/gcc10

For ports leveraging USE_GCC, USES=compiler, or USES=fortran this happens
transparently.
===>   stockfish-13 depends on executable: gcc10 - found
===>   Returning to build of stockfish-13
===>   stockfish-13 depends on file: /usr/local/bin/as - found
===>   stockfish-13 depends on package: perl5>=5.32.r0<5.33 - not found
===>   Installing existing package /packages/All/perl5-5.32.1_1.txz
[122powerpc64-quarterly-job-05] Installing perl5-5.32.1_1...
[122powerpc64-quarterly-job-05] Extracting perl5-5.32.1_1: .......... done
===>   stockfish-13 depends on package: perl5>=5.32.r0<5.33 - found
===>   Returning to build of stockfish-13
===========================================================================
=======================<phase: lib-depends    >============================
===========================================================================
=======================<phase: configure      >============================
===>  Configuring for stockfish-13
===========================================================================
=======================<phase: build          >============================
===>  Building for stockfish-13
gmake[1]: Entering directory '/wrkdirs/usr/ports/games/stockfish/work/Stockfish-sf_13/src'
Default net: nn-62ef826d1a6d.nnue
Already available.

Config:
debug: 'no'
sanitize: 'no'
optimize: 'yes'
arch: 'ppc64'
bits: '64'
kernel: 'FreeBSD'
os: ''
prefetch: 'yes'
popcnt: 'yes'
pext: 'no'
sse: 'no'
mmx: 'no'
sse2: 'no'
ssse3: 'no'
sse41: 'no'
avx2: 'no'
avx512: 'no'
vnni256: 'no'
vnni512: 'no'
neon: 'no'

Flags:
CXX: g++10
CXXFLAGS: -O2 -pipe  -fstack-protector-strong -Wl,-rpath=/usr/local/lib/gcc10  -Wl,-rpath=/usr/local/lib/gcc10  -Wall -Wcast-qual -fno-exceptions -std=c++17  -pedantic -Wextra -Wshadow -m64 -DUSE_PTHREADS -DNDEBUG -O3 -DIS_64BIT -DUSE_POPCNT -flto
LDFLAGS:  -fuse-ld=lld -fstack-protector-strong -Wl,-rpath=/usr/local/lib/gcc10 -L/usr/local/lib/gcc10   -m64 -Wl,--no-as-needed -lpthread -O2 -pipe  -fstack-protector-strong -Wl,-rpath=/usr/local/lib/gcc10  -Wl,-rpath=/usr/local/lib/gcc10  -Wall -Wcast-qual -fno-exceptions -std=c++17  -pedantic -Wextra -Wshadow -m64 -DUSE_PTHREADS -DNDEBUG -O3 -DIS_64BIT -DUSE_POPCNT -flto -flto=jobserver

Testing config sanity. If this fails, try 'make help' ...

gmake ARCH=ppc-64 COMP=gcc all
gmake[2]: Entering directory '/wrkdirs/usr/ports/games/stockfish/work/Stockfish-sf_13/src'
g++10 -O2 -pipe  -fstack-protector-strong -Wl,-rpath=/usr/local/lib/gcc10  -Wl,-rpath=/usr/local/lib/gcc10  -Wall -Wcast-qual -fno-exceptions -std=c++17  -pedantic -Wextra -Wshadow -m64 -DUSE_PTHREADS -DNDEBUG -O3 -DIS_64BIT -DUSE_POPCNT -flto -Wall -Wcast-qual -fno-exceptions -std=c++17  -pedantic -Wextra -Wshadow -m64 -DUSE_PTHREADS -DNDEBUG -O3 -DIS_64BIT -DUSE_POPCNT -flto   -c -o benchmark.o benchmark.cpp
g++10 -O2 -pipe  -fstack-protector-strong -Wl,-rpath=/usr/local/lib/gcc10  -Wl,-rpath=/usr/local/lib/gcc10  -Wall -Wcast-qual -fno-exceptions -std=c++17  -pedantic -Wextra -Wshadow -m64 -DUSE_PTHREADS -DNDEBUG -O3 -DIS_64BIT -DUSE_POPCNT -flto -Wall -Wcast-qual -fno-exceptions -std=c++17  -pedantic -Wextra -Wshadow -m64 -DUSE_PTHREADS -DNDEBUG -O3 -DIS_64BIT -DUSE_POPCNT -flto   -c -o bitbase.o bitbase.cpp
g++10 -O2 -pipe  -fstack-protector-strong -Wl,-rpath=/usr/local/lib/gcc10  -Wl,-rpath=/usr/local/lib/gcc10  -Wall -Wcast-qual -fno-exceptions -std=c++17  -pedantic -Wextra -Wshadow -m64 -DUSE_PTHREADS -DNDEBUG -O3 -DIS_64BIT -DUSE_POPCNT -flto -Wall -Wcast-qual -fno-exceptions -std=c++17  -pedantic -Wextra -Wshadow -m64 -DUSE_PTHREADS -DNDEBUG -O3 -DIS_64BIT -DUSE_POPCNT -flto   -c -o bitboard.o bitboard.cpp
g++10 -O2 -pipe  -fstack-protector-strong -Wl,-rpath=/usr/local/lib/gcc10  -Wl,-rpath=/usr/local/lib/gcc10  -Wall -Wcast-qual -fno-exceptions -std=c++17  -pedantic -Wextra -Wshadow -m64 -DUSE_PTHREADS -DNDEBUG -O3 -DIS_64BIT -DUSE_POPCNT -flto -Wall -Wcast-qual -fno-exceptions -std=c++17  -pedantic -Wextra -Wshadow -m64 -DUSE_PTHREADS -DNDEBUG -O3 -DIS_64BIT -DUSE_POPCNT -flto   -c -o endgame.o endgame.cpp
g++10 -O2 -pipe  -fstack-protector-strong -Wl,-rpath=/usr/local/lib/gcc10  -Wl,-rpath=/usr/local/lib/gcc10  -Wall -Wcast-qual -fno-exceptions -std=c++17  -pedantic -Wextra -Wshadow -m64 -DUSE_PTHREADS -DNDEBUG -O3 -DIS_64BIT -DUSE_POPCNT -flto -Wall -Wcast-qual -fno-exceptions -std=c++17  -pedantic -Wextra -Wshadow -m64 -DUSE_PTHREADS -DNDEBUG -O3 -DIS_64BIT -DUSE_POPCNT -flto   -c -o evaluate.o evaluate.cpp
g++10 -O2 -pipe  -fstack-protector-strong -Wl,-rpath=/usr/local/lib/gcc10  -Wl,-rpath=/usr/local/lib/gcc10  -Wall -Wcast-qual -fno-exceptions -std=c++17  -pedantic -Wextra -Wshadow -m64 -DUSE_PTHREADS -DNDEBUG -O3 -DIS_64BIT -DUSE_POPCNT -flto -Wall -Wcast-qual -fno-exceptions -std=c++17  -pedantic -Wextra -Wshadow -m64 -DUSE_PTHREADS -DNDEBUG -O3 -DIS_64BIT -DUSE_POPCNT -flto   -c -o main.o main.cpp
g++10 -O2 -pipe  -fstack-protector-strong -Wl,-rpath=/usr/local/lib/gcc10  -Wl,-rpath=/usr/local/lib/gcc10  -Wall -Wcast-qual -fno-exceptions -std=c++17  -pedantic -Wextra -Wshadow -m64 -DUSE_PTHREADS -DNDEBUG -O3 -DIS_64BIT -DUSE_POPCNT -flto -Wall -Wcast-qual -fno-exceptions -std=c++17  -pedantic -Wextra -Wshadow -m64 -DUSE_PTHREADS -DNDEBUG -O3 -DIS_64BIT -DUSE_POPCNT -flto   -c -o material.o material.cpp
g++10 -O2 -pipe  -fstack-protector-strong -Wl,-rpath=/usr/local/lib/gcc10  -Wl,-rpath=/usr/local/lib/gcc10  -Wall -Wcast-qual -fno-exceptions -std=c++17  -pedantic -Wextra -Wshadow -m64 -DUSE_PTHREADS -DNDEBUG -O3 -DIS_64BIT -DUSE_POPCNT -flto -Wall -Wcast-qual -fno-exceptions -std=c++17  -pedantic -Wextra -Wshadow -m64 -DUSE_PTHREADS -DNDEBUG -O3 -DIS_64BIT -DUSE_POPCNT -flto   -c -o misc.o misc.cpp
g++10 -O2 -pipe  -fstack-protector-strong -Wl,-rpath=/usr/local/lib/gcc10  -Wl,-rpath=/usr/local/lib/gcc10  -Wall -Wcast-qual -fno-exceptions -std=c++17  -pedantic -Wextra -Wshadow -m64 -DUSE_PTHREADS -DNDEBUG -O3 -DIS_64BIT -DUSE_POPCNT -flto -Wall -Wcast-qual -fno-exceptions -std=c++17  -pedantic -Wextra -Wshadow -m64 -DUSE_PTHREADS -DNDEBUG -O3 -DIS_64BIT -DUSE_POPCNT -flto   -c -o movegen.o movegen.cpp
g++10 -O2 -pipe  -fstack-protector-strong -Wl,-rpath=/usr/local/lib/gcc10  -Wl,-rpath=/usr/local/lib/gcc10  -Wall -Wcast-qual -fno-exceptions -std=c++17  -pedantic -Wextra -Wshadow -m64 -DUSE_PTHREADS -DNDEBUG -O3 -DIS_64BIT -DUSE_POPCNT -flto -Wall -Wcast-qual -fno-exceptions -std=c++17  -pedantic -Wextra -Wshadow -m64 -DUSE_PTHREADS -DNDEBUG -O3 -DIS_64BIT -DUSE_POPCNT -flto   -c -o movepick.o movepick.cpp
g++10 -O2 -pipe  -fstack-protector-strong -Wl,-rpath=/usr/local/lib/gcc10  -Wl,-rpath=/usr/local/lib/gcc10  -Wall -Wcast-qual -fno-exceptions -std=c++17  -pedantic -Wextra -Wshadow -m64 -DUSE_PTHREADS -DNDEBUG -O3 -DIS_64BIT -DUSE_POPCNT -flto -Wall -Wcast-qual -fno-exceptions -std=c++17  -pedantic -Wextra -Wshadow -m64 -DUSE_PTHREADS -DNDEBUG -O3 -DIS_64BIT -DUSE_POPCNT -flto   -c -o pawns.o pawns.cpp
g++10 -O2 -pipe  -fstack-protector-strong -Wl,-rpath=/usr/local/lib/gcc10  -Wl,-rpath=/usr/local/lib/gcc10  -Wall -Wcast-qual -fno-exceptions -std=c++17  -pedantic -Wextra -Wshadow -m64 -DUSE_PTHREADS -DNDEBUG -O3 -DIS_64BIT -DUSE_POPCNT -flto -Wall -Wcast-qual -fno-exceptions -std=c++17  -pedantic -Wextra -Wshadow -m64 -DUSE_PTHREADS -DNDEBUG -O3 -DIS_64BIT -DUSE_POPCNT -flto   -c -o position.o position.cpp
g++10 -O2 -pipe  -fstack-protector-strong -Wl,-rpath=/usr/local/lib/gcc10  -Wl,-rpath=/usr/local/lib/gcc10  -Wall -Wcast-qual -fno-exceptions -std=c++17  -pedantic -Wextra -Wshadow -m64 -DUSE_PTHREADS -DNDEBUG -O3 -DIS_64BIT -DUSE_POPCNT -flto -Wall -Wcast-qual -fno-exceptions -std=c++17  -pedantic -Wextra -Wshadow -m64 -DUSE_PTHREADS -DNDEBUG -O3 -DIS_64BIT -DUSE_POPCNT -flto   -c -o psqt.o psqt.cpp
g++10 -O2 -pipe  -fstack-protector-strong -Wl,-rpath=/usr/local/lib/gcc10  -Wl,-rpath=/usr/local/lib/gcc10  -Wall -Wcast-qual -fno-exceptions -std=c++17  -pedantic -Wextra -Wshadow -m64 -DUSE_PTHREADS -DNDEBUG -O3 -DIS_64BIT -DUSE_POPCNT -flto -Wall -Wcast-qual -fno-exceptions -std=c++17  -pedantic -Wextra -Wshadow -m64 -DUSE_PTHREADS -DNDEBUG -O3 -DIS_64BIT -DUSE_POPCNT -flto   -c -o search.o search.cpp
g++10 -O2 -pipe  -fstack-protector-strong -Wl,-rpath=/usr/local/lib/gcc10  -Wl,-rpath=/usr/local/lib/gcc10  -Wall -Wcast-qual -fno-exceptions -std=c++17  -pedantic -Wextra -Wshadow -m64 -DUSE_PTHREADS -DNDEBUG -O3 -DIS_64BIT -DUSE_POPCNT -flto -Wall -Wcast-qual -fno-exceptions -std=c++17  -pedantic -Wextra -Wshadow -m64 -DUSE_PTHREADS -DNDEBUG -O3 -DIS_64BIT -DUSE_POPCNT -flto   -c -o thread.o thread.cpp
g++10 -O2 -pipe  -fstack-protector-strong -Wl,-rpath=/usr/local/lib/gcc10  -Wl,-rpath=/usr/local/lib/gcc10  -Wall -Wcast-qual -fno-exceptions -std=c++17  -pedantic -Wextra -Wshadow -m64 -DUSE_PTHREADS -DNDEBUG -O3 -DIS_64BIT -DUSE_POPCNT -flto -Wall -Wcast-qual -fno-exceptions -std=c++17  -pedantic -Wextra -Wshadow -m64 -DUSE_PTHREADS -DNDEBUG -O3 -DIS_64BIT -DUSE_POPCNT -flto   -c -o timeman.o timeman.cpp
g++10 -O2 -pipe  -fstack-protector-strong -Wl,-rpath=/usr/local/lib/gcc10  -Wl,-rpath=/usr/local/lib/gcc10  -Wall -Wcast-qual -fno-exceptions -std=c++17  -pedantic -Wextra -Wshadow -m64 -DUSE_PTHREADS -DNDEBUG -O3 -DIS_64BIT -DUSE_POPCNT -flto -Wall -Wcast-qual -fno-exceptions -std=c++17  -pedantic -Wextra -Wshadow -m64 -DUSE_PTHREADS -DNDEBUG -O3 -DIS_64BIT -DUSE_POPCNT -flto   -c -o tt.o tt.cpp
g++10 -O2 -pipe  -fstack-protector-strong -Wl,-rpath=/usr/local/lib/gcc10  -Wl,-rpath=/usr/local/lib/gcc10  -Wall -Wcast-qual -fno-exceptions -std=c++17  -pedantic -Wextra -Wshadow -m64 -DUSE_PTHREADS -DNDEBUG -O3 -DIS_64BIT -DUSE_POPCNT -flto -Wall -Wcast-qual -fno-exceptions -std=c++17  -pedantic -Wextra -Wshadow -m64 -DUSE_PTHREADS -DNDEBUG -O3 -DIS_64BIT -DUSE_POPCNT -flto   -c -o uci.o uci.cpp
g++10 -O2 -pipe  -fstack-protector-strong -Wl,-rpath=/usr/local/lib/gcc10  -Wl,-rpath=/usr/local/lib/gcc10  -Wall -Wcast-qual -fno-exceptions -std=c++17  -pedantic -Wextra -Wshadow -m64 -DUSE_PTHREADS -DNDEBUG -O3 -DIS_64BIT -DUSE_POPCNT -flto -Wall -Wcast-qual -fno-exceptions -std=c++17  -pedantic -Wextra -Wshadow -m64 -DUSE_PTHREADS -DNDEBUG -O3 -DIS_64BIT -DUSE_POPCNT -flto   -c -o ucioption.o ucioption.cpp
g++10 -O2 -pipe  -fstack-protector-strong -Wl,-rpath=/usr/local/lib/gcc10  -Wl,-rpath=/usr/local/lib/gcc10  -Wall -Wcast-qual -fno-exceptions -std=c++17  -pedantic -Wextra -Wshadow -m64 -DUSE_PTHREADS -DNDEBUG -O3 -DIS_64BIT -DUSE_POPCNT -flto -Wall -Wcast-qual -fno-exceptions -std=c++17  -pedantic -Wextra -Wshadow -m64 -DUSE_PTHREADS -DNDEBUG -O3 -DIS_64BIT -DUSE_POPCNT -flto   -c -o tune.o tune.cpp
g++10 -O2 -pipe  -fstack-protector-strong -Wl,-rpath=/usr/local/lib/gcc10  -Wl,-rpath=/usr/local/lib/gcc10  -Wall -Wcast-qual -fno-exceptions -std=c++17  -pedantic -Wextra -Wshadow -m64 -DUSE_PTHREADS -DNDEBUG -O3 -DIS_64BIT -DUSE_POPCNT -flto -Wall -Wcast-qual -fno-exceptions -std=c++17  -pedantic -Wextra -Wshadow -m64 -DUSE_PTHREADS -DNDEBUG -O3 -DIS_64BIT -DUSE_POPCNT -flto   -c -o tbprobe.o syzygy/tbprobe.cpp
g++10 -O2 -pipe  -fstack-protector-strong -Wl,-rpath=/usr/local/lib/gcc10  -Wl,-rpath=/usr/local/lib/gcc10  -Wall -Wcast-qual -fno-exceptions -std=c++17  -pedantic -Wextra -Wshadow -m64 -DUSE_PTHREADS -DNDEBUG -O3 -DIS_64BIT -DUSE_POPCNT -flto -Wall -Wcast-qual -fno-exceptions -std=c++17  -pedantic -Wextra -Wshadow -m64 -DUSE_PTHREADS -DNDEBUG -O3 -DIS_64BIT -DUSE_POPCNT -flto   -c -o evaluate_nnue.o nnue/evaluate_nnue.cpp
g++10 -O2 -pipe  -fstack-protector-strong -Wl,-rpath=/usr/local/lib/gcc10  -Wl,-rpath=/usr/local/lib/gcc10  -Wall -Wcast-qual -fno-exceptions -std=c++17  -pedantic -Wextra -Wshadow -m64 -DUSE_PTHREADS -DNDEBUG -O3 -DIS_64BIT -DUSE_POPCNT -flto -Wall -Wcast-qual -fno-exceptions -std=c++17  -pedantic -Wextra -Wshadow -m64 -DUSE_PTHREADS -DNDEBUG -O3 -DIS_64BIT -DUSE_POPCNT -flto   -c -o half_kp.o nnue/features/half_kp.cpp
g++10 -o stockfish benchmark.o bitbase.o bitboard.o endgame.o evaluate.o main.o material.o misc.o movegen.o movepick.o pawns.o position.o psqt.o search.o thread.o timeman.o tt.o uci.o ucioption.o tune.o tbprobe.o evaluate_nnue.o half_kp.o  -fuse-ld=lld -fstack-protector-strong -Wl,-rpath=/usr/local/lib/gcc10 -L/usr/local/lib/gcc10   -m64 -Wl,--no-as-needed -lpthread -O2 -pipe  -fstack-protector-strong -Wl,-rpath=/usr/local/lib/gcc10  -Wl,-rpath=/usr/local/lib/gcc10  -Wall -Wcast-qual -fno-exceptions -std=c++17  -pedantic -Wextra -Wshadow -m64 -DUSE_PTHREADS -DNDEBUG -O3 -DIS_64BIT -DUSE_POPCNT -flto -flto=jobserver  -m64 -Wl,--no-as-needed -lpthread -O2 -pipe  -fstack-protector-strong -Wl,-rpath=/usr/local/lib/gcc10  -Wl,-rpath=/usr/local/lib/gcc10  -Wall -Wcast-qual -fno-exceptions -std=c++17  -pedantic -Wextra -Wshadow -m64 -DUSE_PTHREADS -DNDEBUG -O3 -DIS_64BIT -DUSE_POPCNT -flto -Wall -Wcast-qual -fno-exceptions -std=c++17  -pedantic -Wextra -Wshadow -m64 -DUSE_PTHREADS -DNDEBUG 
 -O3 -DIS_64BIT -DUSE_POPCNT -flto -flto=jobserver
make[3]: illegal argument to -j -- must be positive integer!
lto-wrapper: fatal error: make returned 1 exit status
compilation terminated.
/usr/local/bin/ld: error: lto-wrapper failed
collect2: error: ld returned 1 exit status
gmake[2]: *** [Makefile:847: stockfish] Error 1
gmake[2]: Leaving directory '/wrkdirs/usr/ports/games/stockfish/work/Stockfish-sf_13/src'
gmake[1]: *** [Makefile:719: build] Error 2
gmake[1]: Leaving directory '/wrkdirs/usr/ports/games/stockfish/work/Stockfish-sf_13/src'
===> Compilation failed unexpectedly.
Try to set MAKE_JOBS_UNSAFE=yes and rebuild before reporting the failure to
the maintainer.
*** Error code 1

Stop.
make: stopped in /usr/ports/games/stockfish
Received on Tue Jul 27 2021 - 03:28:35 UTC

Original text of this message