[package - 130releng-armv6-quarterly][lang/python39] Failed for python39-3.9.5 in stage/runaway

From: <pkg-fallout_at_FreeBSD.org>
Date: Tue, 13 Jul 2021 15:25:31 GMT
You are receiving this mail as a port that you maintain
is failing to build on the FreeBSD package build server.
Please investigate the failure and submit a PR to fix
build.

Maintainer:     python_at_FreeBSD.org
Log URL:        http://beefy8.nyi.freebsd.org/data/130releng-armv6-quarterly/1a1fe9490464/logs/python39-3.9.5.log
Build URL:      http://beefy8.nyi.freebsd.org/build.html?mastername=130releng-armv6-quarterly&build=1a1fe9490464
Log:

=>> Building lang/python39
build started at Tue Jul 13 08:45:32 UTC 2021
port directory: /usr/ports/lang/python39
package name: python39-3.9.5
building for: FreeBSD 130releng-armv6-quarterly-job-06 13.0-RELEASE-p3 FreeBSD 13.0-RELEASE-p3 1300139 arm
maintained by: python_at_FreeBSD.org
Makefile ident: 
Poudriere version: 3.2.8-8-gaf08dbda
Host OSVERSION: 1300121
Jail OSVERSION: 1300139
Job Id: 06




!!! Jail is newer than host. (Jail: 1300139, Host: 1300121) !!!
!!! This is not supported. !!!
!!! Host kernel must be same or newer than jail. !!!
!!! Expect build failures. !!!



---Begin Environment---
SHELL=/bin/csh
UNAME_p=armv6
UNAME_m=arm
ABI_FILE=/usr/lib/crt1.o
OSVERSION=1300139
UNAME_v=FreeBSD 13.0-RELEASE-p3 1300139
UNAME_r=13.0-RELEASE-p3
BLOCKSIZE=K
MAIL=/var/mail/root
MM_CHARSET=UTF-8
LANG=C.UTF-8
STATUS=1
HOME=/root
PATH=/sbin:/bin:/usr/sbin:/usr/bin:/usr/local/sbin:/usr/local/bin:/root/bin
LOCALBASE=/usr/local
QEMU_EMULATING=1
USER=root
LIBEXECPREFIX=/usr/local/libexec/poudriere
POUDRIERE_VERSION=3.2.8-8-gaf08dbda
MASTERMNT=/usr/local/poudriere/data/.m/130releng-armv6-quarterly/ref
POUDRIERE_BUILD_TYPE=bulk
PACKAGE_BUILDING=yes
SAVED_TERM=
PWD=/usr/local/poudriere/data/.m/130releng-armv6-quarterly/ref/.p/pool
P_PORTS_FEATURES=FLAVORS SELECTED_OPTIONS
MASTERNAME=130releng-armv6-quarterly
SCRIPTPREFIX=/usr/local/share/poudriere
OLDPWD=/usr/local/poudriere/data/.m/130releng-armv6-quarterly/ref/.p
SCRIPTPATH=/usr/local/share/poudriere/bulk.sh
POUDRIEREPATH=/usr/local/bin/poudriere
---End Environment---

---Begin Poudriere Port Flags/Env---
PORT_FLAGS=
PKGENV=
FLAVOR=
DEPENDS_ARGS=
MAKE_ARGS=
---End Poudriere Port Flags/Env---

---Begin OPTIONS List---
===> The following configuration options are available for python39-3.9.5:
     DEBUG=off: Build with debugging support
     IPV6=on: IPv6 protocol support
     LIBMPDEC=on: Use libmpdec from ports instead of bundled version
     NLS=on: Enable gettext support for the locale module
     PYMALLOC=on: Enable specialized mallocs
====> Hash Algorithm (PEP-456): you can only select none or one of them
     FNV=off: Modified Fowler-Noll-Vo Algorithm
     SIPHASH=off: SipHash24 Algorithm
===> Use 'make config' to modify these settings
---End OPTIONS List---

--MAINTAINER--
python_at_FreeBSD.org
--End MAINTAINER--

--CONFIGURE_ARGS--
--enable-shared --without-ensurepip  --with-system-ffi --without-pydebug --enable-ipv6 --with-system-libmpdec --with-pymalloc --prefix=/usr/local ${_LATE_CONFIGURE_ARGS}
--End CONFIGURE_ARGS--

--CONFIGURE_ENV--
OPT="" PKG_CONFIG=pkgconf XDG_DATA_HOME=/wrkdirs/usr/ports/lang/python39/work  XDG_CONFIG_HOME=/wrkdirs/usr/ports/lang/python39/work  HOME=/wrkdirs/usr/ports/lang/python39/work TMPDIR="/tmp" PATH=/wrkdirs/usr/ports/lang/python39/work/.bin:/sbin:/bin:/usr/sbin:/usr/bin:/usr/local/sbin:/usr/local/bin:/root/bin SHELL=/bin/sh CONFIG_SHELL=/bin/sh CONFIG_SITE=/usr/ports/Templates/config.site lt_cv_sys_max_cmd_len=524288
--End CONFIGURE_ENV--

--MAKE_ENV--
OPENSSLBASE=/usr OPENSSLDIR=/etc/ssl OPENSSLINC=/usr/include OPENSSLLIB=/usr/lib XDG_DATA_HOME=/wrkdirs/usr/ports/lang/python39/work  XDG_CONFIG_HOME=/wrkdirs/usr/ports/lang/python39/work  HOME=/wrkdirs/usr/ports/lang/python39/work TMPDIR="/tmp" PATH=/wrkdirs/usr/ports/lang/python39/work/.bin:/sbin:/bin:/usr/sbin:/usr/bin:/usr/local/sbin:/usr/local/bin:/root/bin NO_PIE=yes MK_DEBUG_FILES=no MK_KERNEL_SYMBOLS=no SHELL=/bin/sh NO_LINT=YES PREFIX=/usr/local  LOCALBASE=/usr/local  CC="/nxb-bin/usr/bin/cc" CFLAGS="-O2 -pipe  -fstack-protector-strong -fno-strict-aliasing "  CPP="/nxb-bin/usr/bin/cpp" CPPFLAGS="-I/usr/local/include -I/usr/local/include"  LDFLAGS=" -L/usr/local/lib  -fstack-protector-strong " LIBS="-L/usr/local/lib -lintl"  CXX="/nxb-bin/usr/bin/c++" CXXFLAGS="-O2 -pipe -fstack-protector-strong -fno-strict-aliasing  "  MANPREFIX="/usr/local" BSD_INSTALL_PROGRAM="install  -s -m 555"  BSD_INSTALL_LIB="install  -s -m 0644"  BSD_INSTALL_SCRIPT="install  -m 555"  BSD_INSTALL_DATA
 ="install  -m 0644"  BSD_INSTALL_MAN="install  -m 444"
--End MAKE_ENV--

--PLIST_SUB--
ABI=  XY=39  XYDOT=3.9  XYZDOT=3.9.5  OSMAJOR=13 DEBUG="_at_comment " NO_DEBUG="" FNV="_at_comment " NO_FNV="" IPV6="" NO_IPV6="_at_comment " LIBMPDEC="" NO_LIBMPDEC="_at_comment " NLS="" NO_NLS="_at_comment " PYMALLOC="" NO_PYMALLOC="_at_comment " SIPHASH="_at_comment " NO_SIPHASH="" NO_NIS="" OSREL=13.0 PREFIX=%D LOCALBASE=/usr/local  RESETPREFIX=/usr/local LIB32DIR=lib DOCSDIR="share/doc/python"  EXAMPLESDIR="share/examples/python"  DATADIR="share/python"  WWWDIR="www/python"  ETCDIR="etc/python"
--End PLIST_SUB--

--SUB_LIST--
PYTHON_SUFFIX=39 DEBUG="_at_comment " NO_DEBUG="" FNV="_at_comment " NO_FNV="" IPV6="" NO_IPV6="_at_comment " LIBMPDEC="" NO_LIBMPDEC="_at_comment " NLS="" NO_NLS="_at_comment " PYMALLOC="" NO_PYMALLOC="_at_comment " SIPHASH="_at_comment " NO_SIPHASH="" PREFIX=/usr/local LOCALBASE=/usr/local  DATADIR=/usr/local/share/python DOCSDIR=/usr/local/share/doc/python EXAMPLESDIR=/usr/local/share/examples/python  WWWDIR=/usr/local/www/python ETCDIR=/usr/local/etc/python
--End SUB_LIST--

---Begin make.conf---
.sinclude "/etc/make.nxb.conf"
USE_PACKAGE_DEPENDS=yes
BATCH=yes
WRKDIRPREFIX=/wrkdirs
PORTSDIR=/usr/ports
PACKAGES=/packages
DISTDIR=/distfiles
PACKAGE_BUILDING=yes
PACKAGE_BUILDING_FLAVORS=yes
MACHINE=arm
MACHINE_ARCH=armv6
ARCH=${MACHINE_ARCH}
#### /usr/local/etc/poudriere.d/make.conf ####
# XXX: We really need this but cannot use it while 'make checksum' does not
# try the next mirror on checksum failure.  It currently retries the same
# failed mirror and then fails rather then trying another.  It *does*
# try the next if the size is mismatched though.
#MASTER_SITE_FREEBSD=yes
# Build ALLOW_MAKE_JOBS_PACKAGES with 2 jobs
MAKE_JOBS_NUMBER=2
#### /usr/ports/Mk/Scripts/ports_env.sh ####
_CCVERSION_9d218390=FreeBSD clang version 11.0.1 (git_at_github.com:llvm/llvm-project.git llvmorg-11.0.1-0-g43ff75f2c3fe) Target: armv6-unknown-freebsd13.0-gnueabihf Thread model: posix InstalledDir: /nxb-bin/usr/bin
_ALTCCVERSION_9d218390=none
_CXXINTERNAL_9c45a5b1=FreeBSD clang version 11.0.1 (git_at_github.com:llvm/llvm-project.git llvmorg-11.0.1-0-g43ff75f2c3fe) Target: armv6-unknown-freebsd13.0-gnueabihf Thread model: posix InstalledDir: /nxb-bin/usr/bin "/nxb-bin/usr/bin/ld" "--eh-frame-hdr" "-dynamic-linker" "/libexec/ld-elf.so.1" "--hash-style=both" "--enable-new-dtags" "-o" "a.out" "/usr/lib/crt1.o" "/usr/lib/crti.o" "/usr/lib/crtbegin.o" "-L/usr/lib" "/dev/null" "-lc++" "-lm" "-lgcc" "--as-needed" "-lgcc_s" "--no-as-needed" "-lc" "-lgcc" "--as-needed" "-lgcc_s" "--no-as-needed" "/usr/lib/crtend.o" "/usr/lib/crtn.o"
CC_OUTPUT_9d218390_58173849=yes
CC_OUTPUT_9d218390_9bdba57c=yes
CC_OUTPUT_9d218390_6a4fe7f5=yes
CC_OUTPUT_9d218390_6bcac02b=yes
CC_OUTPUT_9d218390_67d20829=yes
CC_OUTPUT_9d218390_bfa62e83=yes
CC_OUTPUT_9d218390_f0b4d593=yes
CC_OUTPUT_9d218390_308abb44=yes
CC_OUTPUT_9d218390_f00456e5=yes
CC_OUTPUT_9d218390_65ad290d=yes
CC_OUTPUT_9d218390_f2776b26=yes
CC_OUTPUT_9d218390_b2657cc3=yes
CC_OUTPUT_9d218390_380987f7=yes
CC_OUTPUT_9d218390_160933ec=yes
CC_OUTPUT_9d218390_fb62803b=yes
_OBJC_CCVERSION_9d218390=FreeBSD clang version 11.0.1 (git_at_github.com:llvm/llvm-project.git llvmorg-11.0.1-0-g43ff75f2c3fe) Target: armv6-unknown-freebsd13.0-gnueabihf Thread model: posix InstalledDir: /nxb-bin/usr/bin
_OBJC_ALTCCVERSION_9d218390=none
ARCH=armv6
OPSYS=FreeBSD
_OSRELEASE=13.0-RELEASE-p3
OSREL=13.0
OSVERSION=1300139
PYTHONBASE=/usr/local
CONFIGURE_MAX_CMD_LEN=524288
HAVE_PORTS_ENV=1
#### Misc Poudriere ####
GID=0
UID=0
DISABLE_MAKE_JOBS=poudriere
---End make.conf---
---Begin make.nxb.conf---
CC=/nxb-bin/usr/bin/cc
CPP=/nxb-bin/usr/bin/cpp
CXX=/nxb-bin/usr/bin/c++
NM=/nxb-bin/usr/bin/nm
LD=/nxb-bin/usr/bin/ld
OBJCOPY=/nxb-bin/usr/bin/objcopy
SIZE=/nxb-bin/usr/bin/size
STRIPBIN=/nxb-bin/usr/bin/strip
SED=/nxb-bin/usr/bin/sed
RANLIB=/nxb-bin/usr/bin/ranlib
YACC=/nxb-bin/usr/bin/yacc
MAKE=/nxb-bin/usr/bin/make
STRINGS=/nxb-bin/usr/bin/strings
AWK=/nxb-bin/usr/bin/awk
FLEX=/nxb-bin/usr/bin/flex
---End make.nxb.conf---
--Resource limits--
cpu time               (seconds, -t)  unlimited
file size           (512-blocks, -f)  unlimited
data seg size           (kbytes, -d)  33554432
stack size              (kbytes, -s)  524288
core file size      (512-blocks, -c)  unlimited
max memory size         (kbytes, -m)  unlimited
locked memory           (kbytes, -l)  unlimited
max user processes              (-u)  89999
open files                      (-n)  1024
virtual mem size        (kbytes, -v)  unlimited
swap limit              (kbytes, -w)  unlimited
socket buffer size       (bytes, -b)  unlimited
pseudo-terminals                (-p)  unlimited
kqueues                         (-k)  unlimited
umtx shared locks               (-o)  unlimited
--End resource limits--
=======================<phase: check-sanity   >============================
===>  License PSFL accepted by the user
===========================================================================
=======================<phase: pkg-depends    >============================
===>   python39-3.9.5 depends on file: /usr/local/sbin/pkg - not found
===>   Installing existing package /packages/All/pkg-1.16.3.txz
[130releng-armv6-quarterly-job-06] Installing pkg-1.16.3...
[130releng-armv6-quarterly-job-06] Extracting pkg-1.16.3: .......... done
===>   python39-3.9.5 depends on file: /usr/local/sbin/pkg - found
===>   Returning to build of python39-3.9.5
<snip>
install -m 0644 ./Lib/xml/etree/ElementPath.py /usr/local/lib/python3.9/xml/etree
install -m 0644 ./Lib/xml/etree/ElementTree.py /usr/local/lib/python3.9/xml/etree
install -m 0644 ./Lib/xml/etree/__init__.py /usr/local/lib/python3.9/xml/etree
install -m 0644 ./Lib/xml/etree/cElementTree.py /usr/local/lib/python3.9/xml/etree
install -m 0644 ./Lib/xml/parsers/__init__.py /usr/local/lib/python3.9/xml/parsers
install -m 0644 ./Lib/xml/parsers/expat.py /usr/local/lib/python3.9/xml/parsers
install -m 0644 ./Lib/xml/sax/__init__.py /usr/local/lib/python3.9/xml/sax
install -m 0644 ./Lib/xml/sax/_exceptions.py /usr/local/lib/python3.9/xml/sax
install -m 0644 ./Lib/xml/sax/expatreader.py /usr/local/lib/python3.9/xml/sax
install -m 0644 ./Lib/xml/sax/handler.py /usr/local/lib/python3.9/xml/sax
install -m 0644 ./Lib/xml/sax/saxutils.py /usr/local/lib/python3.9/xml/sax
install -m 0644 ./Lib/xml/sax/xmlreader.py /usr/local/lib/python3.9/xml/sax
install -m 0644 ./Lib/test/test_peg_generator/__init__.py /usr/local/lib/python3.9/test/test_peg_generator
install -m 0644 ./Lib/test/test_peg_generator/__main__.py /usr/local/lib/python3.9/test/test_peg_generator
install -m 0644 ./Lib/test/test_peg_generator/test_c_parser.py /usr/local/lib/python3.9/test/test_peg_generator
install -m 0644 ./Lib/test/test_peg_generator/test_first_sets.py /usr/local/lib/python3.9/test/test_peg_generator
install -m 0644 ./Lib/test/test_peg_generator/test_pegen.py /usr/local/lib/python3.9/test/test_peg_generator
install -m 0644 ./Lib/test/test_tools/__init__.py /usr/local/lib/python3.9/test/test_tools
install -m 0644 ./Lib/test/test_tools/__main__.py /usr/local/lib/python3.9/test/test_tools
install -m 0644 ./Lib/test/test_tools/test_fixcid.py /usr/local/lib/python3.9/test/test_tools
install -m 0644 ./Lib/test/test_tools/test_gprof2html.py /usr/local/lib/python3.9/test/test_tools
install -m 0644 ./Lib/test/test_tools/test_i18n.py /usr/local/lib/python3.9/test/test_tools
install -m 0644 ./Lib/test/test_tools/test_lll.py /usr/local/lib/python3.9/test/test_tools
install -m 0644 ./Lib/test/test_tools/test_md5sum.py /usr/local/lib/python3.9/test/test_tools
install -m 0644 ./Lib/test/test_tools/test_pathfix.py /usr/local/lib/python3.9/test/test_tools
install -m 0644 ./Lib/test/test_tools/test_pdeps.py /usr/local/lib/python3.9/test/test_tools
install -m 0644 ./Lib/test/test_tools/test_pindent.py /usr/local/lib/python3.9/test/test_tools
install -m 0644 ./Lib/test/test_tools/test_reindent.py /usr/local/lib/python3.9/test/test_tools
install -m 0644 ./Lib/test/test_tools/test_sundry.py /usr/local/lib/python3.9/test/test_tools
install -m 0644 ./Lib/test/test_warnings/__init__.py /usr/local/lib/python3.9/test/test_warnings
install -m 0644 ./Lib/test/test_warnings/__main__.py /usr/local/lib/python3.9/test/test_warnings
install -m 0644 ./Lib/test/test_warnings/data/import_warning.py /usr/local/lib/python3.9/test/test_warnings/data
install -m 0644 ./Lib/test/test_warnings/data/stacklevel.py /usr/local/lib/python3.9/test/test_warnings/data
install -m 0644 ./Lib/turtledemo/__init__.py /usr/local/lib/python3.9/turtledemo
install -m 555 ./Lib/turtledemo/__main__.py /usr/local/lib/python3.9/turtledemo
install -m 555 ./Lib/turtledemo/bytedesign.py /usr/local/lib/python3.9/turtledemo
install -m 0644 ./Lib/turtledemo/chaos.py /usr/local/lib/python3.9/turtledemo
install -m 555 ./Lib/turtledemo/clock.py /usr/local/lib/python3.9/turtledemo
install -m 0644 ./Lib/turtledemo/colormixer.py /usr/local/lib/python3.9/turtledemo
install -m 555 ./Lib/turtledemo/forest.py /usr/local/lib/python3.9/turtledemo
install -m 555 ./Lib/turtledemo/fractalcurves.py /usr/local/lib/python3.9/turtledemo
install -m 555 ./Lib/turtledemo/lindenmayer.py /usr/local/lib/python3.9/turtledemo
install -m 555 ./Lib/turtledemo/minimal_hanoi.py /usr/local/lib/python3.9/turtledemo
install -m 0644 ./Lib/turtledemo/nim.py /usr/local/lib/python3.9/turtledemo
install -m 555 ./Lib/turtledemo/paint.py /usr/local/lib/python3.9/turtledemo
install -m 555 ./Lib/turtledemo/peace.py /usr/local/lib/python3.9/turtledemo
install -m 555 ./Lib/turtledemo/penrose.py /usr/local/lib/python3.9/turtledemo
install -m 555 ./Lib/turtledemo/planet_and_moon.py /usr/local/lib/python3.9/turtledemo
install -m 0644 ./Lib/turtledemo/rosette.py /usr/local/lib/python3.9/turtledemo
install -m 0644 ./Lib/turtledemo/round_dance.py /usr/local/lib/python3.9/turtledemo
install -m 555 ./Lib/turtledemo/sorting_animate.py /usr/local/lib/python3.9/turtledemo
install -m 555 ./Lib/turtledemo/tree.py /usr/local/lib/python3.9/turtledemo
install -m 0644 ./Lib/turtledemo/turtle.cfg /usr/local/lib/python3.9/turtledemo
install -m 0644 ./Lib/turtledemo/two_canvases.py /usr/local/lib/python3.9/turtledemo
install -m 555 ./Lib/turtledemo/yinyang.py /usr/local/lib/python3.9/turtledemo
install -m 0644 ./Lib/multiprocessing/__init__.py /usr/local/lib/python3.9/multiprocessing
install -m 0644 ./Lib/multiprocessing/connection.py /usr/local/lib/python3.9/multiprocessing
install -m 0644 ./Lib/multiprocessing/context.py /usr/local/lib/python3.9/multiprocessing
install -m 0644 ./Lib/multiprocessing/forkserver.py /usr/local/lib/python3.9/multiprocessing
install -m 0644 ./Lib/multiprocessing/heap.py /usr/local/lib/python3.9/multiprocessing
install -m 0644 ./Lib/multiprocessing/managers.py /usr/local/lib/python3.9/multiprocessing
install -m 0644 ./Lib/multiprocessing/pool.py /usr/local/lib/python3.9/multiprocessing
install -m 0644 ./Lib/multiprocessing/popen_fork.py /usr/local/lib/python3.9/multiprocessing
install -m 0644 ./Lib/multiprocessing/popen_forkserver.py /usr/local/lib/python3.9/multiprocessing
install -m 0644 ./Lib/multiprocessing/popen_spawn_posix.py /usr/local/lib/python3.9/multiprocessing
install -m 0644 ./Lib/multiprocessing/popen_spawn_win32.py /usr/local/lib/python3.9/multiprocessing
install -m 0644 ./Lib/multiprocessing/process.py /usr/local/lib/python3.9/multiprocessing
install -m 0644 ./Lib/multiprocessing/queues.py /usr/local/lib/python3.9/multiprocessing
install -m 0644 ./Lib/multiprocessing/reduction.py /usr/local/lib/python3.9/multiprocessing
install -m 0644 ./Lib/multiprocessing/resource_sharer.py /usr/local/lib/python3.9/multiprocessing
install -m 0644 ./Lib/multiprocessing/resource_tracker.py /usr/local/lib/python3.9/multiprocessing
install -m 0644 ./Lib/multiprocessing/shared_memory.py /usr/local/lib/python3.9/multiprocessing
install -m 0644 ./Lib/multiprocessing/sharedctypes.py /usr/local/lib/python3.9/multiprocessing
install -m 0644 ./Lib/multiprocessing/spawn.py /usr/local/lib/python3.9/multiprocessing
install -m 0644 ./Lib/multiprocessing/synchronize.py /usr/local/lib/python3.9/multiprocessing
install -m 0644 ./Lib/multiprocessing/util.py /usr/local/lib/python3.9/multiprocessing
install -m 0644 ./Lib/multiprocessing/dummy/__init__.py /usr/local/lib/python3.9/multiprocessing/dummy
install -m 0644 ./Lib/multiprocessing/dummy/connection.py /usr/local/lib/python3.9/multiprocessing/dummy
install -m 0644 ./Lib/unittest/__init__.py /usr/local/lib/python3.9/unittest
install -m 0644 ./Lib/unittest/__main__.py /usr/local/lib/python3.9/unittest
install -m 0644 ./Lib/unittest/_log.py /usr/local/lib/python3.9/unittest
install -m 0644 ./Lib/unittest/async_case.py /usr/local/lib/python3.9/unittest
install -m 0644 ./Lib/unittest/case.py /usr/local/lib/python3.9/unittest
install -m 0644 ./Lib/unittest/loader.py /usr/local/lib/python3.9/unittest
install -m 0644 ./Lib/unittest/main.py /usr/local/lib/python3.9/unittest
install -m 0644 ./Lib/unittest/mock.py /usr/local/lib/python3.9/unittest
install -m 0644 ./Lib/unittest/result.py /usr/local/lib/python3.9/unittest
install -m 0644 ./Lib/unittest/runner.py /usr/local/lib/python3.9/unittest
install -m 0644 ./Lib/unittest/signals.py /usr/local/lib/python3.9/unittest
install -m 0644 ./Lib/unittest/suite.py /usr/local/lib/python3.9/unittest
install -m 0644 ./Lib/unittest/util.py /usr/local/lib/python3.9/unittest
install -m 0644 ./Lib/unittest/test/__init__.py /usr/local/lib/python3.9/unittest/test
install -m 0644 ./Lib/unittest/test/__main__.py /usr/local/lib/python3.9/unittest/test
install -m 0644 ./Lib/unittest/test/_test_warnings.py /usr/local/lib/python3.9/unittest/test
install -m 0644 ./Lib/unittest/test/dummy.py /usr/local/lib/python3.9/unittest/test
install -m 0644 ./Lib/unittest/test/support.py /usr/local/lib/python3.9/unittest/test
install -m 0644 ./Lib/unittest/test/test_assertions.py /usr/local/lib/python3.9/unittest/test
install -m 0644 ./Lib/unittest/test/test_async_case.py /usr/local/lib/python3.9/unittest/test
install -m 0644 ./Lib/unittest/test/test_break.py /usr/local/lib/python3.9/unittest/test
install -m 0644 ./Lib/unittest/test/test_case.py /usr/local/lib/python3.9/unittest/test
install -m 0644 ./Lib/unittest/test/test_discovery.py /usr/local/lib/python3.9/unittest/test
install -m 0644 ./Lib/unittest/test/test_functiontestcase.py /usr/local/lib/python3.9/unittest/test
install -m 0644 ./Lib/unittest/test/test_loader.py /usr/local/lib/python3.9/unittest/test
install -m 0644 ./Lib/unittest/test/test_program.py /usr/local/lib/python3.9/unittest/test
install -m 0644 ./Lib/unittest/test/test_result.py /usr/local/lib/python3.9/unittest/test
install -m 0644 ./Lib/unittest/test/test_runner.py /usr/local/lib/python3.9/unittest/test
install -m 0644 ./Lib/unittest/test/test_setups.py /usr/local/lib/python3.9/unittest/test
install -m 0644 ./Lib/unittest/test/test_skipping.py /usr/local/lib/python3.9/unittest/test
install -m 0644 ./Lib/unittest/test/test_suite.py /usr/local/lib/python3.9/unittest/test
install -m 0644 ./Lib/unittest/test/testmock/__init__.py /usr/local/lib/python3.9/unittest/test/testmock
install -m 0644 ./Lib/unittest/test/testmock/__main__.py /usr/local/lib/python3.9/unittest/test/testmock
install -m 0644 ./Lib/unittest/test/testmock/support.py /usr/local/lib/python3.9/unittest/test/testmock
install -m 0644 ./Lib/unittest/test/testmock/testasync.py /usr/local/lib/python3.9/unittest/test/testmock
install -m 0644 ./Lib/unittest/test/testmock/testcallable.py /usr/local/lib/python3.9/unittest/test/testmock
install -m 0644 ./Lib/unittest/test/testmock/testhelpers.py /usr/local/lib/python3.9/unittest/test/testmock
install -m 0644 ./Lib/unittest/test/testmock/testmagicmethods.py /usr/local/lib/python3.9/unittest/test/testmock
install -m 0644 ./Lib/unittest/test/testmock/testmock.py /usr/local/lib/python3.9/unittest/test/testmock
install -m 0644 ./Lib/unittest/test/testmock/testpatch.py /usr/local/lib/python3.9/unittest/test/testmock
install -m 0644 ./Lib/unittest/test/testmock/testsealable.py /usr/local/lib/python3.9/unittest/test/testmock
install -m 0644 ./Lib/unittest/test/testmock/testsentinel.py /usr/local/lib/python3.9/unittest/test/testmock
install -m 0644 ./Lib/unittest/test/testmock/testwith.py /usr/local/lib/python3.9/unittest/test/testmock
install -m 0644 ./Lib/venv/__init__.py /usr/local/lib/python3.9/venv
install -m 0644 ./Lib/venv/__main__.py /usr/local/lib/python3.9/venv
install -m 0644 ./Lib/venv/scripts/common/Activate.ps1 /usr/local/lib/python3.9/venv/scripts/common
install -m 0644 ./Lib/venv/scripts/common/activate /usr/local/lib/python3.9/venv/scripts/common
install -m 0644 ./Lib/venv/scripts/posix/activate.csh /usr/local/lib/python3.9/venv/scripts/posix
install -m 0644 ./Lib/venv/scripts/posix/activate.fish /usr/local/lib/python3.9/venv/scripts/posix
install -m 0644 ./Lib/curses/__init__.py /usr/local/lib/python3.9/curses
install -m 0644 ./Lib/curses/ascii.py /usr/local/lib/python3.9/curses
install -m 0644 ./Lib/curses/has_key.py /usr/local/lib/python3.9/curses
install -m 0644 ./Lib/curses/panel.py /usr/local/lib/python3.9/curses
install -m 0644 ./Lib/curses/textpad.py /usr/local/lib/python3.9/curses
install -m 0644 ./Lib/pydoc_data/__init__.py /usr/local/lib/python3.9/pydoc_data
install -m 0644 ./Lib/pydoc_data/_pydoc.css /usr/local/lib/python3.9/pydoc_data
install -m 0644 ./Lib/pydoc_data/topics.py /usr/local/lib/python3.9/pydoc_data
install -m 0644 ./Lib/zoneinfo/__init__.py /usr/local/lib/python3.9/zoneinfo
install -m 0644 ./Lib/zoneinfo/_common.py /usr/local/lib/python3.9/zoneinfo
install -m 0644 ./Lib/zoneinfo/_tzpath.py /usr/local/lib/python3.9/zoneinfo
install -m 0644 ./Lib/zoneinfo/_zoneinfo.py /usr/local/lib/python3.9/zoneinfo
install  -m 0644 `cat pybuilddir.txt`/_sysconfigdata__freebsd13_.py  /wrkdirs/usr/ports/lang/python39/work/stage/usr/local/lib/python3.9;  install  -m 0644 ./LICENSE /wrkdirs/usr/ports/lang/python39/work/stage/usr/local/lib/python3.9/LICENSE.txt
if test -d /wrkdirs/usr/ports/lang/python39/work/stage/usr/local/lib/python3.9/distutils/tests; then  install  -m 0644 ./Modules/xxmodule.c  /wrkdirs/usr/ports/lang/python39/work/stage/usr/local/lib/python3.9/distutils/tests ;  fi
PYTHONPATH=/wrkdirs/usr/ports/lang/python39/work/stage/usr/local/lib/python3.9  LD_LIBRARY_PATH=/wrkdirs/usr/ports/lang/python39/work/Python-3.9.5  ./python -E -Wi /wrkdirs/usr/ports/lang/python39/work/stage/usr/local/lib/python3.9/compileall.py  -j0 -d /usr/local/lib/python3.9 -f  -x 'bad_coding|badsyntax|site-packages|lib2to3/tests/data'  /wrkdirs/usr/ports/lang/python39/work/stage/usr/local/lib/python3.9
Listing '/wrkdirs/usr/ports/lang/python39/work/stage/usr/local/lib/python3.9'...
sem_wait: Invalid argument
sem_wait: Invalid argument
sem_wait: Invalid argument
Exception in thread QueueFeederThread:
sem_wait: Invalid argument
Traceback (most recent call last):
  File "/wrkdirs/usr/ports/lang/python39/work/stage/usr/local/lib/python3.9/multiprocessing/queues.py", line 235, in _feed
sem_wait: Invalid argument
    nrelease()
RuntimeError: release unlocked lock
sem_wait: Invalid argument
Traceback (most recent call last):
Traceback (most recent call last):

During handling of the above exception, another exception occurred:


During handling of the above exception, another exception occurred:

Traceback (most recent call last):
  File "/wrkdirs/usr/ports/lang/python39/work/stage/usr/local/lib/python3.9/compileall.py", line 101, in compile_dir
hon39/work/stage/usr/local/lib/python3.9/compileall.py", line 101, in compile_dir
  File "/wrkdirs/usr/ports/lang/python39/work/stage/usr/local/lib/python3.9/threading.py", line 954, in _bootstrap_inner
    results = executor.map(partial(compile_file,
  File "/wrkdirs/usr/ports/lang/python39/work/stage/usr/local/lib/python3.9/concurrent/futures/process.py", line 726, in map
    self.run()
  File "/wrkdirs/usr/ports/lang/python39/work/stage/usr/local/lib/python3.9/threading.py", line 892, in run
    results = super().map(partial(_process_chunk, fn),
  File "/wrkdirs/usr/ports/lang/python39/work/stage/usr/local/lib/python3.9/concurrent/futures/_base.py", line 597, in map
    self._target(*self._args, **self._kwargs)
  File "/wrkdirs/usr/ports/lang/python39/work/stage/usr/local/lib/python3.9/multiprocessing/queues.py", line 273, in _feed
    fs = [self.submit(fn, *args) for args in zip(*iterables)]
  File "/wrkdirs/usr/ports/lang/python39/work/stage/usr/local/lib/python3.9/concurrent/futures/_base.py", line 597, in <listcomp>
    onerror(e, obj)
UnboundLocalError: local variable 'obj' referenced before assignment
    fs = [self.submit(fn, *args) for args in zip(*iterables)]
  File "/wrkdirs/usr/ports/lang/python39/work/stage/usr/local/lib/python3.9/concurrent/futures/process.py", line 699, in submit
    return f
RuntimeError: release unlocked lock

During handling of the above exception, another exception occurred:

Traceback (most recent call last):
  File "/wrkdirs/usr/ports/lang/python39/work/stage/usr/local/lib/python3.9/compileall.py", line 460, in <module>
    exit_status = int(not main())
  File "/wrkdirs/usr/ports/lang/python39/work/stage/usr/local/lib/python3.9/compileall.py", line 437, in main
    if not compile_dir(dest, maxlevels, args.ddir,
  File "/wrkdirs/usr/ports/lang/python39/work/stage/usr/local/lib/python3.9/compileall.py", line 112, in compile_dir
    success = min(results, default=True)
  File "/wrkdirs/usr/ports/lang/python39/work/stage/usr/local/lib/python3.9/concurrent/futures/_base.py", line 636, in __exit__
    self.shutdown(wait=True)
  File "/wrkdirs/usr/ports/lang/python39/work/stage/usr/local/lib/python3.9/concurrent/futures/process.py", line 737, in shutdown
    self._executor_manager_thread_wakeup.wakeup()
RuntimeError: release unlocked lock
sem_wait: Invalid argument
sem_wait: Invalid argument
=>> Killing runaway build after 21600 seconds with no output
Received on Tue Jul 13 2021 - 15:25:31 UTC

Original text of this message