[package - main-amd64-default][devel/simavr] Failed for simavr-1.7_1 in build

From: <pkg-fallout_at_FreeBSD.org>
Date: Sat, 3 Jul 2021 23:14:37 GMT
You are receiving this mail as a port that you maintain
is failing to build on the FreeBSD package build server.
Please investigate the failure and submit a PR to fix
build.

Maintainer:     felix_at_palmen-it.de
Log URL:        http://beefy18.nyi.freebsd.org/data/main-amd64-default/p8656d375678d_s6329ca325e/logs/simavr-1.7_1.log
Build URL:      http://beefy18.nyi.freebsd.org/build.html?mastername=main-amd64-default&build=p8656d375678d_s6329ca325e
Log:

=>> Building devel/simavr
build started at Sat Jul  3 23:13:08 UTC 2021
port directory: /usr/ports/devel/simavr
package name: simavr-1.7_1
building for: FreeBSD main-amd64-default-job-12 14.0-CURRENT FreeBSD 14.0-CURRENT 1400024 amd64
maintained by: felix_at_palmen-it.de
Makefile ident: 
Poudriere version: 3.2.8-8-gaf08dbda
Host OSVERSION: 1400008
Jail OSVERSION: 1400024
Job Id: 12




!!! Jail is newer than host. (Jail: 1400024, Host: 1400008) !!!
!!! This is not supported. !!!
!!! Host kernel must be same or newer than jail. !!!
!!! Expect build failures. !!!



---Begin Environment---
SHELL=/bin/csh
OSVERSION=1400024
UNAME_v=FreeBSD 14.0-CURRENT 1400024
UNAME_r=14.0-CURRENT
BLOCKSIZE=K
MAIL=/var/mail/root
MM_CHARSET=UTF-8
LANG=C.UTF-8
STATUS=1
HOME=/root
PATH=/sbin:/bin:/usr/sbin:/usr/bin:/usr/local/sbin:/usr/local/bin:/root/bin
LOCALBASE=/usr/local
USER=root
LIBEXECPREFIX=/usr/local/libexec/poudriere
POUDRIERE_VERSION=3.2.8-8-gaf08dbda
MASTERMNT=/usr/local/poudriere/data/.m/main-amd64-default/ref
POUDRIERE_BUILD_TYPE=bulk
PACKAGE_BUILDING=yes
SAVED_TERM=
PWD=/usr/local/poudriere/data/.m/main-amd64-default/ref/.p/pool
P_PORTS_FEATURES=FLAVORS SELECTED_OPTIONS
MASTERNAME=main-amd64-default
SCRIPTPREFIX=/usr/local/share/poudriere
OLDPWD=/usr/local/poudriere/data/.m/main-amd64-default/ref/.p
SCRIPTPATH=/usr/local/share/poudriere/bulk.sh
POUDRIEREPATH=/usr/local/bin/poudriere
---End Environment---

---Begin Poudriere Port Flags/Env---
PORT_FLAGS=
PKGENV=
FLAVOR=
DEPENDS_ARGS=
MAKE_ARGS=
---End Poudriere Port Flags/Env---

---Begin OPTIONS List---
===> The following configuration options are available for simavr-1.7_1:
     DOCS=on: Build and/or install documentation
     EXAMPLES=on: Build and/or install examples
===> Use 'make config' to modify these settings
---End OPTIONS List---

--MAINTAINER--
felix_at_palmen-it.de
--End MAINTAINER--

--CONFIGURE_ARGS--

--End CONFIGURE_ARGS--

--CONFIGURE_ENV--
MAKE=gmake PKG_CONFIG=pkgconf XDG_DATA_HOME=/wrkdirs/usr/ports/devel/simavr/work  XDG_CONFIG_HOME=/wrkdirs/usr/ports/devel/simavr/work  HOME=/wrkdirs/usr/ports/devel/simavr/work TMPDIR="/tmp" PATH=/wrkdirs/usr/ports/devel/simavr/work/.bin:/sbin:/bin:/usr/sbin:/usr/bin:/usr/local/sbin:/usr/local/bin:/root/bin SHELL=/bin/sh CONFIG_SHELL=/bin/sh
--End CONFIGURE_ENV--

--MAKE_ENV--
SIMAVR_VERSION=v1.7 XDG_DATA_HOME=/wrkdirs/usr/ports/devel/simavr/work  XDG_CONFIG_HOME=/wrkdirs/usr/ports/devel/simavr/work  HOME=/wrkdirs/usr/ports/devel/simavr/work TMPDIR="/tmp" PATH=/wrkdirs/usr/ports/devel/simavr/work/.bin:/sbin:/bin:/usr/sbin:/usr/bin:/usr/local/sbin:/usr/local/bin:/root/bin NO_PIE=yes MK_DEBUG_FILES=no MK_KERNEL_SYMBOLS=no SHELL=/bin/sh NO_LINT=YES PREFIX=/usr/local  LOCALBASE=/usr/local  CC="cc" CFLAGS="-O2 -pipe  -fstack-protector-strong -fno-strict-aliasing "  CPP="cpp" CPPFLAGS=""  LDFLAGS=" -fstack-protector-strong " LIBS=""  CXX="c++" CXXFLAGS="-O2 -pipe -fstack-protector-strong -fno-strict-aliasing  "  MANPREFIX="/usr/local" BSD_INSTALL_PROGRAM="install  -s -m 555"  BSD_INSTALL_LIB="install  -s -m 0644"  BSD_INSTALL_SCRIPT="install  -m 555"  BSD_INSTALL_DATA="install  -m 0644"  BSD_INSTALL_MAN="install  -m 444"
--End MAKE_ENV--

--PLIST_SUB--
PORTDOCS="" PORTEXAMPLES="" TEXMFDIR="share/texmf" TEXMFDISTDIR="share/texmf-dist" TEXMFLOCALDIR="share/texmf-local" TEXMFVARDIR="share/texmf-var" TEXMFCONFIGDIR="share/texmf-config" FMTUTIL_CNF="share/texmf-config/web2c/fmtutil.cnf" OSREL=14.0 PREFIX=%D LOCALBASE=/usr/local  RESETPREFIX=/usr/local LIB32DIR=lib DOCSDIR="share/doc/simavr"  EXAMPLESDIR="share/examples/simavr"  DATADIR="share/simavr"  WWWDIR="www/simavr"  ETCDIR="etc/simavr"
--End PLIST_SUB--

--SUB_LIST--
PREFIX=/usr/local LOCALBASE=/usr/local  DATADIR=/usr/local/share/simavr DOCSDIR=/usr/local/share/doc/simavr EXAMPLESDIR=/usr/local/share/examples/simavr  WWWDIR=/usr/local/www/simavr ETCDIR=/usr/local/etc/simavr
--End SUB_LIST--

---Begin make.conf---
USE_PACKAGE_DEPENDS=yes
BATCH=yes
WRKDIRPREFIX=/wrkdirs
PORTSDIR=/usr/ports
PACKAGES=/packages
DISTDIR=/distfiles
PACKAGE_BUILDING=yes
PACKAGE_BUILDING_FLAVORS=yes
#### /usr/local/etc/poudriere.d/make.conf ####
# XXX: We really need this but cannot use it while 'make checksum' does not
# try the next mirror on checksum failure.  It currently retries the same
# failed mirror and then fails rather then trying another.  It *does*
# try the next if the size is mismatched though.
#MASTER_SITE_FREEBSD=yes
# Build ALLOW_MAKE_JOBS_PACKAGES with 2 jobs
MAKE_JOBS_NUMBER=2
#### /usr/ports/Mk/Scripts/ports_env.sh ####
_CCVERSION_921dbbb2=FreeBSD clang version 12.0.1 (git_at_github.com:llvm/llvm-project.git llvmorg-12.0.1-rc2-0-ge7dac564cd0e) Target: x86_64-unknown-freebsd14.0 Thread model: posix InstalledDir: /usr/bin
_ALTCCVERSION_921dbbb2=none
_CXXINTERNAL_acaad9ca=FreeBSD clang version 12.0.1 (git_at_github.com:llvm/llvm-project.git llvmorg-12.0.1-rc2-0-ge7dac564cd0e) Target: x86_64-unknown-freebsd14.0 Thread model: posix InstalledDir: /usr/bin "/usr/bin/ld" "--eh-frame-hdr" "-dynamic-linker" "/libexec/ld-elf.so.1" "--hash-style=both" "--enable-new-dtags" "-o" "a.out" "/usr/lib/crt1.o" "/usr/lib/crti.o" "/usr/lib/crtbegin.o" "-L/usr/lib" "/dev/null" "-lc++" "-lm" "-lgcc" "--as-needed" "-lgcc_s" "--no-as-needed" "-lc" "-lgcc" "--as-needed" "-lgcc_s" "--no-as-needed" "/usr/lib/crtend.o" "/usr/lib/crtn.o"
CC_OUTPUT_921dbbb2_58173849=yes
CC_OUTPUT_921dbbb2_9bdba57c=yes
CC_OUTPUT_921dbbb2_6a4fe7f5=yes
CC_OUTPUT_921dbbb2_6bcac02b=yes
CC_OUTPUT_921dbbb2_67d20829=yes
CC_OUTPUT_921dbbb2_bfa62e83=yes
CC_OUTPUT_921dbbb2_f0b4d593=yes
CC_OUTPUT_921dbbb2_308abb44=yes
CC_OUTPUT_921dbbb2_f00456e5=yes
CC_OUTPUT_921dbbb2_65ad290d=yes
CC_OUTPUT_921dbbb2_f2776b26=yes
CC_OUTPUT_921dbbb2_b2657cc3=yes
CC_OUTPUT_921dbbb2_380987f7=yes
CC_OUTPUT_921dbbb2_160933ec=yes
CC_OUTPUT_921dbbb2_fb62803b=yes
_OBJC_CCVERSION_921dbbb2=FreeBSD clang version 12.0.1 (git_at_github.com:llvm/llvm-project.git llvmorg-12.0.1-rc2-0-ge7dac564cd0e) Target: x86_64-unknown-freebsd14.0 Thread model: posix InstalledDir: /usr/bin
_OBJC_ALTCCVERSION_921dbbb2=none
ARCH=amd64
OPSYS=FreeBSD
_OSRELEASE=14.0-CURRENT
OSREL=14.0
OSVERSION=1400024
PYTHONBASE=/usr/local
HAVE_COMPAT_IA32_KERN=YES
CONFIGURE_MAX_CMD_LEN=524288
HAVE_PORTS_ENV=1
#### Misc Poudriere ####
GID=0
UID=0
---End make.conf---
--Resource limits--
cpu time               (seconds, -t)  unlimited
file size           (512-blocks, -f)  unlimited
data seg size           (kbytes, -d)  33554432
stack size              (kbytes, -s)  524288
core file size      (512-blocks, -c)  unlimited
max memory size         (kbytes, -m)  unlimited
locked memory           (kbytes, -l)  unlimited
max user processes              (-u)  89999
open files                      (-n)  1024
virtual mem size        (kbytes, -v)  unlimited
swap limit              (kbytes, -w)  unlimited
socket buffer size       (bytes, -b)  unlimited
pseudo-terminals                (-p)  unlimited
kqueues                         (-k)  unlimited
umtx shared locks               (-o)  unlimited
--End resource limits--
=======================<phase: check-sanity   >============================
===>  License GPLv3 accepted by the user
===========================================================================
=======================<phase: pkg-depends    >============================
===>   simavr-1.7_1 depends on file: /usr/local/sbin/pkg - not found
===>   Installing existing package /packages/All/pkg-1.16.3.txz
[main-amd64-default-job-12] Installing pkg-1.16.3...
[main-amd64-default-job-12] Extracting pkg-1.16.3: .......... done
===>   simavr-1.7_1 depends on file: /usr/local/sbin/pkg - found
===>   Returning to build of simavr-1.7_1
===========================================================================
=======================<phase: fetch-depends  >============================
===========================================================================
=======================<phase: fetch          >============================
===>  License GPLv3 accepted by the user
===> Fetching all distfiles required by simavr-1.7_1 for building
===========================================================================
=======================<phase: checksum       >============================
===>  License GPLv3 accepted by the user
===> Fetching all distfiles required by simavr-1.7_1 for building
=> SHA256 Checksum OK for buserror-simavr-v1.7_GH0.tar.gz.
===========================================================================
=======================<phase: extract-depends>============================
===========================================================================
=======================<phase: extract        >============================
===>  License GPLv3 accepted by the user
===> Fetching all distfiles required by simavr-1.7_1 for building
===>  Extracting for simavr-1.7_1
=> SHA256 Checksum OK for buserror-simavr-v1.7_GH0.tar.gz.
===========================================================================
=======================<phase: patch-depends  >============================
===========================================================================
=======================<phase: patch          >============================
===>  Patching for simavr-1.7_1
/usr/bin/sed -i.bak -e 's:Linux:FreeBSD:'  -e 's:unknown:v1.7:'  /wrkdirs/usr/ports/devel/simavr/work/simavr-1.7/simavr/Makefile  /wrkdirs/usr/ports/devel/simavr/work/simavr-1.7/examples/parts/Makefile
===========================================================================
=======================<phase: build-depends  >============================
===>   simavr-1.7_1 depends on executable: avr-gcc - not found
===>   Installing existing package /packages/All/avr-gcc-10.2.0.txz
[main-amd64-default-job-12] Installing avr-gcc-10.2.0...
[main-amd64-default-job-12] `-- Installing avr-binutils-2.33.1_4,1...
<snip>

ld: error: undefined symbol: glEnd
>>> referenced by rotenc_test.c:89
>>>               obj-x86_64-unknown-freebsd14.0/rotenc_test.o:(displayCB)

ld: error: undefined symbol: glFlush
>>> referenced by rotenc_test.c:91
>>>               obj-x86_64-unknown-freebsd14.0/rotenc_test.o:(displayCB)

ld: error: undefined symbol: glOrtho
>>> referenced by rotenc_test.c:243
>>>               obj-x86_64-unknown-freebsd14.0/rotenc_test.o:(main)

ld: error: undefined symbol: glScalef
>>> referenced by rotenc_test.c:244
>>>               obj-x86_64-unknown-freebsd14.0/rotenc_test.o:(main)

ld: error: undefined symbol: glTranslatef
>>> referenced by rotenc_test.c:245
>>>               obj-x86_64-unknown-freebsd14.0/rotenc_test.o:(main)
cc: error: linker command failed with exit code 1 (use -v to see invocation)
gmake[3]: *** [../../Makefile.common:193: obj-x86_64-unknown-freebsd14.0/rotenc_test.elf] Error 1
gmake[3]: Leaving directory '/wrkdirs/usr/ports/devel/simavr/work/simavr-1.7/examples/board_rotenc'
gmake[3]: Entering directory '/wrkdirs/usr/ports/devel/simavr/work/simavr-1.7/examples/board_simduino'
AVR-CC atmega328p_dummy_blinky.c
CC ../parts/uart_pty.c
    384	     66	      6	    456	    1c8	atmega328p_dummy_blinky.axf
CC simduino.c
LD obj-x86_64-unknown-freebsd14.0/simduino.elf
simduino done
rm atmega328p_dummy_blinky.axf
gmake[3]: Leaving directory '/wrkdirs/usr/ports/devel/simavr/work/simavr-1.7/examples/board_simduino'
gmake[3]: Entering directory '/wrkdirs/usr/ports/devel/simavr/work/simavr-1.7/examples/board_ssd1306'
AVR-CC atmega32_ssd1306.c
CC ../parts/ac_input.c
CC ../parts/ssd1306_virt.c
   1588	      0	   1024	   2612	    a34	atmega32_ssd1306.axf
CC ../parts/ssd1306_glut.c
CC ssd1306demo.c
LD obj-x86_64-unknown-freebsd14.0/ssd1306demo.elf
ld: error: undefined symbol: glColor4f
>>> referenced by ssd1306_glut.c:60 (../parts/ssd1306_glut.c:60)
>>>               obj-x86_64-unknown-freebsd14.0/ssd1306_glut.o:(ssd1306_gl_set_colour)
>>> referenced by ssd1306_glut.c:66 (../parts/ssd1306_glut.c:66)
>>>               obj-x86_64-unknown-freebsd14.0/ssd1306_glut.o:(ssd1306_gl_set_colour)
>>> referenced by ssd1306_glut.c:0 (../parts/ssd1306_glut.c:0)
>>>               obj-x86_64-unknown-freebsd14.0/ssd1306_glut.o:(ssd1306_gl_put_pixel_column)
>>> referenced 1 more times

ld: error: undefined symbol: glEnable
>>> referenced by ssd1306_glut.c:90 (../parts/ssd1306_glut.c:90)
>>>               obj-x86_64-unknown-freebsd14.0/ssd1306_glut.o:(ssd1306_gl_put_pixel_column)
>>> referenced by ssd1306_glut.c:144 (../parts/ssd1306_glut.c:144)
>>>               obj-x86_64-unknown-freebsd14.0/ssd1306_glut.o:(ssd1306_gl_draw)

ld: error: undefined symbol: glBlendFunc
>>> referenced by ssd1306_glut.c:91 (../parts/ssd1306_glut.c:91)
>>>               obj-x86_64-unknown-freebsd14.0/ssd1306_glut.o:(ssd1306_gl_put_pixel_column)
>>> referenced by ssd1306_glut.c:145 (../parts/ssd1306_glut.c:145)
>>>               obj-x86_64-unknown-freebsd14.0/ssd1306_glut.o:(ssd1306_gl_draw)

ld: error: undefined symbol: glBegin
>>> referenced by ssd1306_glut.c:92 (../parts/ssd1306_glut.c:92)
>>>               obj-x86_64-unknown-freebsd14.0/ssd1306_glut.o:(ssd1306_gl_put_pixel_column)
>>> referenced by ssd1306_glut.c:153 (../parts/ssd1306_glut.c:153)
>>>               obj-x86_64-unknown-freebsd14.0/ssd1306_glut.o:(ssd1306_gl_draw)

ld: error: undefined symbol: glVertex2f
>>> referenced by ssd1306_glut.c:100 (../parts/ssd1306_glut.c:100)
>>>               obj-x86_64-unknown-freebsd14.0/ssd1306_glut.o:(ssd1306_gl_put_pixel_column)
>>> referenced by ssd1306_glut.c:101 (../parts/ssd1306_glut.c:101)
>>>               obj-x86_64-unknown-freebsd14.0/ssd1306_glut.o:(ssd1306_gl_put_pixel_column)
>>> referenced by ssd1306_glut.c:102 (../parts/ssd1306_glut.c:102)
>>>               obj-x86_64-unknown-freebsd14.0/ssd1306_glut.o:(ssd1306_gl_put_pixel_column)
>>> referenced 5 more times

ld: error: undefined symbol: glEnd
>>> referenced by ssd1306_glut.c:106 (../parts/ssd1306_glut.c:106)
>>>               obj-x86_64-unknown-freebsd14.0/ssd1306_glut.o:(ssd1306_gl_put_pixel_column)
>>> referenced by ssd1306_glut.c:158 (../parts/ssd1306_glut.c:158)
>>>               obj-x86_64-unknown-freebsd14.0/ssd1306_glut.o:(ssd1306_gl_draw)

ld: error: undefined symbol: glTranslatef
>>> referenced by ssd1306_glut.c:152 (../parts/ssd1306_glut.c:152)
>>>               obj-x86_64-unknown-freebsd14.0/ssd1306_glut.o:(ssd1306_gl_draw)
>>> referenced by ssd1306_glut.c:133 (../parts/ssd1306_glut.c:133)
>>>               obj-x86_64-unknown-freebsd14.0/ssd1306_glut.o:(ssd1306_gl_draw)
>>> referenced by ssd1306_glut.c:129 (../parts/ssd1306_glut.c:129)
>>>               obj-x86_64-unknown-freebsd14.0/ssd1306_glut.o:(ssd1306_gl_draw)
>>> referenced 1 more times

ld: error: undefined symbol: glPopMatrix
>>> referenced by ssd1306_glut.c:131 (../parts/ssd1306_glut.c:131)
>>>               obj-x86_64-unknown-freebsd14.0/ssd1306_glut.o:(ssd1306_gl_draw)
>>> referenced by ssd1306demo.c:98
>>>               obj-x86_64-unknown-freebsd14.0/ssd1306demo.o:(displayCB)

ld: error: undefined symbol: glPushMatrix
>>> referenced by ssd1306_glut.c:123 (../parts/ssd1306_glut.c:123)
>>>               obj-x86_64-unknown-freebsd14.0/ssd1306_glut.o:(ssd1306_gl_draw)
>>> referenced by ssd1306demo.c:94
>>>               obj-x86_64-unknown-freebsd14.0/ssd1306demo.o:(displayCB)

ld: error: undefined symbol: glClear
>>> referenced by ssd1306demo.c:81
>>>               obj-x86_64-unknown-freebsd14.0/ssd1306demo.o:(displayCB)

ld: error: undefined symbol: glMatrixMode
>>> referenced by ssd1306demo.c:84
>>>               obj-x86_64-unknown-freebsd14.0/ssd1306demo.o:(displayCB)
>>> referenced by ssd1306demo.c:93
>>>               obj-x86_64-unknown-freebsd14.0/ssd1306demo.o:(displayCB)

ld: error: undefined symbol: glLoadIdentity
>>> referenced by ssd1306demo.c:86
>>>               obj-x86_64-unknown-freebsd14.0/ssd1306demo.o:(displayCB)
>>> referenced by ssd1306demo.c:96
>>>               obj-x86_64-unknown-freebsd14.0/ssd1306demo.o:(displayCB)

ld: error: undefined symbol: glOrtho
>>> referenced by ssd1306demo.c:87
>>>               obj-x86_64-unknown-freebsd14.0/ssd1306demo.o:(displayCB)

ld: error: undefined symbol: glScalef
>>> referenced by ssd1306demo.c:89
>>>               obj-x86_64-unknown-freebsd14.0/ssd1306demo.o:(displayCB)
cc: error: linker command failed with exit code 1 (use -v to see invocation)
gmake[3]: *** [../..//Makefile.common:193: obj-x86_64-unknown-freebsd14.0/ssd1306demo.elf] Error 1
gmake[3]: Leaving directory '/wrkdirs/usr/ports/devel/simavr/work/simavr-1.7/examples/board_ssd1306'
gmake[3]: Entering directory '/wrkdirs/usr/ports/devel/simavr/work/simavr-1.7/examples/board_timer_64led'
AVR-CC atmega168_timer_64led.c
CC ../parts/button.c
CC ../parts/hc595.c
CC timer_64led.c
   1900	     20	     53	   1973	    7b5	atmega168_timer_64led.axf
LD obj-x86_64-unknown-freebsd14.0/timer_64led.elf
ld: error: undefined symbol: glClear
>>> referenced by timer_64led.c:81
>>>               obj-x86_64-unknown-freebsd14.0/timer_64led.o:(displayCB)

ld: error: undefined symbol: glMatrixMode
>>> referenced by timer_64led.c:84
>>>               obj-x86_64-unknown-freebsd14.0/timer_64led.o:(displayCB)
>>> referenced by timer_64led.c:347
>>>               obj-x86_64-unknown-freebsd14.0/timer_64led.o:(main)

ld: error: undefined symbol: glLoadIdentity
>>> referenced by timer_64led.c:85
>>>               obj-x86_64-unknown-freebsd14.0/timer_64led.o:(displayCB)
>>> referenced by timer_64led.c:348
>>>               obj-x86_64-unknown-freebsd14.0/timer_64led.o:(main)

ld: error: undefined symbol: glTranslatef
>>> referenced by timer_64led.c:94
>>>               obj-x86_64-unknown-freebsd14.0/timer_64led.o:(displayCB)
>>> referenced by timer_64led.c:351
>>>               obj-x86_64-unknown-freebsd14.0/timer_64led.o:(main)

ld: error: undefined symbol: glBegin
>>> referenced by timer_64led.c:96
>>>               obj-x86_64-unknown-freebsd14.0/timer_64led.o:(displayCB)

ld: error: undefined symbol: glVertex2f
>>> referenced by timer_64led.c:133
>>>               obj-x86_64-unknown-freebsd14.0/timer_64led.o:(displayCB)
>>> referenced by timer_64led.c:133
>>>               obj-x86_64-unknown-freebsd14.0/timer_64led.o:(displayCB)
>>> referenced by timer_64led.c:133
>>>               obj-x86_64-unknown-freebsd14.0/timer_64led.o:(displayCB)
>>> referenced 16 more times

ld: error: undefined symbol: glColor3f
>>> referenced by timer_64led.c:102
>>>               obj-x86_64-unknown-freebsd14.0/timer_64led.o:(displayCB)

ld: error: undefined symbol: glEnd
>>> referenced by timer_64led.c:150
>>>               obj-x86_64-unknown-freebsd14.0/timer_64led.o:(displayCB)

ld: error: undefined symbol: glOrtho
>>> referenced by timer_64led.c:349
>>>               obj-x86_64-unknown-freebsd14.0/timer_64led.o:(main)

ld: error: undefined symbol: glScalef
>>> referenced by timer_64led.c:350
>>>               obj-x86_64-unknown-freebsd14.0/timer_64led.o:(main)
cc: error: linker command failed with exit code 1 (use -v to see invocation)
gmake[3]: *** [../..//Makefile.common:193: obj-x86_64-unknown-freebsd14.0/timer_64led.elf] Error 1
gmake[3]: Leaving directory '/wrkdirs/usr/ports/devel/simavr/work/simavr-1.7/examples/board_timer_64led'
gmake[2]: *** [Makefile:11: all] Error 2
gmake[2]: Leaving directory '/wrkdirs/usr/ports/devel/simavr/work/simavr-1.7/examples'
gmake[1]: *** [Makefile:24: build-examples] Error 2
gmake[1]: Leaving directory '/wrkdirs/usr/ports/devel/simavr/work/simavr-1.7'
===> Compilation failed unexpectedly.
Try to set MAKE_JOBS_UNSAFE=yes and rebuild before reporting the failure to
the maintainer.
*** Error code 1

Stop.
make: stopped in /usr/ports/devel/simavr
Received on Sat Jul 03 2021 - 23:14:37 UTC

Original text of this message