[package - 114amd64-default][devel/simavr] Failed for simavr-1.7_1 in build

From: <pkg-fallout_at_FreeBSD.org>
Date: Wed, 7 Jul 2021 07:51:01 GMT
You are receiving this mail as a port that you maintain
is failing to build on the FreeBSD package build server.
Please investigate the failure and submit a PR to fix
build.

Maintainer:     felix_at_palmen-it.de
Log URL:        http://beefy9.nyi.freebsd.org/data/114amd64-default/ed4b8e417ef2/logs/simavr-1.7_1.log
Build URL:      http://beefy9.nyi.freebsd.org/build.html?mastername=114amd64-default&build=ed4b8e417ef2
Log:

=>> Building devel/simavr
build started at Wed Jul  7 07:49:36 UTC 2021
port directory: /usr/ports/devel/simavr
package name: simavr-1.7_1
building for: FreeBSD 114amd64-default-job-04 11.4-RELEASE-p12 FreeBSD 11.4-RELEASE-p12 amd64
maintained by: felix_at_palmen-it.de
Makefile ident: 
Poudriere version: 3.2.8-8-gaf08dbda
Host OSVERSION: 1400008
Jail OSVERSION: 1104001
Job Id: 04

---Begin Environment---
SHELL=/bin/csh
OSVERSION=1104001
UNAME_v=FreeBSD 11.4-RELEASE-p12
UNAME_r=11.4-RELEASE-p12
BLOCKSIZE=K
MAIL=/var/mail/root
STATUS=1
HOME=/root
PATH=/sbin:/bin:/usr/sbin:/usr/bin:/usr/local/sbin:/usr/local/bin:/root/bin
LOCALBASE=/usr/local
USER=root
LIBEXECPREFIX=/usr/local/libexec/poudriere
POUDRIERE_VERSION=3.2.8-8-gaf08dbda
MASTERMNT=/usr/local/poudriere/data/.m/114amd64-default/ref
POUDRIERE_BUILD_TYPE=bulk
PACKAGE_BUILDING=yes
SAVED_TERM=
PWD=/usr/local/poudriere/data/.m/114amd64-default/ref/.p/pool
P_PORTS_FEATURES=FLAVORS SELECTED_OPTIONS
MASTERNAME=114amd64-default
SCRIPTPREFIX=/usr/local/share/poudriere
OLDPWD=/usr/local/poudriere/data/.m/114amd64-default/ref/.p
SCRIPTPATH=/usr/local/share/poudriere/bulk.sh
POUDRIEREPATH=/usr/local/bin/poudriere
---End Environment---

---Begin Poudriere Port Flags/Env---
PORT_FLAGS=
PKGENV=
FLAVOR=
DEPENDS_ARGS=
MAKE_ARGS=
---End Poudriere Port Flags/Env---

---Begin OPTIONS List---
===> The following configuration options are available for simavr-1.7_1:
     DOCS=on: Build and/or install documentation
     EXAMPLES=on: Build and/or install examples
===> Use 'make config' to modify these settings
---End OPTIONS List---

--MAINTAINER--
felix_at_palmen-it.de
--End MAINTAINER--

--CONFIGURE_ARGS--

--End CONFIGURE_ARGS--

--CONFIGURE_ENV--
MAKE=gmake PKG_CONFIG=pkgconf XDG_DATA_HOME=/wrkdirs/usr/ports/devel/simavr/work  XDG_CONFIG_HOME=/wrkdirs/usr/ports/devel/simavr/work  HOME=/wrkdirs/usr/ports/devel/simavr/work TMPDIR="/tmp" PATH=/wrkdirs/usr/ports/devel/simavr/work/.bin:/sbin:/bin:/usr/sbin:/usr/bin:/usr/local/sbin:/usr/local/bin:/root/bin SHELL=/bin/sh CONFIG_SHELL=/bin/sh
--End CONFIGURE_ENV--

--MAKE_ENV--
SIMAVR_VERSION=v1.7 XDG_DATA_HOME=/wrkdirs/usr/ports/devel/simavr/work  XDG_CONFIG_HOME=/wrkdirs/usr/ports/devel/simavr/work  HOME=/wrkdirs/usr/ports/devel/simavr/work TMPDIR="/tmp" PATH=/wrkdirs/usr/ports/devel/simavr/work/.bin:/sbin:/bin:/usr/sbin:/usr/bin:/usr/local/sbin:/usr/local/bin:/root/bin NO_PIE=yes MK_DEBUG_FILES=no MK_KERNEL_SYMBOLS=no SHELL=/bin/sh NO_LINT=YES PREFIX=/usr/local  LOCALBASE=/usr/local  CC="cc" CFLAGS="-O2 -pipe  -fstack-protector-strong -fno-strict-aliasing "  CPP="cpp" CPPFLAGS=""  LDFLAGS=" -fstack-protector-strong " LIBS=""  CXX="c++" CXXFLAGS="-O2 -pipe -fstack-protector-strong -fno-strict-aliasing  "  MANPREFIX="/usr/local" BSD_INSTALL_PROGRAM="install  -s -m 555"  BSD_INSTALL_LIB="install  -s -m 0644"  BSD_INSTALL_SCRIPT="install  -m 555"  BSD_INSTALL_DATA="install  -m 0644"  BSD_INSTALL_MAN="install  -m 444"
--End MAKE_ENV--

--PLIST_SUB--
PORTDOCS="" PORTEXAMPLES="" TEXMFDIR="share/texmf" TEXMFDISTDIR="share/texmf-dist" TEXMFLOCALDIR="share/texmf-local" TEXMFVARDIR="share/texmf-var" TEXMFCONFIGDIR="share/texmf-config" FMTUTIL_CNF="share/texmf-config/web2c/fmtutil.cnf" OSREL=11.4 PREFIX=%D LOCALBASE=/usr/local  RESETPREFIX=/usr/local LIB32DIR=lib DOCSDIR="share/doc/simavr"  EXAMPLESDIR="share/examples/simavr"  DATADIR="share/simavr"  WWWDIR="www/simavr"  ETCDIR="etc/simavr"
--End PLIST_SUB--

--SUB_LIST--
PREFIX=/usr/local LOCALBASE=/usr/local  DATADIR=/usr/local/share/simavr DOCSDIR=/usr/local/share/doc/simavr EXAMPLESDIR=/usr/local/share/examples/simavr  WWWDIR=/usr/local/www/simavr ETCDIR=/usr/local/etc/simavr
--End SUB_LIST--

---Begin make.conf---
USE_PACKAGE_DEPENDS=yes
BATCH=yes
WRKDIRPREFIX=/wrkdirs
PORTSDIR=/usr/ports
PACKAGES=/packages
DISTDIR=/distfiles
PACKAGE_BUILDING=yes
PACKAGE_BUILDING_FLAVORS=yes
#### /usr/local/etc/poudriere.d/make.conf ####
# XXX: We really need this but cannot use it while 'make checksum' does not
# try the next mirror on checksum failure.  It currently retries the same
# failed mirror and then fails rather then trying another.  It *does*
# try the next if the size is mismatched though.
#MASTER_SITE_FREEBSD=yes
# Build ALLOW_MAKE_JOBS_PACKAGES with 2 jobs
MAKE_JOBS_NUMBER=2
#### /usr/ports/Mk/Scripts/ports_env.sh ####
_CCVERSION_921dbbb2=FreeBSD clang version 10.0.0 (git_at_github.com:llvm/llvm-project.git llvmorg-10.0.0-0-gd32170dbd5b) Target: x86_64-unknown-freebsd11.4 Thread model: posix InstalledDir: /usr/bin
_ALTCCVERSION_921dbbb2=none
_CXXINTERNAL_acaad9ca=FreeBSD clang version 10.0.0 (git_at_github.com:llvm/llvm-project.git llvmorg-10.0.0-0-gd32170dbd5b) Target: x86_64-unknown-freebsd11.4 Thread model: posix InstalledDir: /usr/bin "/usr/bin/ld" "--eh-frame-hdr" "-dynamic-linker" "/libexec/ld-elf.so.1" "--hash-style=both" "--enable-new-dtags" "-o" "a.out" "/usr/lib/crt1.o" "/usr/lib/crti.o" "/usr/lib/crtbegin.o" "-L/usr/lib" "/dev/null" "-lc++" "-lm" "-lgcc" "--as-needed" "-lgcc_s" "--no-as-needed" "-lc" "-lgcc" "--as-needed" "-lgcc_s" "--no-as-needed" "/usr/lib/crtend.o" "/usr/lib/crtn.o"
CC_OUTPUT_921dbbb2_58173849=yes
CC_OUTPUT_921dbbb2_9bdba57c=yes
CC_OUTPUT_921dbbb2_6a4fe7f5=yes
CC_OUTPUT_921dbbb2_6bcac02b=yes
CC_OUTPUT_921dbbb2_67d20829=yes
CC_OUTPUT_921dbbb2_bfa62e83=yes
CC_OUTPUT_921dbbb2_f0b4d593=yes
CC_OUTPUT_921dbbb2_308abb44=yes
CC_OUTPUT_921dbbb2_f00456e5=yes
CC_OUTPUT_921dbbb2_65ad290d=yes
CC_OUTPUT_921dbbb2_f2776b26=yes
CC_OUTPUT_921dbbb2_b2657cc3=yes
CC_OUTPUT_921dbbb2_380987f7=yes
CC_OUTPUT_921dbbb2_160933ec=yes
CC_OUTPUT_921dbbb2_fb62803b=yes
_OBJC_CCVERSION_921dbbb2=FreeBSD clang version 10.0.0 (git_at_github.com:llvm/llvm-project.git llvmorg-10.0.0-0-gd32170dbd5b) Target: x86_64-unknown-freebsd11.4 Thread model: posix InstalledDir: /usr/bin
_OBJC_ALTCCVERSION_921dbbb2=none
ARCH=amd64
OPSYS=FreeBSD
_OSRELEASE=11.4-RELEASE-p12
OSREL=11.4
OSVERSION=1104001
PYTHONBASE=/usr/local
HAVE_COMPAT_IA32_KERN=YES
CONFIGURE_MAX_CMD_LEN=524288
HAVE_PORTS_ENV=1
#### Misc Poudriere ####
GID=0
UID=0
DISABLE_MAKE_JOBS=poudriere
---End make.conf---
--Resource limits--
cpu time               (seconds, -t)  unlimited
file size           (512-blocks, -f)  unlimited
data seg size           (kbytes, -d)  33554432
stack size              (kbytes, -s)  524288
core file size      (512-blocks, -c)  unlimited
max memory size         (kbytes, -m)  unlimited
locked memory           (kbytes, -l)  unlimited
max user processes              (-u)  89999
open files                      (-n)  1024
virtual mem size        (kbytes, -v)  unlimited
swap limit              (kbytes, -w)  unlimited
socket buffer size       (bytes, -b)  unlimited
pseudo-terminals                (-p)  unlimited
kqueues                         (-k)  unlimited
umtx shared locks               (-o)  unlimited
--End resource limits--
=======================<phase: check-sanity   >============================
===>  License GPLv3 accepted by the user
===========================================================================
=======================<phase: pkg-depends    >============================
===>   simavr-1.7_1 depends on file: /usr/local/sbin/pkg - not found
===>   Installing existing package /packages/All/pkg-1.16.3.txz
[114amd64-default-job-04] Installing pkg-1.16.3...
[114amd64-default-job-04] Extracting pkg-1.16.3: .......... done
===>   simavr-1.7_1 depends on file: /usr/local/sbin/pkg - found
===>   Returning to build of simavr-1.7_1
===========================================================================
=======================<phase: fetch-depends  >============================
===========================================================================
=======================<phase: fetch          >============================
===>  License GPLv3 accepted by the user
===> Fetching all distfiles required by simavr-1.7_1 for building
===========================================================================
=======================<phase: checksum       >============================
===>  License GPLv3 accepted by the user
===> Fetching all distfiles required by simavr-1.7_1 for building
=> SHA256 Checksum OK for buserror-simavr-v1.7_GH0.tar.gz.
===========================================================================
=======================<phase: extract-depends>============================
===========================================================================
=======================<phase: extract        >============================
===>  License GPLv3 accepted by the user
===> Fetching all distfiles required by simavr-1.7_1 for building
===>  Extracting for simavr-1.7_1
=> SHA256 Checksum OK for buserror-simavr-v1.7_GH0.tar.gz.
===========================================================================
=======================<phase: patch-depends  >============================
===========================================================================
=======================<phase: patch          >============================
===>  Patching for simavr-1.7_1
/usr/bin/sed -i.bak -e 's:Linux:FreeBSD:'  -e 's:unknown:v1.7:'  /wrkdirs/usr/ports/devel/simavr/work/simavr-1.7/simavr/Makefile  /wrkdirs/usr/ports/devel/simavr/work/simavr-1.7/examples/parts/Makefile
===========================================================================
=======================<phase: build-depends  >============================
===>   simavr-1.7_1 depends on executable: avr-gcc - not found
===>   Installing existing package /packages/All/avr-gcc-10.2.0.txz
[114amd64-default-job-04] Installing avr-gcc-10.2.0...
[114amd64-default-job-04] `-- Installing avr-binutils-2.33.1_4,1...
[114amd64-default-job-04] `-- Extracting avr-binutils-2.33.1_4,1: .......... done
[114amd64-default-job-04] `-- Installing gettext-runtime-0.21...
[114amd64-default-job-04] |   `-- Installing indexinfo-0.3.1...
[114amd64-default-job-04] |   `-- Extracting indexinfo-0.3.1: .... done
[114amd64-default-job-04] `-- Extracting gettext-runtime-0.21: .......... done
[114amd64-default-job-04] `-- Installing gmp-6.2.1...
[114amd64-default-job-04] `-- Extracting gmp-6.2.1: .......... done
[114amd64-default-job-04] `-- Installing isl-0.23...
[114amd64-default-job-04] `-- Extracting isl-0.23: .......... done
[114amd64-default-job-04] `-- Installing mpc-1.2.0...
[114amd64-default-job-04] |   `-- Installing mpfr-4.1.0...
<snip>
Message from freeglut-3.2.1:

--
Joystick support is untested and it is unknown if it works.

Do not hesitate to contact x11_at_FreeBSD.org if this causes issues.
===>   simavr-1.7_1 depends on shared library: libglut.so - found (/usr/local/lib/libglut.so)
===>   Returning to build of simavr-1.7_1
===========================================================================
=======================<phase: configure      >============================
===>  Configuring for simavr-1.7_1
===========================================================================
=======================<phase: build          >============================
===>  Building for simavr-1.7_1
gmake[1]: Entering directory '/wrkdirs/usr/ports/devel/simavr/work/simavr-1.7'
gmake -C simavr RELEASE=1
gmake[2]: Entering directory '/wrkdirs/usr/ports/devel/simavr/work/simavr-1.7/simavr'
/usr/local/bin/bash: line 1: git: command not found
CONF obj-x86_64-unknown-freebsd11.4/cores.deps
WARNING cores/sim_mega328pb.c did not compile, check your avr-gcc toolchain
/usr/local/bin/bash: line 1: git: command not found
gmake obj config
gmake[3]: Entering directory '/wrkdirs/usr/ports/devel/simavr/work/simavr-1.7/simavr'
/usr/local/bin/bash: line 1: git: command not found
gmake[3]: Nothing to be done for 'obj'.
CONF sim_core_decl.h
gmake[3]: Leaving directory '/wrkdirs/usr/ports/devel/simavr/work/simavr-1.7/simavr'
gmake libsimavr run_avr
gmake[3]: Entering directory '/wrkdirs/usr/ports/devel/simavr/work/simavr-1.7/simavr'
/usr/local/bin/bash: line 1: git: command not found
CC sim/sim_avr.c
CC sim/sim_cmds.c
CC sim/sim_core.c
CC sim/sim_cycle_timers.c
CC sim/sim_elf.c
CC sim/sim_gdb.c
CC sim/sim_hex.c
CC sim/sim_interrupts.c
CC sim/sim_io.c
CC sim/sim_irq.c
CC sim/sim_utils.c
CC sim/sim_vcd_file.c
CC sim/avr_acomp.c
CC sim/avr_adc.c
CC sim/avr_bitbang.c
CC sim/avr_eeprom.c
CC sim/avr_extint.c
CC sim/avr_flash.c
CC sim/avr_ioport.c
CC sim/avr_lin.c
CC sim/avr_spi.c
CC sim/avr_timer.c
CC sim/avr_twi.c
CC sim/avr_uart.c
CC sim/avr_usb.c
CC sim/avr_watchdog.c
CORE cores/sim_mega128.c
CORE cores/sim_mega1280.c
CORE cores/sim_mega1281.c
CORE cores/sim_mega1284.c
CORE cores/sim_mega128rfa1.c
CORE cores/sim_mega128rfr2.c
CORE cores/sim_mega16.c
CORE cores/sim_mega164.c
CORE cores/sim_mega168.c
CORE cores/sim_mega169.c
CORE cores/sim_mega16m1.c
CORE cores/sim_mega2560.c
CORE cores/sim_mega32.c
CORE cores/sim_mega324.c
CORE cores/sim_mega324a.c
CORE cores/sim_mega328.c
CORE cores/sim_mega32u4.c
CORE cores/sim_mega48.c
CORE cores/sim_mega644.c
CORE cores/sim_mega64m1.c
CORE cores/sim_mega8.c
CORE cores/sim_mega88.c
CORE cores/sim_megax.c
CORE cores/sim_megax4.c
CORE cores/sim_megax8.c
CORE cores/sim_megaxm1.c
CORE cores/sim_tiny13.c
CORE cores/sim_tiny2313.c
CORE cores/sim_tiny2313a.c
CORE cores/sim_tiny24.c
CORE cores/sim_tiny25.c
CORE cores/sim_tiny4313.c
CORE cores/sim_tiny44.c
CORE cores/sim_tiny45.c
CORE cores/sim_tiny84.c
CORE cores/sim_tiny85.c
CORE cores/sim_tinyx4.c
CORE cores/sim_tinyx5.c
CORE cores/sim_usb162.c
AR obj-x86_64-unknown-freebsd11.4/libsimavr.a
SHARED obj-x86_64-unknown-freebsd11.4/libsimavr.so.1
ln -sf libsimavr.so.1 obj-x86_64-unknown-freebsd11.4/libsimavr.so
CC sim/run_avr.c
LD obj-x86_64-unknown-freebsd11.4/run_avr.elf
ln -sf obj-x86_64-unknown-freebsd11.4/run_avr.elf run_avr
gmake[3]: Leaving directory '/wrkdirs/usr/ports/devel/simavr/work/simavr-1.7/simavr'
gmake[2]: Leaving directory '/wrkdirs/usr/ports/devel/simavr/work/simavr-1.7/simavr'
gmake -C examples RELEASE=1
gmake[2]: Entering directory '/wrkdirs/usr/ports/devel/simavr/work/simavr-1.7/examples'
for bi in board_ds1338 board_hd44780 board_i2ctest board_ledramp board_rotenc board_simduino board_ssd1306 board_timer_64led; do gmake -C $bi; done
gmake[3]: Entering directory '/wrkdirs/usr/ports/devel/simavr/work/simavr-1.7/examples/board_ds1338'
AVR-CC atmega32_ds1338.c
    902	      0	      1	    903	    387	atmega32_ds1338.axf
CC ../parts/ac_input.c
CC ../parts/ds1338_virt.c
CC ds1338demo.c
LD obj-x86_64-unknown-freebsd11.4/ds1338demo.elf
ds1338demo done
gmake[3]: Leaving directory '/wrkdirs/usr/ports/devel/simavr/work/simavr-1.7/examples/board_ds1338'
gmake[3]: Entering directory '/wrkdirs/usr/ports/devel/simavr/work/simavr-1.7/examples/board_hd44780'
AVR-CC atmega48_charlcd.c
   2102	     14	      5	   2121	    849	atmega48_charlcd.axf
CC ../parts/ac_input.c
CC ../parts/hd44780.c
CC ../parts/hd44780_glut.c
CC charlcd.c
LD obj-x86_64-unknown-freebsd11.4/charlcd.elf
/usr/bin/ld: undefined reference to symbol `glEnable' (try adding -lOpenGL)
//usr/local/lib/libOpenGL.so.0: could not read symbols: Bad value
cc: error: linker command failed with exit code 1 (use -v to see invocation)
gmake[3]: *** [../..//Makefile.common:193: obj-x86_64-unknown-freebsd11.4/charlcd.elf] Error 1
gmake[3]: Leaving directory '/wrkdirs/usr/ports/devel/simavr/work/simavr-1.7/examples/board_hd44780'
gmake[3]: Entering directory '/wrkdirs/usr/ports/devel/simavr/work/simavr-1.7/examples/board_i2ctest'
AVR-CC atmega1280_i2ctest.c
   1184	     32	     12	   1228	    4cc	atmega1280_i2ctest.axf
CC i2ctest.c
CC ../../examples/parts/i2c_eeprom.c
LD obj-x86_64-unknown-freebsd11.4/i2ctest.elf
i2ctest done
gmake[3]: Leaving directory '/wrkdirs/usr/ports/devel/simavr/work/simavr-1.7/examples/board_i2ctest'
gmake[3]: Entering directory '/wrkdirs/usr/ports/devel/simavr/work/simavr-1.7/examples/board_ledramp'
AVR-CC atmega48_ledramp.c
   1888	     32	     11	   1931	    78b	atmega48_ledramp.axf
CC ../parts/button.c
CC ledramp.c
LD obj-x86_64-unknown-freebsd11.4/ledramp.elf
/usr/bin/ld: undefined reference to symbol `glEnd' (try adding -lOpenGL)
//usr/local/lib/libOpenGL.so.0: could not read symbols: Bad value
cc: error: linker command failed with exit code 1 (use -v to see invocation)
gmake[3]: *** [../..//Makefile.common:193: obj-x86_64-unknown-freebsd11.4/ledramp.elf] Error 1
gmake[3]: Leaving directory '/wrkdirs/usr/ports/devel/simavr/work/simavr-1.7/examples/board_ledramp'
gmake[3]: Entering directory '/wrkdirs/usr/ports/devel/simavr/work/simavr-1.7/examples/board_rotenc'
AVR-CC atmega32_rotenc_test.c
    382	      0	      0	    382	    17e	atmega32_rotenc_test.axf
CC rotenc_test.c
CC ../../examples/parts/rotenc.c
LD obj-x86_64-unknown-freebsd11.4/rotenc_test.elf
/usr/bin/ld: undefined reference to symbol `glEnd' (try adding -lOpenGL)
//usr/local/lib/libOpenGL.so.0: could not read symbols: Bad value
cc: error: linker command failed with exit code 1 (use -v to see invocation)
gmake[3]: *** [../../Makefile.common:193: obj-x86_64-unknown-freebsd11.4/rotenc_test.elf] Error 1
gmake[3]: Leaving directory '/wrkdirs/usr/ports/devel/simavr/work/simavr-1.7/examples/board_rotenc'
gmake[3]: Entering directory '/wrkdirs/usr/ports/devel/simavr/work/simavr-1.7/examples/board_simduino'
AVR-CC atmega328p_dummy_blinky.c
    384	     66	      6	    456	    1c8	atmega328p_dummy_blinky.axf
CC ../parts/uart_pty.c
CC simduino.c
LD obj-x86_64-unknown-freebsd11.4/simduino.elf
simduino done
rm atmega328p_dummy_blinky.axf
gmake[3]: Leaving directory '/wrkdirs/usr/ports/devel/simavr/work/simavr-1.7/examples/board_simduino'
gmake[3]: Entering directory '/wrkdirs/usr/ports/devel/simavr/work/simavr-1.7/examples/board_ssd1306'
AVR-CC atmega32_ssd1306.c
   1588	      0	   1024	   2612	    a34	atmega32_ssd1306.axf
CC ../parts/ac_input.c
CC ../parts/ssd1306_virt.c
CC ../parts/ssd1306_glut.c
CC ssd1306demo.c
LD obj-x86_64-unknown-freebsd11.4/ssd1306demo.elf
/usr/bin/ld: undefined reference to symbol `glEnable' (try adding -lOpenGL)
//usr/local/lib/libOpenGL.so.0: could not read symbols: Bad value
cc: error: linker command failed with exit code 1 (use -v to see invocation)
gmake[3]: *** [../..//Makefile.common:193: obj-x86_64-unknown-freebsd11.4/ssd1306demo.elf] Error 1
gmake[3]: Leaving directory '/wrkdirs/usr/ports/devel/simavr/work/simavr-1.7/examples/board_ssd1306'
gmake[3]: Entering directory '/wrkdirs/usr/ports/devel/simavr/work/simavr-1.7/examples/board_timer_64led'
AVR-CC atmega168_timer_64led.c
   1900	     20	     53	   1973	    7b5	atmega168_timer_64led.axf
CC ../parts/button.c
CC ../parts/hc595.c
CC timer_64led.c
LD obj-x86_64-unknown-freebsd11.4/timer_64led.elf
/usr/bin/ld: undefined reference to symbol `glEnd' (try adding -lOpenGL)
//usr/local/lib/libOpenGL.so.0: could not read symbols: Bad value
cc: error: linker command failed with exit code 1 (use -v to see invocation)
gmake[3]: *** [../..//Makefile.common:193: obj-x86_64-unknown-freebsd11.4/timer_64led.elf] Error 1
gmake[3]: Leaving directory '/wrkdirs/usr/ports/devel/simavr/work/simavr-1.7/examples/board_timer_64led'
gmake[2]: *** [Makefile:11: all] Error 2
gmake[2]: Leaving directory '/wrkdirs/usr/ports/devel/simavr/work/simavr-1.7/examples'
gmake[1]: *** [Makefile:24: build-examples] Error 2
gmake[1]: Leaving directory '/wrkdirs/usr/ports/devel/simavr/work/simavr-1.7'
*** Error code 1

Stop.
make: stopped in /usr/ports/devel/simavr
Received on Wed Jul 07 2021 - 07:51:01 UTC

Original text of this message