[package - main-arm64-default][databases/rocksdb] Failed for rocksdb-6.11.6 in build

From: <pkg-fallout_at_FreeBSD.org>
Date: Sat, 3 Jul 2021 05:44:52 GMT
You are receiving this mail as a port that you maintain
is failing to build on the FreeBSD package build server.
Please investigate the failure and submit a PR to fix
build.

Maintainer:     sunpoet_at_FreeBSD.org
Log URL:        http://ampere2.nyi.freebsd.org/data/main-arm64-default/p8656d375678d_s6329ca325e/logs/rocksdb-6.11.6.log
Build URL:      http://ampere2.nyi.freebsd.org/build.html?mastername=main-arm64-default&build=p8656d375678d_s6329ca325e
Log:

=>> Building databases/rocksdb
build started at Sat Jul  3 05:27:03 UTC 2021
port directory: /usr/ports/databases/rocksdb
package name: rocksdb-6.11.6
building for: FreeBSD main-arm64-default-job-07 14.0-CURRENT FreeBSD 14.0-CURRENT 1400024 arm64
maintained by: sunpoet_at_FreeBSD.org
Makefile ident: 
Poudriere version: 3.2.8-8-gaf08dbda
Host OSVERSION: 1400008
Jail OSVERSION: 1400024
Job Id: 07




!!! Jail is newer than host. (Jail: 1400024, Host: 1400008) !!!
!!! This is not supported. !!!
!!! Host kernel must be same or newer than jail. !!!
!!! Expect build failures. !!!



---Begin Environment---
SHELL=/bin/csh
OSVERSION=1400024
UNAME_v=FreeBSD 14.0-CURRENT 1400024
UNAME_r=14.0-CURRENT
BLOCKSIZE=K
MAIL=/var/mail/root
MM_CHARSET=UTF-8
LANG=C.UTF-8
STATUS=1
HOME=/root
PATH=/sbin:/bin:/usr/sbin:/usr/bin:/usr/local/sbin:/usr/local/bin:/root/bin
LOCALBASE=/usr/local
USER=root
LIBEXECPREFIX=/usr/local/libexec/poudriere
POUDRIERE_VERSION=3.2.8-8-gaf08dbda
MASTERMNT=/usr/local/poudriere/data/.m/main-arm64-default/ref
POUDRIERE_BUILD_TYPE=bulk
PACKAGE_BUILDING=yes
SAVED_TERM=
PWD=/usr/local/poudriere/data/.m/main-arm64-default/ref/.p/pool
P_PORTS_FEATURES=FLAVORS SELECTED_OPTIONS
MASTERNAME=main-arm64-default
SCRIPTPREFIX=/usr/local/share/poudriere
OLDPWD=/usr/local/poudriere/data/.m/main-arm64-default/ref/.p
SCRIPTPATH=/usr/local/share/poudriere/bulk.sh
POUDRIEREPATH=/usr/local/bin/poudriere
---End Environment---

---Begin Poudriere Port Flags/Env---
PORT_FLAGS=
PKGENV=
FLAVOR=
DEPENDS_ARGS=
MAKE_ARGS=
---End Poudriere Port Flags/Env---

---Begin OPTIONS List---
===> The following configuration options are available for rocksdb-6.11.6:
     DEBUG=off: Build with debugging support
     LZ4=on: LZ4 compression support
     ZSTD=off: Zstandard compression support
===> Use 'make config' to modify these settings
---End OPTIONS List---

--MAINTAINER--
sunpoet_at_FreeBSD.org
--End MAINTAINER--

--CONFIGURE_ARGS--
make_config.mk
--End CONFIGURE_ARGS--

--CONFIGURE_ENV--
PORTABLE=0 ROCKSDB_ROOT=/wrkdirs/usr/ports/databases/rocksdb/work/rocksdb-6.11.6 MAKE=gmake ac_cv_path_PERL=/usr/local/bin/perl ac_cv_path_PERL_PATH=/usr/local/bin/perl  PERL_USE_UNSAFE_INC=1 XDG_DATA_HOME=/wrkdirs/usr/ports/databases/rocksdb/work  XDG_CONFIG_HOME=/wrkdirs/usr/ports/databases/rocksdb/work  HOME=/wrkdirs/usr/ports/databases/rocksdb/work TMPDIR="/tmp" PATH=/wrkdirs/usr/ports/databases/rocksdb/work/.bin:/sbin:/bin:/usr/sbin:/usr/bin:/usr/local/sbin:/usr/local/bin:/root/bin SHELL=/bin/sh CONFIG_SHELL=/bin/sh CMAKE_PREFIX_PATH="/usr/local"
--End CONFIGURE_ENV--

--MAKE_ENV--
CXX=c++ INSTALL_PATH=/wrkdirs/usr/ports/databases/rocksdb/work/stage/usr/local USE_RTTI=1 DEBUG_LEVEL=0 ROCKSDB_DISABLE_ZSTD=yes PERL_USE_UNSAFE_INC=1 XDG_DATA_HOME=/wrkdirs/usr/ports/databases/rocksdb/work  XDG_CONFIG_HOME=/wrkdirs/usr/ports/databases/rocksdb/work  HOME=/wrkdirs/usr/ports/databases/rocksdb/work TMPDIR="/tmp" PATH=/wrkdirs/usr/ports/databases/rocksdb/work/.bin:/sbin:/bin:/usr/sbin:/usr/bin:/usr/local/sbin:/usr/local/bin:/root/bin NO_PIE=yes MK_DEBUG_FILES=no MK_KERNEL_SYMBOLS=no SHELL=/bin/sh NO_LINT=YES PREFIX=/usr/local  LOCALBASE=/usr/local  CC="cc" CFLAGS="-O2 -pipe  -DOS_FREEBSD -fstack-protector-strong -isystem /usr/local/include -fno-strict-aliasing "  CPP="cpp" CPPFLAGS="-isystem /usr/local/include"  LDFLAGS=" -fstack-protector-strong -L/usr/local/lib " LIBS=""  CXX="c++" CXXFLAGS="-O2 -pipe  -DOS_FREEBSD -fstack-protector-strong -isystem /usr/local/include -fno-strict-aliasing   -Wno-inconsistent-missing-override -Wno-unused-variable -Wno-error=shadow -isyst
 em /usr/local/include -std=c++11 "  MANPREFIX="/usr/local" BSD_INSTALL_PROGRAM="install  -s -m 555"  BSD_INSTALL_LIB="install  -s -m 0644"  BSD_INSTALL_SCRIPT="install  -m 555"  BSD_INSTALL_DATA="install  -m 0644"  BSD_INSTALL_MAN="install  -m 444"
--End MAKE_ENV--

--PLIST_SUB--
PORTVERSION=6.11.6 SHLIB_VER=6.11 LITE="_at_comment " OSREL=14.0 PREFIX=%D LOCALBASE=/usr/local  RESETPREFIX=/usr/local LIB32DIR=lib PERL_VERSION=5.32.1  PERL_VER=5.32  PERL5_MAN1=lib/perl5/site_perl/man/man1  PERL5_MAN3=lib/perl5/site_perl/man/man3  SITE_PERL=lib/perl5/site_perl  SITE_ARCH=lib/perl5/site_perl/mach/5.32 DOCSDIR="share/doc/rocksdb"  EXAMPLESDIR="share/examples/rocksdb"  DATADIR="share/rocksdb"  WWWDIR="www/rocksdb"  ETCDIR="etc/rocksdb"
--End PLIST_SUB--

--SUB_LIST--
PREFIX=/usr/local LOCALBASE=/usr/local  DATADIR=/usr/local/share/rocksdb DOCSDIR=/usr/local/share/doc/rocksdb EXAMPLESDIR=/usr/local/share/examples/rocksdb  WWWDIR=/usr/local/www/rocksdb ETCDIR=/usr/local/etc/rocksdb
--End SUB_LIST--

---Begin make.conf---
USE_PACKAGE_DEPENDS=yes
BATCH=yes
WRKDIRPREFIX=/wrkdirs
PORTSDIR=/usr/ports
PACKAGES=/packages
DISTDIR=/distfiles
PACKAGE_BUILDING=yes
PACKAGE_BUILDING_FLAVORS=yes
#### /usr/local/etc/poudriere.d/make.conf ####
# XXX: We really need this but cannot use it while 'make checksum' does not
# try the next mirror on checksum failure.  It currently retries the same
# failed mirror and then fails rather then trying another.  It *does*
# try the next if the size is mismatched though.
#MASTER_SITE_FREEBSD=yes
# Build ALLOW_MAKE_JOBS_PACKAGES with 2 jobs
MAKE_JOBS_NUMBER=2
#### /usr/ports/Mk/Scripts/ports_env.sh ####
_CCVERSION_921dbbb2=FreeBSD clang version 12.0.1 (git_at_github.com:llvm/llvm-project.git llvmorg-12.0.1-rc2-0-ge7dac564cd0e) Target: aarch64-unknown-freebsd14.0 Thread model: posix InstalledDir: /usr/bin
_ALTCCVERSION_921dbbb2=none
_CXXINTERNAL_acaad9ca=FreeBSD clang version 12.0.1 (git_at_github.com:llvm/llvm-project.git llvmorg-12.0.1-rc2-0-ge7dac564cd0e) Target: aarch64-unknown-freebsd14.0 Thread model: posix InstalledDir: /usr/bin "/usr/bin/ld" "--eh-frame-hdr" "-dynamic-linker" "/libexec/ld-elf.so.1" "--enable-new-dtags" "-o" "a.out" "/usr/lib/crt1.o" "/usr/lib/crti.o" "/usr/lib/crtbegin.o" "-L/usr/lib" "/dev/null" "-lc++" "-lm" "-lgcc" "--as-needed" "-lgcc_s" "--no-as-needed" "-lc" "-lgcc" "--as-needed" "-lgcc_s" "--no-as-needed" "/usr/lib/crtend.o" "/usr/lib/crtn.o"
CC_OUTPUT_921dbbb2_58173849=yes
CC_OUTPUT_921dbbb2_9bdba57c=yes
CC_OUTPUT_921dbbb2_6a4fe7f5=yes
CC_OUTPUT_921dbbb2_6bcac02b=yes
CC_OUTPUT_921dbbb2_67d20829=yes
CC_OUTPUT_921dbbb2_bfa62e83=yes
CC_OUTPUT_921dbbb2_f0b4d593=yes
CC_OUTPUT_921dbbb2_308abb44=yes
CC_OUTPUT_921dbbb2_f00456e5=yes
CC_OUTPUT_921dbbb2_65ad290d=yes
CC_OUTPUT_921dbbb2_f2776b26=yes
CC_OUTPUT_921dbbb2_b2657cc3=yes
CC_OUTPUT_921dbbb2_380987f7=yes
CC_OUTPUT_921dbbb2_160933ec=yes
CC_OUTPUT_921dbbb2_fb62803b=yes
_OBJC_CCVERSION_921dbbb2=FreeBSD clang version 12.0.1 (git_at_github.com:llvm/llvm-project.git llvmorg-12.0.1-rc2-0-ge7dac564cd0e) Target: aarch64-unknown-freebsd14.0 Thread model: posix InstalledDir: /usr/bin
_OBJC_ALTCCVERSION_921dbbb2=none
ARCH=aarch64
OPSYS=FreeBSD
_OSRELEASE=14.0-CURRENT
OSREL=14.0
OSVERSION=1400024
PYTHONBASE=/usr/local
CONFIGURE_MAX_CMD_LEN=524288
HAVE_PORTS_ENV=1
#### Misc Poudriere ####
GID=0
UID=0
---End make.conf---
--Resource limits--
cpu time               (seconds, -t)  unlimited
file size           (512-blocks, -f)  unlimited
data seg size           (kbytes, -d)  1048576
stack size              (kbytes, -s)  1048576
core file size      (512-blocks, -c)  unlimited
max memory size         (kbytes, -m)  unlimited
locked memory           (kbytes, -l)  unlimited
max user processes              (-u)  89999
open files                      (-n)  1024
virtual mem size        (kbytes, -v)  unlimited
swap limit              (kbytes, -w)  unlimited
socket buffer size       (bytes, -b)  unlimited
pseudo-terminals                (-p)  unlimited
kqueues                         (-k)  unlimited
umtx shared locks               (-o)  unlimited
--End resource limits--
=======================<phase: check-sanity   >============================
===>  License APACHE20 GPLv2 accepted by the user
===========================================================================
=======================<phase: pkg-depends    >============================
===>   rocksdb-6.11.6 depends on file: /usr/local/sbin/pkg - not found
===>   Installing existing package /packages/All/pkg-1.16.3.txz
[main-arm64-default-job-07] Installing pkg-1.16.3...
[main-arm64-default-job-07] Extracting pkg-1.16.3: .......... done
===>   rocksdb-6.11.6 depends on file: /usr/local/sbin/pkg - found
===>   Returning to build of rocksdb-6.11.6
===========================================================================
=======================<phase: fetch-depends  >============================
===========================================================================
=======================<phase: fetch          >============================
===>  License APACHE20 GPLv2 accepted by the user
===> Fetching all distfiles required by rocksdb-6.11.6 for building
===========================================================================
=======================<phase: checksum       >============================
===>  License APACHE20 GPLv2 accepted by the user
===> Fetching all distfiles required by rocksdb-6.11.6 for building
=> SHA256 Checksum OK for facebook-rocksdb-v6.11.6_GH0.tar.gz.
=> SHA256 Checksum OK for b937be377901afa32357b60eebbee80f14087180.patch.
===========================================================================
=======================<phase: extract-depends>============================
===========================================================================
=======================<phase: extract        >============================
===>  License APACHE20 GPLv2 accepted by the user
===> Fetching all distfiles required by rocksdb-6.11.6 for building
===>  Extracting for rocksdb-6.11.6
=> SHA256 Checksum OK for facebook-rocksdb-v6.11.6_GH0.tar.gz.
=> SHA256 Checksum OK for b937be377901afa32357b60eebbee80f14087180.patch.
===========================================================================
=======================<phase: patch-depends  >============================
===========================================================================
=======================<phase: patch          >============================
===>  Patching for rocksdb-6.11.6
===>  Applying distribution patches for rocksdb-6.11.6
===>  Applying FreeBSD patches for rocksdb-6.11.6 from /usr/ports/databases/rocksdb/files
===========================================================================
=======================<phase: build-depends  >============================
===>   rocksdb-6.11.6 depends on executable: bash - not found
<snip>
  CC       shared-objects/db/blob/blob_log_writer.o
  CC       shared-objects/db/builder.o
  CC       shared-objects/db/c.o
  CC       shared-objects/db/column_family.o
  CC       shared-objects/db/compacted_db_impl.o
  CC       shared-objects/db/compaction/compaction.o
  CC       shared-objects/db/compaction/compaction_iterator.o
  CC       shared-objects/db/compaction/compaction_job.o
  CC       shared-objects/db/compaction/compaction_picker.o
  CC       shared-objects/db/compaction/compaction_picker_fifo.o
  CC       shared-objects/db/compaction/compaction_picker_level.o
  CC       shared-objects/db/compaction/compaction_picker_universal.o
  CC       shared-objects/db/convenience.o
  CC       shared-objects/db/db_filesnapshot.o
  CC       shared-objects/db/db_impl/db_impl.o
  CC       shared-objects/db/db_impl/db_impl_compaction_flush.o
  CC       shared-objects/db/db_impl/db_impl_debug.o
  CC       shared-objects/db/db_impl/db_impl_experimental.o
  CC       shared-objects/db/db_impl/db_impl_files.o
  CC       shared-objects/db/db_impl/db_impl_open.o
  CC       shared-objects/db/db_impl/db_impl_readonly.o
  CC       shared-objects/db/db_impl/db_impl_secondary.o
  CC       shared-objects/db/db_impl/db_impl_write.o
  CC       shared-objects/db/db_info_dumper.o
  CC       shared-objects/db/db_iter.o
  CC       shared-objects/db/dbformat.o
  CC       shared-objects/db/error_handler.o
  CC       shared-objects/db/event_helpers.o
  CC       shared-objects/db/experimental.o
  CC       shared-objects/db/external_sst_file_ingestion_job.o
  CC       shared-objects/db/file_indexer.o
  CC       shared-objects/db/flush_job.o
  CC       shared-objects/db/flush_scheduler.o
  CC       shared-objects/db/forward_iterator.o
  CC       shared-objects/db/import_column_family_job.o
  CC       shared-objects/db/internal_stats.o
  CC       shared-objects/db/logs_with_prep_tracker.o
  CC       shared-objects/db/log_reader.o
  CC       shared-objects/db/log_writer.o
  CC       shared-objects/db/malloc_stats.o
  CC       shared-objects/db/memtable.o
  CC       shared-objects/db/memtable_list.o
  CC       shared-objects/db/merge_helper.o
  CC       shared-objects/db/merge_operator.o
  CC       shared-objects/db/range_del_aggregator.o
  CC       shared-objects/db/range_tombstone_fragmenter.o
  CC       shared-objects/db/repair.o
  CC       shared-objects/db/snapshot_impl.o
  CC       shared-objects/db/table_cache.o
  CC       shared-objects/db/table_properties_collector.o
  CC       shared-objects/db/transaction_log_impl.o
  CC       shared-objects/db/trim_history_scheduler.o
  CC       shared-objects/db/version_builder.o
  CC       shared-objects/db/version_edit.o
  CC       shared-objects/db/version_edit_handler.o
  CC       shared-objects/db/version_set.o
  CC       shared-objects/db/wal_manager.o
  CC       shared-objects/db/write_batch.o
  CC       shared-objects/db/write_batch_base.o
  CC       shared-objects/db/write_controller.o
  CC       shared-objects/db/write_thread.o
  CC       shared-objects/env/env.o
  CC       shared-objects/env/env_chroot.o
  CC       shared-objects/env/env_encryption.o
  CC       shared-objects/env/env_hdfs.o
  CC       shared-objects/env/env_posix.o
  CC       shared-objects/env/file_system.o
  CC       shared-objects/env/fs_posix.o
  CC       shared-objects/env/io_posix.o
  CC       shared-objects/env/mock_env.o
  CC       shared-objects/file/delete_scheduler.o
  CC       shared-objects/file/file_prefetch_buffer.o
  CC       shared-objects/file/file_util.o
  CC       shared-objects/file/filename.o
  CC       shared-objects/file/random_access_file_reader.o
  CC       shared-objects/file/read_write_util.o
  CC       shared-objects/file/readahead_raf.o
  CC       shared-objects/file/sequence_file_reader.o
  CC       shared-objects/file/sst_file_manager_impl.o
  CC       shared-objects/file/writable_file_writer.o
  CC       shared-objects/logging/auto_roll_logger.o
  CC       shared-objects/logging/event_logger.o
  CC       shared-objects/logging/log_buffer.o
  CC       shared-objects/memory/arena.o
  CC       shared-objects/memory/concurrent_arena.o
  CC       shared-objects/memory/jemalloc_nodump_allocator.o
  CC       shared-objects/memory/memkind_kmem_allocator.o
  CC       shared-objects/memtable/alloc_tracker.o
  CC       shared-objects/memtable/hash_linklist_rep.o
  CC       shared-objects/memtable/hash_skiplist_rep.o
  CC       shared-objects/memtable/skiplistrep.o
  CC       shared-objects/memtable/vectorrep.o
  CC       shared-objects/memtable/write_buffer_manager.o
  CC       shared-objects/monitoring/histogram.o
  CC       shared-objects/monitoring/histogram_windowing.o
  CC       shared-objects/monitoring/in_memory_stats_history.o
  CC       shared-objects/monitoring/instrumented_mutex.o
  CC       shared-objects/monitoring/iostats_context.o
  CC       shared-objects/monitoring/perf_context.o
  CC       shared-objects/monitoring/perf_level.o
  CC       shared-objects/monitoring/persistent_stats_history.o
  CC       shared-objects/monitoring/statistics.o
  CC       shared-objects/monitoring/thread_status_impl.o
  CC       shared-objects/monitoring/thread_status_updater.o
  CC       shared-objects/monitoring/thread_status_updater_debug.o
  CC       shared-objects/monitoring/thread_status_util.o
  CC       shared-objects/monitoring/thread_status_util_debug.o
  CC       shared-objects/options/cf_options.o
  CC       shared-objects/options/db_options.o
  CC       shared-objects/options/options.o
  CC       shared-objects/options/options_helper.o
  CC       shared-objects/options/options_parser.o
  CC       shared-objects/port/port_posix.o
  CC       shared-objects/port/stack_trace.o
  CC       shared-objects/table/adaptive/adaptive_table_factory.o
  CC       shared-objects/table/block_based/binary_search_index_reader.o
  CC       shared-objects/table/block_based/block.o
  CC       shared-objects/table/block_based/block_based_filter_block.o
  CC       shared-objects/table/block_based/block_based_table_builder.o
  CC       shared-objects/table/block_based/block_based_table_factory.o
  CC       shared-objects/table/block_based/block_based_table_iterator.o
  CC       shared-objects/table/block_based/block_based_table_reader.o
  CC       shared-objects/table/block_based/block_builder.o
  CC       shared-objects/table/block_based/block_prefetcher.o
  CC       shared-objects/table/block_based/block_prefix_index.o
  CC       shared-objects/table/block_based/data_block_hash_index.o
  CC       shared-objects/table/block_based/data_block_footer.o
  CC       shared-objects/table/block_based/filter_block_reader_common.o
  CC       shared-objects/table/block_based/filter_policy.o
  CC       shared-objects/table/block_based/flush_block_policy.o
  CC       shared-objects/table/block_based/full_filter_block.o
  CC       shared-objects/table/block_based/hash_index_reader.o
  CC       shared-objects/table/block_based/index_builder.o
  CC       shared-objects/table/block_based/index_reader_common.o
  CC       shared-objects/table/block_based/parsed_full_filter_block.o
  CC       shared-objects/table/block_based/partitioned_filter_block.o
  CC       shared-objects/table/block_based/partitioned_index_iterator.o
  CC       shared-objects/table/block_based/partitioned_index_reader.o
  CC       shared-objects/table/block_based/reader_common.o
  CC       shared-objects/table/block_based/uncompression_dict_reader.o
  CC       shared-objects/table/block_fetcher.o
  CC       shared-objects/table/cuckoo/cuckoo_table_builder.o
  CC       shared-objects/table/cuckoo/cuckoo_table_factory.o
  CC       shared-objects/table/cuckoo/cuckoo_table_reader.o
  CC       shared-objects/table/format.o
  CC       shared-objects/table/get_context.o
  CC       shared-objects/table/iterator.o
  CC       shared-objects/table/merging_iterator.o
  CC       shared-objects/table/meta_blocks.o
  CC       shared-objects/table/persistent_cache_helper.o
  CC       shared-objects/table/plain/plain_table_bloom.o
  CC       shared-objects/table/plain/plain_table_builder.o
  CC       shared-objects/table/plain/plain_table_factory.o
  CC       shared-objects/table/plain/plain_table_index.o
  CC       shared-objects/table/plain/plain_table_key_coding.o
  CC       shared-objects/table/plain/plain_table_reader.o
  CC       shared-objects/table/sst_file_reader.o
  CC       shared-objects/table/sst_file_writer.o
  CC       shared-objects/table/table_properties.o
  CC       shared-objects/table/two_level_iterator.o
  CC       shared-objects/test_util/sync_point.o
  CC       shared-objects/test_util/sync_point_impl.o
  CC       shared-objects/test_util/transaction_test_util.o
  CC       shared-objects/tools/dump/db_dump_tool.o
  CC       shared-objects/trace_replay/trace_replay.o
  CC       shared-objects/trace_replay/block_cache_tracer.o
  CC       shared-objects/util/build_version.o
  CC       shared-objects/util/coding.o
  CC       shared-objects/util/compaction_job_stats_impl.o
  CC       shared-objects/util/comparator.o
  CC       shared-objects/util/compression_context_cache.o
  CC       shared-objects/util/concurrent_task_limiter_impl.o
  CC       shared-objects/util/crc32c.o
  CC       shared-objects/util/dynamic_bloom.o
util/crc32c.cc:521:18: error: use of undeclared identifier 'isSSE42'
  has_fast_crc = isSSE42();
                 ^
util/crc32c.cc:1251:7: error: use of undeclared identifier 'isSSE42'
  if (isSSE42()) {
      ^
util/crc32c.cc:1252:9: error: use of undeclared identifier 'isPCLMULQDQ'
    if (isPCLMULQDQ()) {
        ^
util/crc32c.cc:1256:23: error: use of undeclared identifier 'Fast_CRC32'
    return ExtendImpl<Fast_CRC32>; // Fast_CRC32 will check HAVE_SSE42 itself
                      ^
util/crc32c.cc:1260:25: error: use of undeclared identifier 'Fast_CRC32'
      return ExtendImpl<Fast_CRC32>;
                        ^
5 errors generated.
gmake[1]: *** [Makefile:834: shared-objects/util/crc32c.o] Error 1
gmake[1]: *** Waiting for unfinished jobs....
gmake[1]: Leaving directory '/wrkdirs/usr/ports/databases/rocksdb/work/rocksdb-6.11.6'
===> Compilation failed unexpectedly.
Try to set MAKE_JOBS_UNSAFE=yes and rebuild before reporting the failure to
the maintainer.
*** Error code 1

Stop.
make: stopped in /usr/ports/databases/rocksdb
Received on Sat Jul 03 2021 - 05:44:52 UTC

Original text of this message