[package - main-i386-default][devel/rkcommon] Failed for rkcommon-1.8.0 in build

From: <pkg-fallout_at_FreeBSD.org>
Date: Thu, 2 Dec 2021 01:54:16 GMT
You are receiving this mail as a port that you maintain
is failing to build on the FreeBSD package build server.
Please investigate the failure and submit a PR to fix
build.

Maintainer:     yuri_at_FreeBSD.org
Log URL:        http://beefy17.nyi.freebsd.org/data/main-i386-default/pb8c4bfe660b3_s610d908f8a/logs/rkcommon-1.8.0.log
Build URL:      http://beefy17.nyi.freebsd.org/build.html?mastername=main-i386-default&build=pb8c4bfe660b3_s610d908f8a
Log:

=>> Building devel/rkcommon
build started at Thu Dec  2 01:54:03 UTC 2021
port directory: /usr/ports/devel/rkcommon
package name: rkcommon-1.8.0
building for: FreeBSD main-i386-default-job-09 14.0-CURRENT FreeBSD 14.0-CURRENT 1400043 i386
maintained by: yuri_at_FreeBSD.org
Makefile ident: 
Poudriere version: 3.2.8-21-g883afb07
Host OSVERSION: 1400042
Jail OSVERSION: 1400043
Job Id: 09




!!! Jail is newer than host. (Jail: 1400043, Host: 1400042) !!!
!!! This is not supported. !!!
!!! Host kernel must be same or newer than jail. !!!
!!! Expect build failures. !!!



---Begin Environment---
SHELL=/bin/sh
UNAME_p=i386
UNAME_m=i386
OSVERSION=1400043
UNAME_v=FreeBSD 14.0-CURRENT 1400043
UNAME_r=14.0-CURRENT
BLOCKSIZE=K
MAIL=/var/mail/root
MM_CHARSET=UTF-8
LANG=C.UTF-8
STATUS=1
HOME=/root
PATH=/sbin:/bin:/usr/sbin:/usr/bin:/usr/local/sbin:/usr/local/bin:/root/bin
LOCALBASE=/usr/local
USER=root
LIBEXECPREFIX=/usr/local/libexec/poudriere
POUDRIERE_VERSION=3.2.8-21-g883afb07
MASTERMNT=/usr/local/poudriere/data/.m/main-i386-default/ref
POUDRIERE_BUILD_TYPE=bulk
PACKAGE_BUILDING=yes
SAVED_TERM=
PWD=/usr/local/poudriere/data/.m/main-i386-default/ref/.p/pool
P_PORTS_FEATURES=FLAVORS SELECTED_OPTIONS
MASTERNAME=main-i386-default
SCRIPTPREFIX=/usr/local/share/poudriere
OLDPWD=/usr/local/poudriere/data/.m/main-i386-default/ref/.p
SCRIPTPATH=/usr/local/share/poudriere/bulk.sh
POUDRIEREPATH=/usr/local/bin/poudriere
---End Environment---

---Begin Poudriere Port Flags/Env---
PORT_FLAGS=
PKGENV=
FLAVOR=
DEPENDS_ARGS=
MAKE_ARGS=
---End Poudriere Port Flags/Env---

---Begin OPTIONS List---
---End OPTIONS List---

--MAINTAINER--
yuri_at_FreeBSD.org
--End MAINTAINER--

--CONFIGURE_ARGS--

--End CONFIGURE_ARGS--

--CONFIGURE_ENV--
XDG_DATA_HOME=/wrkdirs/usr/ports/devel/rkcommon/work  XDG_CONFIG_HOME=/wrkdirs/usr/ports/devel/rkcommon/work  XDG_CACHE_HOME=/wrkdirs/usr/ports/devel/rkcommon/work/.cache  HOME=/wrkdirs/usr/ports/devel/rkcommon/work TMPDIR="/tmp" PATH=/wrkdirs/usr/ports/devel/rkcommon/work/.bin:/sbin:/bin:/usr/sbin:/usr/bin:/usr/local/sbin:/usr/local/bin:/root/bin SHELL=/bin/sh CONFIG_SHELL=/bin/sh
--End CONFIGURE_ENV--

--MAKE_ENV--
NINJA_STATUS="[%p %s/%t] " XDG_DATA_HOME=/wrkdirs/usr/ports/devel/rkcommon/work  XDG_CONFIG_HOME=/wrkdirs/usr/ports/devel/rkcommon/work  XDG_CACHE_HOME=/wrkdirs/usr/ports/devel/rkcommon/work/.cache  HOME=/wrkdirs/usr/ports/devel/rkcommon/work TMPDIR="/tmp" PATH=/wrkdirs/usr/ports/devel/rkcommon/work/.bin:/sbin:/bin:/usr/sbin:/usr/bin:/usr/local/sbin:/usr/local/bin:/root/bin NO_PIE=yes MK_DEBUG_FILES=no MK_KERNEL_SYMBOLS=no SHELL=/bin/sh NO_LINT=YES DESTDIR=/wrkdirs/usr/ports/devel/rkcommon/work/stage PREFIX=/usr/local  LOCALBASE=/usr/local  CC="cc" CFLAGS="-O2 -pipe  -fstack-protector-strong -fno-strict-aliasing "  CPP="cpp" CPPFLAGS=""  LDFLAGS=" -fstack-protector-strong " LIBS=""  CXX="c++" CXXFLAGS="-O2 -pipe -fstack-protector-strong -fno-strict-aliasing  "  MANPREFIX="/usr/local" BSD_INSTALL_PROGRAM="install  -s -m 555"  BSD_INSTALL_LIB="install  -s -m 0644"  BSD_INSTALL_SCRIPT="install  -m 555"  BSD_INSTALL_DATA="install  -m 0644"  BSD_INSTALL_MAN="install  -m 444"
--End MAKE_ENV--

--PLIST_SUB--
CMAKE_BUILD_TYPE="release" OSREL=14.0 PREFIX=%D LOCALBASE=/usr/local  RESETPREFIX=/usr/local LIB32DIR=lib DOCSDIR="share/doc/rkcommon"  EXAMPLESDIR="share/examples/rkcommon"  DATADIR="share/rkcommon"  WWWDIR="www/rkcommon"  ETCDIR="etc/rkcommon"
--End PLIST_SUB--

--SUB_LIST--
PREFIX=/usr/local LOCALBASE=/usr/local  DATADIR=/usr/local/share/rkcommon DOCSDIR=/usr/local/share/doc/rkcommon EXAMPLESDIR=/usr/local/share/examples/rkcommon  WWWDIR=/usr/local/www/rkcommon ETCDIR=/usr/local/etc/rkcommon
--End SUB_LIST--

---Begin make.conf---
USE_PACKAGE_DEPENDS=yes
BATCH=yes
WRKDIRPREFIX=/wrkdirs
PORTSDIR=/usr/ports
PACKAGES=/packages
DISTDIR=/distfiles
PACKAGE_BUILDING=yes
PACKAGE_BUILDING_FLAVORS=yes
MACHINE=i386
MACHINE_ARCH=i386
ARCH=${MACHINE_ARCH}
#### /usr/local/etc/poudriere.d/make.conf ####
# XXX: We really need this but cannot use it while 'make checksum' does not
# try the next mirror on checksum failure.  It currently retries the same
# failed mirror and then fails rather then trying another.  It *does*
# try the next if the size is mismatched though.
#MASTER_SITE_FREEBSD=yes
# Build ALLOW_MAKE_JOBS_PACKAGES with 2 jobs
MAKE_JOBS_NUMBER=2
#### /usr/ports/Mk/Scripts/ports_env.sh ####
_CCVERSION_921dbbb2=FreeBSD clang version 13.0.0 (git_at_github.com:llvm/llvm-project.git llvmorg-13.0.0-0-gd7b669b3a303) Target: i386-unknown-freebsd14.0 Thread model: posix InstalledDir: /usr/bin
_ALTCCVERSION_921dbbb2=none
_CXXINTERNAL_acaad9ca=FreeBSD clang version 13.0.0 (git_at_github.com:llvm/llvm-project.git llvmorg-13.0.0-0-gd7b669b3a303) Target: i386-unknown-freebsd14.0 Thread model: posix InstalledDir: /usr/bin "/usr/bin/ld" "--eh-frame-hdr" "-dynamic-linker" "/libexec/ld-elf.so.1" "--hash-style=both" "--enable-new-dtags" "-m" "elf_i386_fbsd" "-o" "a.out" "/usr/lib/crt1.o" "/usr/lib/crti.o" "/usr/lib/crtbegin.o" "-L/usr/lib" "/dev/null" "-lc++" "-lm" "-lgcc" "--as-needed" "-lgcc_s" "--no-as-needed" "-lc" "-lgcc" "--as-needed" "-lgcc_s" "--no-as-needed" "/usr/lib/crtend.o" "/usr/lib/crtn.o"
CC_OUTPUT_921dbbb2_58173849=yes
CC_OUTPUT_921dbbb2_9bdba57c=yes
CC_OUTPUT_921dbbb2_6a4fe7f5=yes
CC_OUTPUT_921dbbb2_6bcac02b=yes
CC_OUTPUT_921dbbb2_67d20829=yes
CC_OUTPUT_921dbbb2_bfa62e83=yes
CC_OUTPUT_921dbbb2_f0b4d593=yes
CC_OUTPUT_921dbbb2_308abb44=yes
CC_OUTPUT_921dbbb2_f00456e5=yes
CC_OUTPUT_921dbbb2_65ad290d=yes
CC_OUTPUT_921dbbb2_f2776b26=yes
CC_OUTPUT_921dbbb2_b2657cc3=yes
CC_OUTPUT_921dbbb2_380987f7=yes
CC_OUTPUT_921dbbb2_160933ec=yes
CC_OUTPUT_921dbbb2_fb62803b=yes
_OBJC_CCVERSION_921dbbb2=FreeBSD clang version 13.0.0 (git_at_github.com:llvm/llvm-project.git llvmorg-13.0.0-0-gd7b669b3a303) Target: i386-unknown-freebsd14.0 Thread model: posix InstalledDir: /usr/bin
_OBJC_ALTCCVERSION_921dbbb2=none
ARCH=i386
OPSYS=FreeBSD
_OSRELEASE=14.0-CURRENT
OSREL=14.0
OSVERSION=1400043
PYTHONBASE=/usr/local
CONFIGURE_MAX_CMD_LEN=524288
HAVE_PORTS_ENV=1
#### Misc Poudriere ####
GID=0
UID=0
---End make.conf---
--Resource limits--
cpu time               (seconds, -t)  unlimited
file size           (512-blocks, -f)  unlimited
data seg size           (kbytes, -d)  524288
stack size              (kbytes, -s)  65536
core file size      (512-blocks, -c)  unlimited
max memory size         (kbytes, -m)  unlimited
locked memory           (kbytes, -l)  unlimited
max user processes              (-u)  89999
open files                      (-n)  1024
virtual mem size        (kbytes, -v)  unlimited
swap limit              (kbytes, -w)  unlimited
socket buffer size       (bytes, -b)  unlimited
pseudo-terminals                (-p)  unlimited
kqueues                         (-k)  unlimited
umtx shared locks               (-o)  unlimited
--End resource limits--
=======================<phase: check-sanity   >============================
===>  License APACHE20 accepted by the user
===========================================================================
=======================<phase: pkg-depends    >============================
===>   rkcommon-1.8.0 depends on file: /usr/local/sbin/pkg - not found
===>   Installing existing package /packages/All/pkg-1.17.5.pkg
[main-i386-default-job-09] Installing pkg-1.17.5...
[main-i386-default-job-09] Extracting pkg-1.17.5: .......... done
===>   rkcommon-1.8.0 depends on file: /usr/local/sbin/pkg - found
===>   Returning to build of rkcommon-1.8.0
===========================================================================
=======================<phase: fetch-depends  >============================
===========================================================================
=======================<phase: fetch          >============================
===>  License APACHE20 accepted by the user
===> Fetching all distfiles required by rkcommon-1.8.0 for building
===========================================================================
=======================<phase: checksum       >============================
===>  License APACHE20 accepted by the user
===> Fetching all distfiles required by rkcommon-1.8.0 for building
=> SHA256 Checksum OK for ospray-rkcommon-v1.8.0_GH0.tar.gz.
===========================================================================
=======================<phase: extract-depends>============================
===========================================================================
=======================<phase: extract        >============================
===>  License APACHE20 accepted by the user
===> Fetching all distfiles required by rkcommon-1.8.0 for building
===>  Extracting for rkcommon-1.8.0
=> SHA256 Checksum OK for ospray-rkcommon-v1.8.0_GH0.tar.gz.
===========================================================================
=======================<phase: patch-depends  >============================
===========================================================================
=======================<phase: patch          >============================
===>  Patching for rkcommon-1.8.0
===========================================================================
=======================<phase: build-depends  >============================
===>   rkcommon-1.8.0 depends on file: /usr/local/bin/cmake - not found
===>   Installing existing package /packages/All/cmake-3.21.4_1.pkg
[main-i386-default-job-09] Installing cmake-3.21.4_1...
[main-i386-default-job-09] `-- Installing curl-7.80.0...
[main-i386-default-job-09] |   `-- Installing ca_root_nss-3.71...
<snip>
  * /usr/local/etc/ssl/cert.pem
  * /usr/local/openssl/cert.pem
===>   rkcommon-1.8.0 depends on file: /usr/local/bin/cmake - found
===>   Returning to build of rkcommon-1.8.0
===>   rkcommon-1.8.0 depends on executable: ninja - not found
===>   Installing existing package /packages/All/ninja-1.10.2,2.pkg
[main-i386-default-job-09] Installing ninja-1.10.2,2...
[main-i386-default-job-09] `-- Installing python38-3.8.12_1...
[main-i386-default-job-09] |   `-- Installing libffi-3.3_1...
[main-i386-default-job-09] |   `-- Extracting libffi-3.3_1: .......... done
[main-i386-default-job-09] |   `-- Installing mpdecimal-2.5.1...
[main-i386-default-job-09] |   `-- Extracting mpdecimal-2.5.1: .......... done
[main-i386-default-job-09] |   `-- Installing readline-8.1.1...
[main-i386-default-job-09] |   `-- Extracting readline-8.1.1: .......... done
[main-i386-default-job-09] `-- Extracting python38-3.8.12_1: .......... done
[main-i386-default-job-09] Extracting ninja-1.10.2,2: ........ done
=====
Message from python38-3.8.12_1:

--
Note that some standard Python modules are provided as separate ports
as they require additional dependencies. They are available as:

py38-gdbm       databases/py-gdbm_at_py38
py38-sqlite3    databases/py-sqlite3_at_py38
py38-tkinter    x11-toolkits/py-tkinter_at_py38
===>   rkcommon-1.8.0 depends on executable: ninja - found
===>   Returning to build of rkcommon-1.8.0
===========================================================================
=======================<phase: lib-depends    >============================
===>   rkcommon-1.8.0 depends on shared library: libtbb.so - not found
===>   Installing existing package /packages/All/onetbb-2021.4.0.pkg
[main-i386-default-job-09] Installing onetbb-2021.4.0...
[main-i386-default-job-09] `-- Installing hwloc2-2.5.0...
[main-i386-default-job-09] |   `-- Installing level-zero-1.6.2...
[main-i386-default-job-09] |   `-- Extracting level-zero-1.6.2: .......... done
[main-i386-default-job-09] |   `-- Installing libpciaccess-0.16...
[main-i386-default-job-09] |   | `-- Installing pciids-20211028...
[main-i386-default-job-09] |   | `-- Extracting pciids-20211028: ..... done
[main-i386-default-job-09] |   `-- Extracting libpciaccess-0.16: ......... done
[main-i386-default-job-09] |   `-- Installing libxml2-2.9.12...
[main-i386-default-job-09] |   `-- Extracting libxml2-2.9.12: .......... done
[main-i386-default-job-09] `-- Extracting hwloc2-2.5.0: .......... done
[main-i386-default-job-09] Extracting onetbb-2021.4.0: .......... done
===>   rkcommon-1.8.0 depends on shared library: libtbb.so - found (/usr/local/lib/libtbb.so)
===>   Returning to build of rkcommon-1.8.0
===========================================================================
=======================<phase: configure      >============================
===>  Configuring for rkcommon-1.8.0
===>  Performing out-of-source build
/bin/mkdir -p /wrkdirs/usr/ports/devel/rkcommon/work/.build
-- The CXX compiler identification is Clang 13.0.0
-- Detecting CXX compiler ABI info
-- Detecting CXX compiler ABI info - done
-- Check for working CXX compiler: /usr/bin/c++ - skipped
-- Detecting CXX compile features
-- Detecting CXX compile features - done
-- Looking for C++ include pthread.h
-- Looking for C++ include pthread.h - found
-- Found Threads: TRUE  
-- Configuring done
-- Generating done
CMake Warning:
  Manually-specified variables were not used by the project:

    CMAKE_COLOR_MAKEFILE
    CMAKE_CXX_FLAGS_DEBUG
    CMAKE_C_COMPILER
    CMAKE_C_FLAGS
    CMAKE_C_FLAGS_DEBUG
    CMAKE_C_FLAGS_RELEASE
    CMAKE_EXE_LINKER_FLAGS
    CMAKE_MODULE_LINKER_FLAGS
    CMAKE_VERBOSE_MAKEFILE


-- Build files have been written to: /wrkdirs/usr/ports/devel/rkcommon/work/.build
===========================================================================
=======================<phase: build          >============================
===>  Building for rkcommon-1.8.0
[  7% 2/14] /usr/bin/c++ -DRKCOMMON_TASKING_TBB -Drkcommon_EXPORTS -I/wrkdirs/usr/ports/devel/rkcommon/work/rkcommon-1.8.0 -I/wrkdirs/usr/ports/devel/rkcommon/work/.build -I/wrkdirs/usr/ports/devel/rkcommon/work/rkcommon-1.8.0/rkcommon -isystem /usr/local/include -O2 -pipe -fstack-protector-strong -fno-strict-aliasing -O2 -pipe -fstack-protector-strong -fno-strict-aliasing -fPIC -std=c++11 -MD -MT rkcommon/CMakeFiles/rkcommon.dir/common.cpp.o -MF rkcommon/CMakeFiles/rkcommon.dir/common.cpp.o.d -o rkcommon/CMakeFiles/rkcommon.dir/common.cpp.o -c /wrkdirs/usr/ports/devel/rkcommon/work/rkcommon-1.8.0/rkcommon/common.cpp
In file included from /wrkdirs/usr/ports/devel/rkcommon/work/rkcommon-1.8.0/rkcommon/common.cpp:4:
In file included from /wrkdirs/usr/ports/devel/rkcommon/work/rkcommon-1.8.0/rkcommon/common.h:7:
/wrkdirs/usr/ports/devel/rkcommon/work/rkcommon-1.8.0/rkcommon/platform.h:53:9: warning: '__aligned' macro redefined [-Wmacro-redefined]
#define __aligned(...) __attribute__((aligned(__VA_ARGS__)))
        ^
/usr/include/sys/cdefs.h:219:9: note: previous definition is here
#define __aligned(x)    __attribute__((__aligned__(x)))
        ^
/wrkdirs/usr/ports/devel/rkcommon/work/rkcommon-1.8.0/rkcommon/common.cpp:93:41: warning: format specifies type 'unsigned long' but the argument has type 'size_t' (aka 'unsigned int') [-Wformat]
      osp_snprintf(result, 1000, "%lu", s);
                                  ~~~   ^
                                  %zu
2 warnings generated.
[ 14% 3/14] /usr/bin/c++ -DRKCOMMON_TASKING_TBB -Drkcommon_EXPORTS -I/wrkdirs/usr/ports/devel/rkcommon/work/rkcommon-1.8.0 -I/wrkdirs/usr/ports/devel/rkcommon/work/.build -I/wrkdirs/usr/ports/devel/rkcommon/work/rkcommon-1.8.0/rkcommon -isystem /usr/local/include -O2 -pipe -fstack-protector-strong -fno-strict-aliasing -O2 -pipe -fstack-protector-strong -fno-strict-aliasing -fPIC -std=c++11 -MD -MT rkcommon/CMakeFiles/rkcommon.dir/memory/malloc.cpp.o -MF rkcommon/CMakeFiles/rkcommon.dir/memory/malloc.cpp.o.d -o rkcommon/CMakeFiles/rkcommon.dir/memory/malloc.cpp.o -c /wrkdirs/usr/ports/devel/rkcommon/work/rkcommon-1.8.0/rkcommon/memory/malloc.cpp
In file included from /wrkdirs/usr/ports/devel/rkcommon/work/rkcommon-1.8.0/rkcommon/memory/malloc.cpp:4:
In file included from /wrkdirs/usr/ports/devel/rkcommon/work/rkcommon-1.8.0/rkcommon/memory/malloc.h:6:
In file included from /wrkdirs/usr/ports/devel/rkcommon/work/rkcommon-1.8.0/rkcommon/memory/../common.h:7:
/wrkdirs/usr/ports/devel/rkcommon/work/rkcommon-1.8.0/rkcommon/platform.h:53:9: warning: '__aligned' macro redefined [-Wmacro-redefined]
#define __aligned(...) __attribute__((aligned(__VA_ARGS__)))
        ^
/usr/include/sys/cdefs.h:219:9: note: previous definition is here
#define __aligned(x)    __attribute__((__aligned__(x)))
        ^
1 warning generated.
[ 21% 4/14] /usr/bin/c++ -DRKCOMMON_TASKING_TBB -Drkcommon_EXPORTS -I/wrkdirs/usr/ports/devel/rkcommon/work/rkcommon-1.8.0 -I/wrkdirs/usr/ports/devel/rkcommon/work/.build -I/wrkdirs/usr/ports/devel/rkcommon/work/rkcommon-1.8.0/rkcommon -isystem /usr/local/include -O2 -pipe -fstack-protector-strong -fno-strict-aliasing -O2 -pipe -fstack-protector-strong -fno-strict-aliasing -fPIC -std=c++11 -MD -MT rkcommon/CMakeFiles/rkcommon.dir/networking/Fabric.cpp.o -MF rkcommon/CMakeFiles/rkcommon.dir/networking/Fabric.cpp.o.d -o rkcommon/CMakeFiles/rkcommon.dir/networking/Fabric.cpp.o -c /wrkdirs/usr/ports/devel/rkcommon/work/rkcommon-1.8.0/rkcommon/networking/Fabric.cpp
In file included from /wrkdirs/usr/ports/devel/rkcommon/work/rkcommon-1.8.0/rkcommon/networking/Fabric.cpp:6:
In file included from /wrkdirs/usr/ports/devel/rkcommon/work/rkcommon-1.8.0/rkcommon/networking/../common.h:7:
/wrkdirs/usr/ports/devel/rkcommon/work/rkcommon-1.8.0/rkcommon/platform.h:53:9: warning: '__aligned' macro redefined [-Wmacro-redefined]
#define __aligned(...) __attribute__((aligned(__VA_ARGS__)))
        ^
/usr/include/sys/cdefs.h:219:9: note: previous definition is here
#define __aligned(x)    __attribute__((__aligned__(x)))
        ^
1 warning generated.
[ 28% 5/14] /usr/bin/c++ -DRKCOMMON_TASKING_TBB -Drkcommon_EXPORTS -I/wrkdirs/usr/ports/devel/rkcommon/work/rkcommon-1.8.0 -I/wrkdirs/usr/ports/devel/rkcommon/work/.build -I/wrkdirs/usr/ports/devel/rkcommon/work/rkcommon-1.8.0/rkcommon -isystem /usr/local/include -O2 -pipe -fstack-protector-strong -fno-strict-aliasing -O2 -pipe -fstack-protector-strong -fno-strict-aliasing -fPIC -std=c++11 -MD -MT rkcommon/CMakeFiles/rkcommon.dir/networking/DataStreaming.cpp.o -MF rkcommon/CMakeFiles/rkcommon.dir/networking/DataStreaming.cpp.o.d -o rkcommon/CMakeFiles/rkcommon.dir/networking/DataStreaming.cpp.o -c /wrkdirs/usr/ports/devel/rkcommon/work/rkcommon-1.8.0/rkcommon/networking/DataStreaming.cpp
In file included from /wrkdirs/usr/ports/devel/rkcommon/work/rkcommon-1.8.0/rkcommon/networking/DataStreaming.cpp:4:
In file included from /wrkdirs/usr/ports/devel/rkcommon/work/rkcommon-1.8.0/rkcommon/networking/DataStreaming.h:6:
In file included from /wrkdirs/usr/ports/devel/rkcommon/work/rkcommon-1.8.0/rkcommon/networking/../common.h:7:
/wrkdirs/usr/ports/devel/rkcommon/work/rkcommon-1.8.0/rkcommon/platform.h:53:9: warning: '__aligned' macro redefined [-Wmacro-redefined]
#define __aligned(...) __attribute__((aligned(__VA_ARGS__)))
        ^
/usr/include/sys/cdefs.h:219:9: note: previous definition is here
#define __aligned(x)    __attribute__((__aligned__(x)))
        ^
1 warning generated.
[ 35% 6/14] /usr/bin/c++ -DRKCOMMON_TASKING_TBB -Drkcommon_EXPORTS -I/wrkdirs/usr/ports/devel/rkcommon/work/rkcommon-1.8.0 -I/wrkdirs/usr/ports/devel/rkcommon/work/.build -I/wrkdirs/usr/ports/devel/rkcommon/work/rkcommon-1.8.0/rkcommon -isystem /usr/local/include -O2 -pipe -fstack-protector-strong -fno-strict-aliasing -O2 -pipe -fstack-protector-strong -fno-strict-aliasing -fPIC -std=c++11 -MD -MT rkcommon/CMakeFiles/rkcommon.dir/os/FileName.cpp.o -MF rkcommon/CMakeFiles/rkcommon.dir/os/FileName.cpp.o.d -o rkcommon/CMakeFiles/rkcommon.dir/os/FileName.cpp.o -c /wrkdirs/usr/ports/devel/rkcommon/work/rkcommon-1.8.0/rkcommon/os/FileName.cpp
In file included from /wrkdirs/usr/ports/devel/rkcommon/work/rkcommon-1.8.0/rkcommon/os/FileName.cpp:4:
In file included from /wrkdirs/usr/ports/devel/rkcommon/work/rkcommon-1.8.0/rkcommon/os/FileName.h:6:
In file included from /wrkdirs/usr/ports/devel/rkcommon/work/rkcommon-1.8.0/rkcommon/os/../common.h:7:
/wrkdirs/usr/ports/devel/rkcommon/work/rkcommon-1.8.0/rkcommon/platform.h:53:9: warning: '__aligned' macro redefined [-Wmacro-redefined]
#define __aligned(...) __attribute__((aligned(__VA_ARGS__)))
        ^
/usr/include/sys/cdefs.h:219:9: note: previous definition is here
#define __aligned(x)    __attribute__((__aligned__(x)))
        ^
1 warning generated.
[ 42% 7/14] /usr/bin/c++ -DRKCOMMON_TASKING_TBB -Drkcommon_EXPORTS -I/wrkdirs/usr/ports/devel/rkcommon/work/rkcommon-1.8.0 -I/wrkdirs/usr/ports/devel/rkcommon/work/.build -I/wrkdirs/usr/ports/devel/rkcommon/work/rkcommon-1.8.0/rkcommon -isystem /usr/local/include -O2 -pipe -fstack-protector-strong -fno-strict-aliasing -O2 -pipe -fstack-protector-strong -fno-strict-aliasing -fPIC -std=c++11 -MD -MT rkcommon/CMakeFiles/rkcommon.dir/os/library.cpp.o -MF rkcommon/CMakeFiles/rkcommon.dir/os/library.cpp.o.d -o rkcommon/CMakeFiles/rkcommon.dir/os/library.cpp.o -c /wrkdirs/usr/ports/devel/rkcommon/work/rkcommon-1.8.0/rkcommon/os/library.cpp
In file included from /wrkdirs/usr/ports/devel/rkcommon/work/rkcommon-1.8.0/rkcommon/os/library.cpp:4:
In file included from /wrkdirs/usr/ports/devel/rkcommon/work/rkcommon-1.8.0/rkcommon/os/library.h:4:
In file included from /wrkdirs/usr/ports/devel/rkcommon/work/rkcommon-1.8.0/rkcommon/os/../common.h:7:
/wrkdirs/usr/ports/devel/rkcommon/work/rkcommon-1.8.0/rkcommon/platform.h:53:9: warning: '__aligned' macro redefined [-Wmacro-redefined]
#define __aligned(...) __attribute__((aligned(__VA_ARGS__)))
        ^
/usr/include/sys/cdefs.h:219:9: note: previous definition is here
#define __aligned(x)    __attribute__((__aligned__(x)))
        ^
1 warning generated.
[ 50% 8/14] /usr/bin/c++ -DRKCOMMON_TASKING_TBB -Drkcommon_EXPORTS -I/wrkdirs/usr/ports/devel/rkcommon/work/rkcommon-1.8.0 -I/wrkdirs/usr/ports/devel/rkcommon/work/.build -I/wrkdirs/usr/ports/devel/rkcommon/work/rkcommon-1.8.0/rkcommon -isystem /usr/local/include -O2 -pipe -fstack-protector-strong -fno-strict-aliasing -O2 -pipe -fstack-protector-strong -fno-strict-aliasing -fPIC -std=c++11 -MD -MT rkcommon/CMakeFiles/rkcommon.dir/tasking/detail/tasking_system_init.cpp.o -MF rkcommon/CMakeFiles/rkcommon.dir/tasking/detail/tasking_system_init.cpp.o.d -o rkcommon/CMakeFiles/rkcommon.dir/tasking/detail/tasking_system_init.cpp.o -c /wrkdirs/usr/ports/devel/rkcommon/work/rkcommon-1.8.0/rkcommon/tasking/detail/tasking_system_init.cpp
FAILED: rkcommon/CMakeFiles/rkcommon.dir/tasking/detail/tasking_system_init.cpp.o 
/usr/bin/c++ -DRKCOMMON_TASKING_TBB -Drkcommon_EXPORTS -I/wrkdirs/usr/ports/devel/rkcommon/work/rkcommon-1.8.0 -I/wrkdirs/usr/ports/devel/rkcommon/work/.build -I/wrkdirs/usr/ports/devel/rkcommon/work/rkcommon-1.8.0/rkcommon -isystem /usr/local/include -O2 -pipe -fstack-protector-strong -fno-strict-aliasing -O2 -pipe -fstack-protector-strong -fno-strict-aliasing -fPIC -std=c++11 -MD -MT rkcommon/CMakeFiles/rkcommon.dir/tasking/detail/tasking_system_init.cpp.o -MF rkcommon/CMakeFiles/rkcommon.dir/tasking/detail/tasking_system_init.cpp.o.d -o rkcommon/CMakeFiles/rkcommon.dir/tasking/detail/tasking_system_init.cpp.o -c /wrkdirs/usr/ports/devel/rkcommon/work/rkcommon-1.8.0/rkcommon/tasking/detail/tasking_system_init.cpp
In file included from /wrkdirs/usr/ports/devel/rkcommon/work/rkcommon-1.8.0/rkcommon/tasking/detail/tasking_system_init.cpp:4:
In file included from /wrkdirs/usr/ports/devel/rkcommon/work/rkcommon-1.8.0/rkcommon/tasking/detail/../tasking_system_init.h:6:
In file included from /wrkdirs/usr/ports/devel/rkcommon/work/rkcommon-1.8.0/rkcommon/tasking/detail/../../common.h:7:
/wrkdirs/usr/ports/devel/rkcommon/work/rkcommon-1.8.0/rkcommon/platform.h:53:9: warning: '__aligned' macro redefined [-Wmacro-redefined]
#define __aligned(...) __attribute__((aligned(__VA_ARGS__)))
        ^
/usr/include/sys/cdefs.h:219:9: note: previous definition is here
#define __aligned(x)    __attribute__((__aligned__(x)))
        ^
/wrkdirs/usr/ports/devel/rkcommon/work/rkcommon-1.8.0/rkcommon/tasking/detail/tasking_system_init.cpp:81:9: error: '_mm_setcsr' needs target feature sse
        _MM_SET_FLUSH_ZERO_MODE(_MM_FLUSH_ZERO_ON);
        ^
/usr/lib/clang/13.0.0/include/xmmintrin.h:2967:37: note: expanded from macro '_MM_SET_FLUSH_ZERO_MODE'
#define _MM_SET_FLUSH_ZERO_MODE(x) (_mm_setcsr((_mm_getcsr() & ~_MM_FLUSH_ZERO_MASK) | (x)))
                                    ^
/wrkdirs/usr/ports/devel/rkcommon/work/rkcommon-1.8.0/rkcommon/tasking/detail/tasking_system_init.cpp:81:9: error: '_mm_getcsr' needs target feature sse
/usr/lib/clang/13.0.0/include/xmmintrin.h:2967:49: note: expanded from macro '_MM_SET_FLUSH_ZERO_MODE'
#define _MM_SET_FLUSH_ZERO_MODE(x) (_mm_setcsr((_mm_getcsr() & ~_MM_FLUSH_ZERO_MASK) | (x)))
                                                ^
/wrkdirs/usr/ports/devel/rkcommon/work/rkcommon-1.8.0/rkcommon/tasking/detail/tasking_system_init.cpp:82:9: error: '_mm_setcsr' needs target feature sse
        _MM_SET_DENORMALS_ZERO_MODE(_MM_DENORMALS_ZERO_ON);
        ^
/usr/lib/clang/13.0.0/include/emmintrin.h:4979:41: note: expanded from macro '_MM_SET_DENORMALS_ZERO_MODE'
#define _MM_SET_DENORMALS_ZERO_MODE(x) (_mm_setcsr((_mm_getcsr() & ~_MM_DENORMALS_ZERO_MASK) | (x)))
                                        ^
/wrkdirs/usr/ports/devel/rkcommon/work/rkcommon-1.8.0/rkcommon/tasking/detail/tasking_system_init.cpp:82:9: error: '_mm_getcsr' needs target feature sse
/usr/lib/clang/13.0.0/include/emmintrin.h:4979:53: note: expanded from macro '_MM_SET_DENORMALS_ZERO_MODE'
#define _MM_SET_DENORMALS_ZERO_MODE(x) (_mm_setcsr((_mm_getcsr() & ~_MM_DENORMALS_ZERO_MASK) | (x)))
                                                    ^
1 warning and 4 errors generated.
[ 57% 8/14] /usr/bin/c++ -DRKCOMMON_TASKING_TBB -Drkcommon_EXPORTS -I/wrkdirs/usr/ports/devel/rkcommon/work/rkcommon-1.8.0 -I/wrkdirs/usr/ports/devel/rkcommon/work/.build -I/wrkdirs/usr/ports/devel/rkcommon/work/rkcommon-1.8.0/rkcommon -isystem /usr/local/include -O2 -pipe -fstack-protector-strong -fno-strict-aliasing -O2 -pipe -fstack-protector-strong -fno-strict-aliasing -fPIC -std=c++11 -MD -MT rkcommon/CMakeFiles/rkcommon.dir/utility/demangle.cpp.o -MF rkcommon/CMakeFiles/rkcommon.dir/utility/demangle.cpp.o.d -o rkcommon/CMakeFiles/rkcommon.dir/utility/demangle.cpp.o -c /wrkdirs/usr/ports/devel/rkcommon/work/rkcommon-1.8.0/rkcommon/utility/demangle.cpp
In file included from /wrkdirs/usr/ports/devel/rkcommon/work/rkcommon-1.8.0/rkcommon/utility/demangle.cpp:4:
In file included from /wrkdirs/usr/ports/devel/rkcommon/work/rkcommon-1.8.0/rkcommon/utility/demangle.h:9:
In file included from /wrkdirs/usr/ports/devel/rkcommon/work/rkcommon-1.8.0/rkcommon/utility/../common.h:7:
/wrkdirs/usr/ports/devel/rkcommon/work/rkcommon-1.8.0/rkcommon/platform.h:53:9: warning: '__aligned' macro redefined [-Wmacro-redefined]
#define __aligned(...) __attribute__((aligned(__VA_ARGS__)))
        ^
/usr/include/sys/cdefs.h:219:9: note: previous definition is here
#define __aligned(x)    __attribute__((__aligned__(x)))
        ^
1 warning generated.
ninja: build stopped: subcommand failed.
===> Compilation failed unexpectedly.
Try to set MAKE_JOBS_UNSAFE=yes and rebuild before reporting the failure to
the maintainer.
*** Error code 1

Stop.
make: stopped in /usr/ports/devel/rkcommon
Received on Thu Dec 02 2021 - 01:54:16 UTC

Original text of this message