[package - main-i386-default][math/py-ducc0] Failed for py38-ducc0-0.22.0 in build

From: <pkg-fallout_at_FreeBSD.org>
Date: Tue, 07 Dec 2021 16:02:20 UTC
You are receiving this mail as a port that you maintain
is failing to build on the FreeBSD package build server.
Please investigate the failure and submit a PR to fix
build.

Maintainer:     yuri@FreeBSD.org
Log URL:        http://beefy17.nyi.freebsd.org/data/main-i386-default/p7539e33f88ff_s169b368a62/logs/py38-ducc0-0.22.0.log
Build URL:      http://beefy17.nyi.freebsd.org/build.html?mastername=main-i386-default&build=p7539e33f88ff_s169b368a62
Log:

=>> Building math/py-ducc0
build started at Tue Dec  7 16:01:24 UTC 2021
port directory: /usr/ports/math/py-ducc0
package name: py38-ducc0-0.22.0
building for: FreeBSD main-i386-default-job-02 14.0-CURRENT FreeBSD 14.0-CURRENT 1400043 i386
maintained by: yuri@FreeBSD.org
Makefile ident: 
Poudriere version: 3.2.8-21-g883afb07
Host OSVERSION: 1400042
Jail OSVERSION: 1400043
Job Id: 02




!!! Jail is newer than host. (Jail: 1400043, Host: 1400042) !!!
!!! This is not supported. !!!
!!! Host kernel must be same or newer than jail. !!!
!!! Expect build failures. !!!



---Begin Environment---
SHELL=/bin/sh
UNAME_p=i386
UNAME_m=i386
OSVERSION=1400043
UNAME_v=FreeBSD 14.0-CURRENT 1400043
UNAME_r=14.0-CURRENT
BLOCKSIZE=K
MAIL=/var/mail/root
MM_CHARSET=UTF-8
LANG=C.UTF-8
STATUS=1
HOME=/root
PATH=/sbin:/bin:/usr/sbin:/usr/bin:/usr/local/sbin:/usr/local/bin:/root/bin
LOCALBASE=/usr/local
USER=root
LIBEXECPREFIX=/usr/local/libexec/poudriere
POUDRIERE_VERSION=3.2.8-21-g883afb07
MASTERMNT=/usr/local/poudriere/data/.m/main-i386-default/ref
POUDRIERE_BUILD_TYPE=bulk
PACKAGE_BUILDING=yes
SAVED_TERM=
PWD=/usr/local/poudriere/data/.m/main-i386-default/ref/.p/pool
P_PORTS_FEATURES=FLAVORS SELECTED_OPTIONS
MASTERNAME=main-i386-default
SCRIPTPREFIX=/usr/local/share/poudriere
OLDPWD=/usr/local/poudriere/data/.m/main-i386-default/ref/.p
SCRIPTPATH=/usr/local/share/poudriere/bulk.sh
POUDRIEREPATH=/usr/local/bin/poudriere
---End Environment---

---Begin Poudriere Port Flags/Env---
PORT_FLAGS=
PKGENV=
FLAVOR=py38
DEPENDS_ARGS=
MAKE_ARGS= FLAVOR=py38
---End Poudriere Port Flags/Env---

---Begin OPTIONS List---
---End OPTIONS List---

--MAINTAINER--
yuri@FreeBSD.org
--End MAINTAINER--

--CONFIGURE_ARGS--

--End CONFIGURE_ARGS--

--CONFIGURE_ENV--
PYTHON="/usr/local/bin/python3.8" XDG_DATA_HOME=/wrkdirs/usr/ports/math/py-ducc0/work-py38  XDG_CONFIG_HOME=/wrkdirs/usr/ports/math/py-ducc0/work-py38  XDG_CACHE_HOME=/wrkdirs/usr/ports/math/py-ducc0/work-py38/.cache  HOME=/wrkdirs/usr/ports/math/py-ducc0/work-py38 TMPDIR="/tmp" PATH=/wrkdirs/usr/ports/math/py-ducc0/work-py38/.bin:/sbin:/bin:/usr/sbin:/usr/bin:/usr/local/sbin:/usr/local/bin:/root/bin SHELL=/bin/sh CONFIG_SHELL=/bin/sh
--End CONFIGURE_ENV--

--MAKE_ENV--
DUCC0_OPTIMIZATION=none XDG_DATA_HOME=/wrkdirs/usr/ports/math/py-ducc0/work-py38  XDG_CONFIG_HOME=/wrkdirs/usr/ports/math/py-ducc0/work-py38  XDG_CACHE_HOME=/wrkdirs/usr/ports/math/py-ducc0/work-py38/.cache  HOME=/wrkdirs/usr/ports/math/py-ducc0/work-py38 TMPDIR="/tmp" PATH=/wrkdirs/usr/ports/math/py-ducc0/work-py38/.bin:/sbin:/bin:/usr/sbin:/usr/bin:/usr/local/sbin:/usr/local/bin:/root/bin NO_PIE=yes MK_DEBUG_FILES=no MK_KERNEL_SYMBOLS=no SHELL=/bin/sh NO_LINT=YES LDSHARED="cc -shared" PYTHONDONTWRITEBYTECODE= PYTHONOPTIMIZE= PREFIX=/usr/local  LOCALBASE=/usr/local  CC="cc" CFLAGS="-O2 -pipe  -fstack-protector-strong -fno-strict-aliasing "  CPP="cpp" CPPFLAGS=""  LDFLAGS=" -fstack-protector-strong " LIBS=""  CXX="c++" CXXFLAGS="-O2 -pipe -fstack-protector-strong -fno-strict-aliasing  "  MANPREFIX="/usr/local" BSD_INSTALL_PROGRAM="install  -s -m 555"  BSD_INSTALL_LIB="install  -s -m 0644"  BSD_INSTALL_SCRIPT="install  -m 555"  BSD_INSTALL_DATA="install  -m 0644"  BSD_INSTALL_MAN="ins
 tall  -m 444"
--End MAKE_ENV--

--PLIST_SUB--
PYTHON_INCLUDEDIR=include/python3.8  PYTHON_LIBDIR=lib/python3.8  PYTHON_PLATFORM=freebsd14  PYTHON_SITELIBDIR=lib/python3.8/site-packages  PYTHON_SUFFIX=38  PYTHON_EXT_SUFFIX=.cpython-38  PYTHON_VER=3.8  PYTHON_VERSION=python3.8 PYTHON2="@comment " PYTHON3="" OSREL=14.0 PREFIX=%D LOCALBASE=/usr/local  RESETPREFIX=/usr/local LIB32DIR=lib DOCSDIR="share/doc/ducc0"  EXAMPLESDIR="share/examples/ducc0"  DATADIR="share/ducc0"  WWWDIR="www/ducc0"  ETCDIR="etc/ducc0"
--End PLIST_SUB--

--SUB_LIST--
PREFIX=/usr/local LOCALBASE=/usr/local  DATADIR=/usr/local/share/ducc0 DOCSDIR=/usr/local/share/doc/ducc0 EXAMPLESDIR=/usr/local/share/examples/ducc0  WWWDIR=/usr/local/www/ducc0 ETCDIR=/usr/local/etc/ducc0
--End SUB_LIST--

---Begin make.conf---
USE_PACKAGE_DEPENDS=yes
BATCH=yes
WRKDIRPREFIX=/wrkdirs
PORTSDIR=/usr/ports
PACKAGES=/packages
DISTDIR=/distfiles
PACKAGE_BUILDING=yes
PACKAGE_BUILDING_FLAVORS=yes
MACHINE=i386
MACHINE_ARCH=i386
ARCH=${MACHINE_ARCH}
#### /usr/local/etc/poudriere.d/make.conf ####
# XXX: We really need this but cannot use it while 'make checksum' does not
# try the next mirror on checksum failure.  It currently retries the same
# failed mirror and then fails rather then trying another.  It *does*
# try the next if the size is mismatched though.
#MASTER_SITE_FREEBSD=yes
# Build ALLOW_MAKE_JOBS_PACKAGES with 2 jobs
MAKE_JOBS_NUMBER=2
#### /usr/ports/Mk/Scripts/ports_env.sh ####
_CCVERSION_921dbbb2=FreeBSD clang version 13.0.0 (git@github.com:llvm/llvm-project.git llvmorg-13.0.0-0-gd7b669b3a303) Target: i386-unknown-freebsd14.0 Thread model: posix InstalledDir: /usr/bin
_ALTCCVERSION_921dbbb2=none
_CXXINTERNAL_acaad9ca=FreeBSD clang version 13.0.0 (git@github.com:llvm/llvm-project.git llvmorg-13.0.0-0-gd7b669b3a303) Target: i386-unknown-freebsd14.0 Thread model: posix InstalledDir: /usr/bin "/usr/bin/ld" "--eh-frame-hdr" "-dynamic-linker" "/libexec/ld-elf.so.1" "--hash-style=both" "--enable-new-dtags" "-m" "elf_i386_fbsd" "-o" "a.out" "/usr/lib/crt1.o" "/usr/lib/crti.o" "/usr/lib/crtbegin.o" "-L/usr/lib" "/dev/null" "-lc++" "-lm" "-lgcc" "--as-needed" "-lgcc_s" "--no-as-needed" "-lc" "-lgcc" "--as-needed" "-lgcc_s" "--no-as-needed" "/usr/lib/crtend.o" "/usr/lib/crtn.o"
CC_OUTPUT_921dbbb2_58173849=yes
CC_OUTPUT_921dbbb2_9bdba57c=yes
CC_OUTPUT_921dbbb2_6a4fe7f5=yes
CC_OUTPUT_921dbbb2_6bcac02b=yes
CC_OUTPUT_921dbbb2_67d20829=yes
CC_OUTPUT_921dbbb2_bfa62e83=yes
CC_OUTPUT_921dbbb2_f0b4d593=yes
CC_OUTPUT_921dbbb2_308abb44=yes
CC_OUTPUT_921dbbb2_f00456e5=yes
CC_OUTPUT_921dbbb2_65ad290d=yes
CC_OUTPUT_921dbbb2_f2776b26=yes
CC_OUTPUT_921dbbb2_b2657cc3=yes
CC_OUTPUT_921dbbb2_380987f7=yes
CC_OUTPUT_921dbbb2_160933ec=yes
CC_OUTPUT_921dbbb2_fb62803b=yes
_OBJC_CCVERSION_921dbbb2=FreeBSD clang version 13.0.0 (git@github.com:llvm/llvm-project.git llvmorg-13.0.0-0-gd7b669b3a303) Target: i386-unknown-freebsd14.0 Thread model: posix InstalledDir: /usr/bin
_OBJC_ALTCCVERSION_921dbbb2=none
ARCH=i386
OPSYS=FreeBSD
_OSRELEASE=14.0-CURRENT
OSREL=14.0
OSVERSION=1400043
PYTHONBASE=/usr/local
CONFIGURE_MAX_CMD_LEN=524288
HAVE_PORTS_ENV=1
#### Misc Poudriere ####
GID=0
UID=0
---End make.conf---
--Resource limits--
cpu time               (seconds, -t)  unlimited
file size           (512-blocks, -f)  unlimited
data seg size           (kbytes, -d)  524288
stack size              (kbytes, -s)  65536
core file size      (512-blocks, -c)  unlimited
max memory size         (kbytes, -m)  unlimited
locked memory           (kbytes, -l)  unlimited
max user processes              (-u)  89999
open files                      (-n)  1024
virtual mem size        (kbytes, -v)  unlimited
swap limit              (kbytes, -w)  unlimited
socket buffer size       (bytes, -b)  unlimited
pseudo-terminals                (-p)  unlimited
kqueues                         (-k)  unlimited
umtx shared locks               (-o)  unlimited
--End resource limits--
=======================<phase: check-sanity   >============================
===>  License GPLv2 accepted by the user
===========================================================================
=======================<phase: pkg-depends    >============================
===>   py38-ducc0-0.22.0 depends on file: /usr/local/sbin/pkg - not found
===>   Installing existing package /packages/All/pkg-1.17.5.pkg
[main-i386-default-job-02] Installing pkg-1.17.5...
[main-i386-default-job-02] Extracting pkg-1.17.5: .......... done
===>   py38-ducc0-0.22.0 depends on file: /usr/local/sbin/pkg - found
===>   Returning to build of py38-ducc0-0.22.0
===========================================================================
=======================<phase: fetch-depends  >============================
===========================================================================
=======================<phase: fetch          >============================
===>  License GPLv2 accepted by the user
===> Fetching all distfiles required by py38-ducc0-0.22.0 for building
===========================================================================
=======================<phase: checksum       >============================
===>  License GPLv2 accepted by the user
===> Fetching all distfiles required by py38-ducc0-0.22.0 for building
=> SHA256 Checksum OK for ducc0-0.22.0.tar.gz.
===========================================================================
=======================<phase: extract-depends>============================
===========================================================================
=======================<phase: extract        >============================
===>  License GPLv2 accepted by the user
===> Fetching all distfiles required by py38-ducc0-0.22.0 for building
===>  Extracting for py38-ducc0-0.22.0
=> SHA256 Checksum OK for ducc0-0.22.0.tar.gz.
===========================================================================
=======================<phase: patch-depends  >============================
===========================================================================
=======================<phase: patch          >============================
===>  Patching for py38-ducc0-0.22.0
===========================================================================
=======================<phase: build-depends  >============================
===>   py38-ducc0-0.22.0 depends on package: py38-pybind11>0 - not found
===>   Installing existing package /packages/All/py38-pybind11-2.8.0.pkg
[main-i386-default-job-02] Installing py38-pybind11-2.8.0...
[main-i386-default-job-02] `-- Installing py38-setuptools-57.0.0...
[main-i386-default-job-02] |   `-- Installing python38-3.8.12_1...
[main-i386-default-job-02] |   | `-- Installing gettext-runtime-0.21...
[main-i386-default-job-02] |   |   `-- Installing indexinfo-0.3.1...
[main-i386-default-job-02] |   |   `-- Extracting indexinfo-0.3.1: .... done
[main-i386-default-job-02] |   | `-- Extracting gettext-runtime-0.21: .......... done
[main-i386-default-job-02] |   | `-- Installing libffi-3.3_1...
[main-i386-default-job-02] |   | `-- Extracting libffi-3.3_1: .......... done
[main-i386-default-job-02] |   | `-- Installing mpdecimal-2.5.1...
[main-i386-default-job-02] |   | `-- Extracting mpdecimal-2.5.1: .......... done
[main-i386-default-job-02] |   | `-- Installing readline-8.1.1...
[main-i386-default-job-02] |   | `-- Extracting readline-8.1.1: .......... done
[main-i386-default-job-02] |   `-- Extracting python38-3.8.12_1: .......... done
[main-i386-default-job-02] `-- Extracting py38-setuptools-57.0.0: .......... done
[main-i386-default-job-02] Extracting py38-pybind11-2.8.0: .......... done
=====
Message from python38-3.8.12_1:

--
Note that some standard Python modules are provided as separate ports
as they require additional dependencies. They are available as:

py38-gdbm       databases/py-gdbm@py38
py38-sqlite3    databases/py-sqlite3@py38
py38-tkinter    x11-toolkits/py-tkinter@py38
===>   py38-ducc0-0.22.0 depends on package: py38-pybind11>0 - found
===>   Returning to build of py38-ducc0-0.22.0
===>   py38-ducc0-0.22.0 depends on package: py38-setuptools>0 - found
===>   py38-ducc0-0.22.0 depends on file: /usr/local/bin/python3.8 - found
===========================================================================
=======================<phase: lib-depends    >============================
===========================================================================
=======================<phase: configure      >============================
===>  Configuring for py38-ducc0-0.22.0

Build environment:
Platform:      FreeBSD-14.0-CURRENT-i386-32bit-ELF
Machine:       i386
System:        FreeBSD
Architecture:  ('32bit', 'ELF')

running config
===========================================================================
=======================<phase: build          >============================
===>  Building for py38-ducc0-0.22.0

Build environment:
Platform:      FreeBSD-14.0-CURRENT-i386-32bit-ELF
Machine:       i386
System:        FreeBSD
Architecture:  ('32bit', 'ELF')

running build
running build_ext
building 'ducc0' extension
creating build
creating build/temp.freebsd-14.0-CURRENT-i386-3.8
creating build/temp.freebsd-14.0-CURRENT-i386-3.8/python
cc -Wno-unused-result -Wsign-compare -Wunreachable-code -DNDEBUG -O2 -pipe -fstack-protector-strong -fno-strict-aliasing -O2 -pipe -fstack-protector-strong -fno-strict-aliasing -fPIC -DPKGNAME=ducc0 -DPKGVERSION=0.22.0 -I. -I./src/ -I/usr/local/lib/python3.8/site-packages/pybind11/include -I/usr/local/lib/python3.8/site-packages/pybind11/include -I/usr/local/include/python3.8 -c python/ducc.cc -o build/temp.freebsd-14.0-CURRENT-i386-3.8/python/ducc.o -std=c++17 -fvisibility=hidden -g0 -O0 -pthread
In file included from python/ducc.cc:11:
./python/sht_pymod.cc:691:80: error: non-constant-expression cannot be narrowed from type 'long long' to 'int' in initializer list [-Wc++11-narrowing]
        vmav<double,3> mr(map.data(), {1, size_t(ntheta_), size_t(nphi_)}, {0, map.stride(0)*nphi_, map.stride(0)});
                                                                               ^~~~~~~~~~~~~~~~~~~
./python/sht_pymod.cc:1514:43: note: in instantiation of member function 'ducc0::detail_pymodule_sht::Py_sharpjob<double>::alm2map' requested here
    .def("alm2map", &Py_sharpjob<double>::alm2map,"alm"_a)
                                          ^
./python/sht_pymod.cc:691:80: note: insert an explicit cast to silence this issue
        vmav<double,3> mr(map.data(), {1, size_t(ntheta_), size_t(nphi_)}, {0, map.stride(0)*nphi_, map.stride(0)});
                                                                               ^~~~~~~~~~~~~~~~~~~
                                                                               static_cast<int>(  )
./python/sht_pymod.cc:730:80: error: non-constant-expression cannot be narrowed from type 'long long' to 'int' in initializer list [-Wc++11-narrowing]
        cmav<double,3> mr(map.data(), {1, size_t(ntheta_), size_t(nphi_)}, {0, map.stride(0)*nphi_, map.stride(0)});
                                                                               ^~~~~~~~~~~~~~~~~~~
./python/sht_pymod.cc:1515:51: note: in instantiation of member function 'ducc0::detail_pymodule_sht::Py_sharpjob<double>::alm2map_adjoint' requested here
    .def("alm2map_adjoint", &Py_sharpjob<double>::alm2map_adjoint,"map"_a)
                                                  ^
./python/sht_pymod.cc:730:80: note: insert an explicit cast to silence this issue
        cmav<double,3> mr(map.data(), {1, size_t(ntheta_), size_t(nphi_)}, {0, map.stride(0)*nphi_, map.stride(0)});
                                                                               ^~~~~~~~~~~~~~~~~~~
                                                                               static_cast<int>(  )
./python/sht_pymod.cc:743:78: error: non-constant-expression cannot be narrowed from type 'long long' to 'int' in initializer list [-Wc++11-narrowing]
      cmav<double,3> mr(map.data(), {1, size_t(ntheta_), size_t(nphi_)}, {0, map.stride(0)*nphi_, map.stride(0)});
                                                                             ^~~~~~~~~~~~~~~~~~~
./python/sht_pymod.cc:1516:43: note: in instantiation of member function 'ducc0::detail_pymodule_sht::Py_sharpjob<double>::map2alm' requested here
    .def("map2alm", &Py_sharpjob<double>::map2alm,"map"_a)
                                          ^
./python/sht_pymod.cc:743:78: note: insert an explicit cast to silence this issue
      cmav<double,3> mr(map.data(), {1, size_t(ntheta_), size_t(nphi_)}, {0, map.stride(0)*nphi_, map.stride(0)});
                                                                             ^~~~~~~~~~~~~~~~~~~
                                                                             static_cast<int>(  )
./python/sht_pymod.cc:780:92: error: non-constant-expression cannot be narrowed from type 'long long' to 'int' in initializer list [-Wc++11-narrowing]
        vmav<double,3> mr(map.data(), {2, size_t(ntheta_), size_t(nphi_)}, {map.stride(0), map.stride(1)*nphi_, map.stride(1)});
                                                                                           ^~~~~~~~~~~~~~~~~~~
./python/sht_pymod.cc:1517:48: note: in instantiation of member function 'ducc0::detail_pymodule_sht::Py_sharpjob<double>::alm2map_spin' requested here
    .def("alm2map_spin", &Py_sharpjob<double>::alm2map_spin,"alm"_a,"spin"_a)
                                               ^
./python/sht_pymod.cc:780:92: note: insert an explicit cast to silence this issue
        vmav<double,3> mr(map.data(), {2, size_t(ntheta_), size_t(nphi_)}, {map.stride(0), map.stride(1)*nphi_, map.stride(1)});
                                                                                           ^~~~~~~~~~~~~~~~~~~
                                                                                           static_cast<int>(  )
./python/sht_pymod.cc:792:90: error: non-constant-expression cannot be narrowed from type 'long long' to 'int' in initializer list [-Wc++11-narrowing]
      cmav<double,3> mr(map.data(), {2, size_t(ntheta_), size_t(nphi_)}, {map.stride(0), map.stride(1)*nphi_, map.stride(1)});
                                                                                         ^~~~~~~~~~~~~~~~~~~
./python/sht_pymod.cc:1518:48: note: in instantiation of member function 'ducc0::detail_pymodule_sht::Py_sharpjob<double>::map2alm_spin' requested here
    .def("map2alm_spin", &Py_sharpjob<double>::map2alm_spin,"map"_a,"spin"_a)
                                               ^
./python/sht_pymod.cc:792:90: note: insert an explicit cast to silence this issue
      cmav<double,3> mr(map.data(), {2, size_t(ntheta_), size_t(nphi_)}, {map.stride(0), map.stride(1)*nphi_, map.stride(1)});
                                                                                         ^~~~~~~~~~~~~~~~~~~
                                                                                         static_cast<int>(  )
5 errors generated.
error: command 'cc' failed with exit status 1
*** Error code 1

Stop.
make: stopped in /usr/ports/math/py-ducc0