[package - main-amd64-default][graphics/mypaint] Failed for mypaint-2.0.0_3 in build

From: <pkg-fallout_at_FreeBSD.org>
Date: Sat, 04 Dec 2021 20:05:36 UTC
You are receiving this mail as a port that you maintain
is failing to build on the FreeBSD package build server.
Please investigate the failure and submit a PR to fix
build.

Maintainer:     greg@unrelenting.technology
Log URL:        http://beefy18.nyi.freebsd.org/data/main-amd64-default/pd684832c1aed_sfc21aafe5f/logs/mypaint-2.0.0_3.log
Build URL:      http://beefy18.nyi.freebsd.org/build.html?mastername=main-amd64-default&build=pd684832c1aed_sfc21aafe5f
Log:

=>> Building graphics/mypaint
build started at Sat Dec  4 20:04:29 UTC 2021
port directory: /usr/ports/graphics/mypaint
package name: mypaint-2.0.0_3
building for: FreeBSD main-amd64-default-job-03 14.0-CURRENT FreeBSD 14.0-CURRENT 1400043 amd64
maintained by: greg@unrelenting.technology
Makefile ident: 
Poudriere version: 3.2.8-21-g883afb07
Host OSVERSION: 1400042
Jail OSVERSION: 1400043
Job Id: 03




!!! Jail is newer than host. (Jail: 1400043, Host: 1400042) !!!
!!! This is not supported. !!!
!!! Host kernel must be same or newer than jail. !!!
!!! Expect build failures. !!!



---Begin Environment---
SHELL=/bin/sh
OSVERSION=1400043
UNAME_v=FreeBSD 14.0-CURRENT 1400043
UNAME_r=14.0-CURRENT
BLOCKSIZE=K
MAIL=/var/mail/root
MM_CHARSET=UTF-8
LANG=C.UTF-8
STATUS=1
HOME=/root
PATH=/sbin:/bin:/usr/sbin:/usr/bin:/usr/local/sbin:/usr/local/bin:/root/bin
LOCALBASE=/usr/local
USER=root
LIBEXECPREFIX=/usr/local/libexec/poudriere
POUDRIERE_VERSION=3.2.8-21-g883afb07
MASTERMNT=/usr/local/poudriere/data/.m/main-amd64-default/ref
POUDRIERE_BUILD_TYPE=bulk
PACKAGE_BUILDING=yes
SAVED_TERM=
PWD=/usr/local/poudriere/data/.m/main-amd64-default/ref/.p/pool
P_PORTS_FEATURES=FLAVORS SELECTED_OPTIONS
MASTERNAME=main-amd64-default
SCRIPTPREFIX=/usr/local/share/poudriere
OLDPWD=/usr/local/poudriere/data/.m/main-amd64-default/ref/.p
SCRIPTPATH=/usr/local/share/poudriere/bulk.sh
POUDRIEREPATH=/usr/local/bin/poudriere
---End Environment---

---Begin Poudriere Port Flags/Env---
PORT_FLAGS=
PKGENV=
FLAVOR=
DEPENDS_ARGS=
MAKE_ARGS=
---End Poudriere Port Flags/Env---

---Begin OPTIONS List---
===> The following configuration options are available for mypaint-2.0.0_3:
     OPENMP=on: Parallel processing support via OpenMP
===> Use 'make config' to modify these settings
---End OPTIONS List---

--MAINTAINER--
greg@unrelenting.technology
--End MAINTAINER--

--CONFIGURE_ARGS--

--End CONFIGURE_ARGS--

--CONFIGURE_ENV--
PKG_CONFIG=pkgconf PYTHON="/usr/local/bin/python3.8" XDG_DATA_HOME=/wrkdirs/usr/ports/graphics/mypaint/work  XDG_CONFIG_HOME=/wrkdirs/usr/ports/graphics/mypaint/work  XDG_CACHE_HOME=/wrkdirs/usr/ports/graphics/mypaint/work/.cache  HOME=/wrkdirs/usr/ports/graphics/mypaint/work TMPDIR="/tmp" PATH=/wrkdirs/usr/ports/graphics/mypaint/work/.bin:/sbin:/bin:/usr/sbin:/usr/bin:/usr/local/sbin:/usr/local/bin:/root/bin SHELL=/bin/sh CONFIG_SHELL=/bin/sh CMAKE_PREFIX_PATH="/usr/local" LANG=en_US.UTF-8 LC_ALL=en_US.UTF-8
--End CONFIGURE_ENV--

--MAKE_ENV--
XDG_DATA_HOME=/wrkdirs/usr/ports/graphics/mypaint/work  XDG_CONFIG_HOME=/wrkdirs/usr/ports/graphics/mypaint/work  XDG_CACHE_HOME=/wrkdirs/usr/ports/graphics/mypaint/work/.cache  HOME=/wrkdirs/usr/ports/graphics/mypaint/work TMPDIR="/tmp" PATH=/wrkdirs/usr/ports/graphics/mypaint/work/.bin:/sbin:/bin:/usr/sbin:/usr/bin:/usr/local/sbin:/usr/local/bin:/root/bin NO_PIE=yes MK_DEBUG_FILES=no MK_KERNEL_SYMBOLS=no SHELL=/bin/sh NO_LINT=YES LDSHARED="cc -shared" PYTHONDONTWRITEBYTECODE= PYTHONOPTIMIZE= LANG=en_US.UTF-8 LC_ALL=en_US.UTF-8 PREFIX=/usr/local  LOCALBASE=/usr/local  CC="cc" CFLAGS="-O2 -pipe   -fstack-protector-strong -isystem /usr/local/include -fno-strict-aliasing "  CPP="cpp" CPPFLAGS="-isystem /usr/local/include"  LDFLAGS=" -fstack-protector-strong " LIBS="-L/usr/local/lib"  CXX="c++" CXXFLAGS="-O2 -pipe -fstack-protector-strong -isystem /usr/local/include -fno-strict-aliasing  -isystem /usr/local/include "  MANPREFIX="/usr/local" BSD_INSTALL_PROGRAM="install  -s -m 555"  BSD_
 INSTALL_LIB="install  -s -m 0644"  BSD_INSTALL_SCRIPT="install  -m 555"  BSD_INSTALL_DATA="install  -m 0644"  BSD_INSTALL_MAN="install  -m 444"
--End MAKE_ENV--

--PLIST_SUB--
GTK2_VERSION="2.10.0"  GTK3_VERSION="3.0.0"  GTK4_VERSION="4.0.0" PYTHON_INCLUDEDIR=include/python3.8  PYTHON_LIBDIR=lib/python3.8  PYTHON_PLATFORM=freebsd14  PYTHON_SITELIBDIR=lib/python3.8/site-packages  PYTHON_SUFFIX=38  PYTHON_EXT_SUFFIX=.cpython-38  PYTHON_VER=3.8  PYTHON_VERSION=python3.8 PYTHON2="@comment " PYTHON3="" OSREL=14.0 PREFIX=%D LOCALBASE=/usr/local  RESETPREFIX=/usr/local LIB32DIR=lib DOCSDIR="share/doc/mypaint"  EXAMPLESDIR="share/examples/mypaint"  DATADIR="share/mypaint"  WWWDIR="www/mypaint"  ETCDIR="etc/mypaint"
--End PLIST_SUB--

--SUB_LIST--
PREFIX=/usr/local LOCALBASE=/usr/local  DATADIR=/usr/local/share/mypaint DOCSDIR=/usr/local/share/doc/mypaint EXAMPLESDIR=/usr/local/share/examples/mypaint  WWWDIR=/usr/local/www/mypaint ETCDIR=/usr/local/etc/mypaint
--End SUB_LIST--

---Begin make.conf---
USE_PACKAGE_DEPENDS=yes
BATCH=yes
WRKDIRPREFIX=/wrkdirs
PORTSDIR=/usr/ports
PACKAGES=/packages
DISTDIR=/distfiles
PACKAGE_BUILDING=yes
PACKAGE_BUILDING_FLAVORS=yes
#### /usr/local/etc/poudriere.d/make.conf ####
# XXX: We really need this but cannot use it while 'make checksum' does not
# try the next mirror on checksum failure.  It currently retries the same
# failed mirror and then fails rather then trying another.  It *does*
# try the next if the size is mismatched though.
#MASTER_SITE_FREEBSD=yes
# Build ALLOW_MAKE_JOBS_PACKAGES with 2 jobs
MAKE_JOBS_NUMBER=2
#### /usr/ports/Mk/Scripts/ports_env.sh ####
_CCVERSION_921dbbb2=FreeBSD clang version 13.0.0 (git@github.com:llvm/llvm-project.git llvmorg-13.0.0-0-gd7b669b3a303) Target: x86_64-unknown-freebsd14.0 Thread model: posix InstalledDir: /usr/bin
_ALTCCVERSION_921dbbb2=none
_CXXINTERNAL_acaad9ca=FreeBSD clang version 13.0.0 (git@github.com:llvm/llvm-project.git llvmorg-13.0.0-0-gd7b669b3a303) Target: x86_64-unknown-freebsd14.0 Thread model: posix InstalledDir: /usr/bin "/usr/bin/ld" "--eh-frame-hdr" "-dynamic-linker" "/libexec/ld-elf.so.1" "--hash-style=both" "--enable-new-dtags" "-o" "a.out" "/usr/lib/crt1.o" "/usr/lib/crti.o" "/usr/lib/crtbegin.o" "-L/usr/lib" "/dev/null" "-lc++" "-lm" "-lgcc" "--as-needed" "-lgcc_s" "--no-as-needed" "-lc" "-lgcc" "--as-needed" "-lgcc_s" "--no-as-needed" "/usr/lib/crtend.o" "/usr/lib/crtn.o"
CC_OUTPUT_921dbbb2_58173849=yes
CC_OUTPUT_921dbbb2_9bdba57c=yes
CC_OUTPUT_921dbbb2_6a4fe7f5=yes
CC_OUTPUT_921dbbb2_6bcac02b=yes
CC_OUTPUT_921dbbb2_67d20829=yes
CC_OUTPUT_921dbbb2_bfa62e83=yes
CC_OUTPUT_921dbbb2_f0b4d593=yes
CC_OUTPUT_921dbbb2_308abb44=yes
CC_OUTPUT_921dbbb2_f00456e5=yes
CC_OUTPUT_921dbbb2_65ad290d=yes
CC_OUTPUT_921dbbb2_f2776b26=yes
CC_OUTPUT_921dbbb2_b2657cc3=yes
CC_OUTPUT_921dbbb2_380987f7=yes
CC_OUTPUT_921dbbb2_160933ec=yes
CC_OUTPUT_921dbbb2_fb62803b=yes
_OBJC_CCVERSION_921dbbb2=FreeBSD clang version 13.0.0 (git@github.com:llvm/llvm-project.git llvmorg-13.0.0-0-gd7b669b3a303) Target: x86_64-unknown-freebsd14.0 Thread model: posix InstalledDir: /usr/bin
_OBJC_ALTCCVERSION_921dbbb2=none
ARCH=amd64
OPSYS=FreeBSD
_OSRELEASE=14.0-CURRENT
OSREL=14.0
OSVERSION=1400043
PYTHONBASE=/usr/local
HAVE_COMPAT_IA32_KERN=YES
CONFIGURE_MAX_CMD_LEN=524288
HAVE_PORTS_ENV=1
#### Misc Poudriere ####
GID=0
UID=0
---End make.conf---
--Resource limits--
cpu time               (seconds, -t)  unlimited
file size           (512-blocks, -f)  unlimited
data seg size           (kbytes, -d)  33554432
stack size              (kbytes, -s)  524288
core file size      (512-blocks, -c)  unlimited
max memory size         (kbytes, -m)  unlimited
locked memory           (kbytes, -l)  unlimited
max user processes              (-u)  89999
open files                      (-n)  1024
virtual mem size        (kbytes, -v)  unlimited
swap limit              (kbytes, -w)  unlimited
socket buffer size       (bytes, -b)  unlimited
pseudo-terminals                (-p)  unlimited
kqueues                         (-k)  unlimited
umtx shared locks               (-o)  unlimited
--End resource limits--
=======================<phase: check-sanity   >============================
===>  License GPLv2+ accepted by the user
===========================================================================
=======================<phase: pkg-depends    >============================
===>   mypaint-2.0.0_3 depends on file: /usr/local/sbin/pkg - not found
===>   Installing existing package /packages/All/pkg-1.17.5.pkg
[main-amd64-default-job-03] Installing pkg-1.17.5...
[main-amd64-default-job-03] Extracting pkg-1.17.5: .......... done
===>   mypaint-2.0.0_3 depends on file: /usr/local/sbin/pkg - found
===>   Returning to build of mypaint-2.0.0_3
===========================================================================
=======================<phase: fetch-depends  >============================
===========================================================================
=======================<phase: fetch          >============================
===>  License GPLv2+ accepted by the user
===> Fetching all distfiles required by mypaint-2.0.0_3 for building
===========================================================================
=======================<phase: checksum       >============================
===>  License GPLv2+ accepted by the user
===> Fetching all distfiles required by mypaint-2.0.0_3 for building
=> SHA256 Checksum OK for mypaint-mypaint-v2.0.0_GH0.tar.gz.
=> SHA256 Checksum OK for 94c623b788462fadb3e292b918edc4e90adf4faa.patch.
===========================================================================
=======================<phase: extract-depends>============================
===========================================================================
=======================<phase: extract        >============================
===>  License GPLv2+ accepted by the user
===> Fetching all distfiles required by mypaint-2.0.0_3 for building
===>  Extracting for mypaint-2.0.0_3
=> SHA256 Checksum OK for mypaint-mypaint-v2.0.0_GH0.tar.gz.
=> SHA256 Checksum OK for 94c623b788462fadb3e292b918edc4e90adf4faa.patch.
===========================================================================
=======================<phase: patch-depends  >============================
===========================================================================
=======================<phase: patch          >============================
===>  Patching for mypaint-2.0.0_3
===>  Applying distribution patches for mypaint-2.0.0_3
===========================================================================
=======================<phase: build-depends  >============================
===>   mypaint-2.0.0_3 depends on executable: swig - not found
===>   Installing existing package /packages/All/swig-4.0.2.pkg
[main-amd64-default-job-03] Installing swig-4.0.2...
<snip>
If you want to use tcsd with software TPM emulator, use the following
configuration in /etc/rc.conf:

tcsd_enable="YES"
tcsd_mode="emulator"
tpmd_enable="YES"

To use TPM, add your_account to '_tss' group like following:

# pw groupmod _tss -m your_account
===>   mypaint-2.0.0_3 depends on shared library: libgtk-3.so - found (/usr/local/lib/libgtk-3.so)
===>   Returning to build of mypaint-2.0.0_3
===>   mypaint-2.0.0_3 depends on shared library: libgsf-1.so - found (/usr/local/lib/libgsf-1.so)
===>   mypaint-2.0.0_3 depends on shared library: libxml2.so - found (/usr/local/lib/libxml2.so)
===>   mypaint-2.0.0_3 depends on shared library: libpango-1.0.so - found (/usr/local/lib/libpango-1.0.so)
===========================================================================
=======================<phase: configure      >============================
===>  Configuring for mypaint-2.0.0_3
running config
/usr/local/lib/python3.8/site-packages/setuptools/dist.py:691: UserWarning: Usage of dash-separated 'install-scripts' will not be supported in future versions. Please use the underscore name 'install_scripts' instead
  warnings.warn(
/usr/local/lib/python3.8/site-packages/setuptools/dist.py:691: UserWarning: Usage of dash-separated 'install-platlib' will not be supported in future versions. Please use the underscore name 'install_platlib' instead
  warnings.warn(
/usr/local/lib/python3.8/site-packages/setuptools/dist.py:691: UserWarning: Usage of dash-separated 'install-purelib' will not be supported in future versions. Please use the underscore name 'install_purelib' instead
  warnings.warn(
/usr/local/lib/python3.8/site-packages/setuptools/dist.py:691: UserWarning: Usage of dash-separated 'install-data' will not be supported in future versions. Please use the underscore name 'install_data' instead
  warnings.warn(
/usr/local/lib/python3.8/site-packages/setuptools/dist.py:691: UserWarning: Usage of dash-separated 'install-headers' will not be supported in future versions. Please use the underscore name 'install_headers' instead
  warnings.warn(
===========================================================================
=======================<phase: build          >============================
===>  Building for mypaint-2.0.0_3
running build
running build_config
running build_ext
building 'lib._mypaintlib' extension
swigging lib/mypaintlib.i to lib/mypaintlib_wrap.cpp
swig -python -Wall -noproxydel -c++ -I/usr/local/lib/python3.8/site-packages/numpy/core/include -I/usr/local/include/libmypaint -I/usr/local/include -I/usr/local/include/json-c -I/usr/local/include/glib-2.0 -I/usr/local/lib/glib-2.0/include -I/usr/local/include/pygobject-3.0 -I/usr/local/include/libpng16 -I/usr/local/include/gtk-3.0 -I/usr/local/include/pango-1.0 -I/usr/local/include/harfbuzz -I/usr/local/include/freetype2 -I/usr/local/include/fribidi -I/usr/local/include/cairo -I/usr/local/include/pixman-1 -I/usr/local/include/gdk-pixbuf-2.0 -I/usr/local/include/gio-unix-2.0 -I/usr/local/include/libepoll-shim -I/usr/local/include/atk-1.0 -I/usr/local/include/at-spi2-atk/2.0 -I/usr/local/include/dbus-1.0 -I/usr/local/lib/dbus-1.0/include -I/usr/local/include/at-spi-2.0 -DNO_TESTS -o lib/mypaintlib_wrap.cpp lib/mypaintlib.i
Deprecated command line option: -noproxydel. This option is now always on.
creating build
creating build/temp.freebsd-14.0-CURRENT-amd64-3.8
creating build/temp.freebsd-14.0-CURRENT-amd64-3.8/lib
creating build/temp.freebsd-14.0-CURRENT-amd64-3.8/lib/fill
cc -Wno-unused-result -Wsign-compare -Wunreachable-code -DNDEBUG -O2 -pipe -fstack-protector-strong -fno-strict-aliasing -O2 -pipe -fstack-protector-strong -isystem /usr/local/include -fno-strict-aliasing -isystem /usr/local/include -fPIC -I/usr/local/lib/python3.8/site-packages/numpy/core/include -I/usr/local/include/libmypaint -I/usr/local/include -I/usr/local/include/json-c -I/usr/local/include/glib-2.0 -I/usr/local/lib/glib-2.0/include -I/usr/local/include/pygobject-3.0 -I/usr/local/include/libpng16 -I/usr/local/include/gtk-3.0 -I/usr/local/include/pango-1.0 -I/usr/local/include/harfbuzz -I/usr/local/include/freetype2 -I/usr/local/include/fribidi -I/usr/local/include/cairo -I/usr/local/include/pixman-1 -I/usr/local/include/gdk-pixbuf-2.0 -I/usr/local/include/gio-unix-2.0 -I/usr/local/include/libepoll-shim -I/usr/local/include/atk-1.0 -I/usr/local/include/at-spi2-atk/2.0 -I/usr/local/include/dbus-1.0 -I/usr/local/lib/dbus-1.0/include -I/usr/local/include/at-spi-2.0 -I/usr/local/in
 clude/python3.8 -c lib/mypaintlib_wrap.cpp -o build/temp.freebsd-14.0-CURRENT-amd64-3.8/lib/mypaintlib_wrap.o --std=c++11 -Wall -Wno-sign-compare -Wno-write-strings -D_POSIX_C_SOURCE=200809L -DNO_TESTS -g -D_THREAD_SAFE -pthread -DMYPAINT_BRUSHES_DIR=\"/usr/local/share/mypaint-data/2.0/brushes\" -fopenmp -O3
In file included from <built-in>:376:
<command line>:5:30: warning: missing terminating '"' character [-Winvalid-pp-token]
#define MYPAINT_BRUSHES_DIR \"/usr/local/share/mypaint-data/2.0/brushes\"
                             ^
lib/mypaintlib_wrap.cpp:1783:7: warning: 'tp_print' is deprecated [-Wdeprecated-declarations]
      0,                                    /* tp_print */
      ^
/usr/local/include/python3.8/cpython/object.h:260:5: note: 'tp_print' has been explicitly marked deprecated here
    Py_DEPRECATED(3.8) int (*tp_print)(PyObject *, FILE *, int);
    ^
/usr/local/include/python3.8/pyport.h:515:54: note: expanded from macro 'Py_DEPRECATED'
#define Py_DEPRECATED(VERSION_UNUSED) __attribute__((__deprecated__))
                                                     ^
In file included from lib/mypaintlib_wrap.cpp:181:
In file included from /usr/local/include/python3.8/Python.h:85:
In file included from /usr/local/include/python3.8/pytime.h:6:
In file included from /usr/local/include/python3.8/object.h:746:
/usr/local/include/python3.8/cpython/object.h:177:16: warning: 'tp_print' is deprecated [-Wdeprecated-declarations]
typedef struct _typeobject {
               ^
lib/mypaintlib_wrap.cpp:1793:23: note: in implicit copy assignment operator for '_typeobject' first required here
    swigpyobject_type = tmp;
                      ^
/usr/local/include/python3.8/cpython/object.h:260:5: note: 'tp_print' has been explicitly marked deprecated here
    Py_DEPRECATED(3.8) int (*tp_print)(PyObject *, FILE *, int);
    ^
/usr/local/include/python3.8/pyport.h:515:54: note: expanded from macro 'Py_DEPRECATED'
#define Py_DEPRECATED(VERSION_UNUSED) __attribute__((__deprecated__))
                                                     ^
In file included from lib/mypaintlib_wrap.cpp:181:
In file included from /usr/local/include/python3.8/Python.h:85:
In file included from /usr/local/include/python3.8/pytime.h:6:
In file included from /usr/local/include/python3.8/object.h:746:
/usr/local/include/python3.8/cpython/object.h:177:16: warning: 'tp_print' is deprecated [-Wdeprecated-declarations]
typedef struct _typeobject {
               ^
/usr/local/include/python3.8/cpython/object.h:260:5: note: 'tp_print' has been explicitly marked deprecated here
    Py_DEPRECATED(3.8) int (*tp_print)(PyObject *, FILE *, int);
    ^
/usr/local/include/python3.8/pyport.h:515:54: note: expanded from macro 'Py_DEPRECATED'
#define Py_DEPRECATED(VERSION_UNUSED) __attribute__((__deprecated__))
                                                     ^
lib/mypaintlib_wrap.cpp:1950:7: warning: 'tp_print' is deprecated [-Wdeprecated-declarations]
      0,                                    /* tp_print */
      ^
/usr/local/include/python3.8/cpython/object.h:260:5: note: 'tp_print' has been explicitly marked deprecated here
    Py_DEPRECATED(3.8) int (*tp_print)(PyObject *, FILE *, int);
    ^
/usr/local/include/python3.8/pyport.h:515:54: note: expanded from macro 'Py_DEPRECATED'
#define Py_DEPRECATED(VERSION_UNUSED) __attribute__((__deprecated__))
                                                     ^
lib/mypaintlib_wrap.cpp:19008:9: warning: 'tp_print' is deprecated [-Wdeprecated-declarations]
        0,                                  /* tp_print */
        ^
/usr/local/include/python3.8/cpython/object.h:260:5: note: 'tp_print' has been explicitly marked deprecated here
    Py_DEPRECATED(3.8) int (*tp_print)(PyObject *, FILE *, int);
    ^
/usr/local/include/python3.8/pyport.h:515:54: note: expanded from macro 'Py_DEPRECATED'
#define Py_DEPRECATED(VERSION_UNUSED) __attribute__((__deprecated__))
                                                     ^
In file included from lib/mypaintlib_wrap.cpp:2839:
In file included from lib/mypaintlib.hpp:18:
lib/tiledsurface.hpp:127:24: warning: private field 'tile_request' is not used [-Wunused-private-field]
    MyPaintTileRequest tile_request;
                       ^
7 warnings generated.
cc -Wno-unused-result -Wsign-compare -Wunreachable-code -DNDEBUG -O2 -pipe -fstack-protector-strong -fno-strict-aliasing -O2 -pipe -fstack-protector-strong -isystem /usr/local/include -fno-strict-aliasing -isystem /usr/local/include -fPIC -I/usr/local/lib/python3.8/site-packages/numpy/core/include -I/usr/local/include/libmypaint -I/usr/local/include -I/usr/local/include/json-c -I/usr/local/include/glib-2.0 -I/usr/local/lib/glib-2.0/include -I/usr/local/include/pygobject-3.0 -I/usr/local/include/libpng16 -I/usr/local/include/gtk-3.0 -I/usr/local/include/pango-1.0 -I/usr/local/include/harfbuzz -I/usr/local/include/freetype2 -I/usr/local/include/fribidi -I/usr/local/include/cairo -I/usr/local/include/pixman-1 -I/usr/local/include/gdk-pixbuf-2.0 -I/usr/local/include/gio-unix-2.0 -I/usr/local/include/libepoll-shim -I/usr/local/include/atk-1.0 -I/usr/local/include/at-spi2-atk/2.0 -I/usr/local/include/dbus-1.0 -I/usr/local/lib/dbus-1.0/include -I/usr/local/include/at-spi-2.0 -I/usr/local/in
 clude/python3.8 -c lib/gdkpixbuf2numpy.cpp -o build/temp.freebsd-14.0-CURRENT-amd64-3.8/lib/gdkpixbuf2numpy.o --std=c++11 -Wall -Wno-sign-compare -Wno-write-strings -D_POSIX_C_SOURCE=200809L -DNO_TESTS -g -D_THREAD_SAFE -pthread -DMYPAINT_BRUSHES_DIR=\"/usr/local/share/mypaint-data/2.0/brushes\" -fopenmp -O3
In file included from <built-in>:376:
<command line>:5:30: warning: missing terminating '"' character [-Winvalid-pp-token]
#define MYPAINT_BRUSHES_DIR \"/usr/local/share/mypaint-data/2.0/brushes\"
                             ^
1 warning generated.
cc -Wno-unused-result -Wsign-compare -Wunreachable-code -DNDEBUG -O2 -pipe -fstack-protector-strong -fno-strict-aliasing -O2 -pipe -fstack-protector-strong -isystem /usr/local/include -fno-strict-aliasing -isystem /usr/local/include -fPIC -I/usr/local/lib/python3.8/site-packages/numpy/core/include -I/usr/local/include/libmypaint -I/usr/local/include -I/usr/local/include/json-c -I/usr/local/include/glib-2.0 -I/usr/local/lib/glib-2.0/include -I/usr/local/include/pygobject-3.0 -I/usr/local/include/libpng16 -I/usr/local/include/gtk-3.0 -I/usr/local/include/pango-1.0 -I/usr/local/include/harfbuzz -I/usr/local/include/freetype2 -I/usr/local/include/fribidi -I/usr/local/include/cairo -I/usr/local/include/pixman-1 -I/usr/local/include/gdk-pixbuf-2.0 -I/usr/local/include/gio-unix-2.0 -I/usr/local/include/libepoll-shim -I/usr/local/include/atk-1.0 -I/usr/local/include/at-spi2-atk/2.0 -I/usr/local/include/dbus-1.0 -I/usr/local/lib/dbus-1.0/include -I/usr/local/include/at-spi-2.0 -I/usr/local/in
 clude/python3.8 -c lib/pixops.cpp -o build/temp.freebsd-14.0-CURRENT-amd64-3.8/lib/pixops.o --std=c++11 -Wall -Wno-sign-compare -Wno-write-strings -D_POSIX_C_SOURCE=200809L -DNO_TESTS -g -D_THREAD_SAFE -pthread -DMYPAINT_BRUSHES_DIR=\"/usr/local/share/mypaint-data/2.0/brushes\" -fopenmp -O3
In file included from <built-in>:376:
<command line>:5:30: warning: missing terminating '"' character [-Winvalid-pp-token]
#define MYPAINT_BRUSHES_DIR \"/usr/local/share/mypaint-data/2.0/brushes\"
                             ^
1 warning generated.
cc -Wno-unused-result -Wsign-compare -Wunreachable-code -DNDEBUG -O2 -pipe -fstack-protector-strong -fno-strict-aliasing -O2 -pipe -fstack-protector-strong -isystem /usr/local/include -fno-strict-aliasing -isystem /usr/local/include -fPIC -I/usr/local/lib/python3.8/site-packages/numpy/core/include -I/usr/local/include/libmypaint -I/usr/local/include -I/usr/local/include/json-c -I/usr/local/include/glib-2.0 -I/usr/local/lib/glib-2.0/include -I/usr/local/include/pygobject-3.0 -I/usr/local/include/libpng16 -I/usr/local/include/gtk-3.0 -I/usr/local/include/pango-1.0 -I/usr/local/include/harfbuzz -I/usr/local/include/freetype2 -I/usr/local/include/fribidi -I/usr/local/include/cairo -I/usr/local/include/pixman-1 -I/usr/local/include/gdk-pixbuf-2.0 -I/usr/local/include/gio-unix-2.0 -I/usr/local/include/libepoll-shim -I/usr/local/include/atk-1.0 -I/usr/local/include/at-spi2-atk/2.0 -I/usr/local/include/dbus-1.0 -I/usr/local/lib/dbus-1.0/include -I/usr/local/include/at-spi-2.0 -I/usr/local/in
 clude/python3.8 -c lib/fastpng.cpp -o build/temp.freebsd-14.0-CURRENT-amd64-3.8/lib/fastpng.o --std=c++11 -Wall -Wno-sign-compare -Wno-write-strings -D_POSIX_C_SOURCE=200809L -DNO_TESTS -g -D_THREAD_SAFE -pthread -DMYPAINT_BRUSHES_DIR=\"/usr/local/share/mypaint-data/2.0/brushes\" -fopenmp -O3
In file included from <built-in>:376:
<command line>:5:30: warning: missing terminating '"' character [-Winvalid-pp-token]
#define MYPAINT_BRUSHES_DIR \"/usr/local/share/mypaint-data/2.0/brushes\"
                             ^
lib/fastpng.cpp:395:21: warning: unused variable 'PNG_gAMA_scale' [-Wunused-const-variable]
static const double PNG_gAMA_scale = 100000;
                    ^
2 warnings generated.
cc -Wno-unused-result -Wsign-compare -Wunreachable-code -DNDEBUG -O2 -pipe -fstack-protector-strong -fno-strict-aliasing -O2 -pipe -fstack-protector-strong -isystem /usr/local/include -fno-strict-aliasing -isystem /usr/local/include -fPIC -I/usr/local/lib/python3.8/site-packages/numpy/core/include -I/usr/local/include/libmypaint -I/usr/local/include -I/usr/local/include/json-c -I/usr/local/include/glib-2.0 -I/usr/local/lib/glib-2.0/include -I/usr/local/include/pygobject-3.0 -I/usr/local/include/libpng16 -I/usr/local/include/gtk-3.0 -I/usr/local/include/pango-1.0 -I/usr/local/include/harfbuzz -I/usr/local/include/freetype2 -I/usr/local/include/fribidi -I/usr/local/include/cairo -I/usr/local/include/pixman-1 -I/usr/local/include/gdk-pixbuf-2.0 -I/usr/local/include/gio-unix-2.0 -I/usr/local/include/libepoll-shim -I/usr/local/include/atk-1.0 -I/usr/local/include/at-spi2-atk/2.0 -I/usr/local/include/dbus-1.0 -I/usr/local/lib/dbus-1.0/include -I/usr/local/include/at-spi-2.0 -I/usr/local/in
 clude/python3.8 -c lib/brushsettings.cpp -o build/temp.freebsd-14.0-CURRENT-amd64-3.8/lib/brushsettings.o --std=c++11 -Wall -Wno-sign-compare -Wno-write-strings -D_POSIX_C_SOURCE=200809L -DNO_TESTS -g -D_THREAD_SAFE -pthread -DMYPAINT_BRUSHES_DIR=\"/usr/local/share/mypaint-data/2.0/brushes\" -fopenmp -O3
In file included from <built-in>:376:
<command line>:5:30: warning: missing terminating '"' character [-Winvalid-pp-token]
#define MYPAINT_BRUSHES_DIR \"/usr/local/share/mypaint-data/2.0/brushes\"
                             ^
1 warning generated.
cc -Wno-unused-result -Wsign-compare -Wunreachable-code -DNDEBUG -O2 -pipe -fstack-protector-strong -fno-strict-aliasing -O2 -pipe -fstack-protector-strong -isystem /usr/local/include -fno-strict-aliasing -isystem /usr/local/include -fPIC -I/usr/local/lib/python3.8/site-packages/numpy/core/include -I/usr/local/include/libmypaint -I/usr/local/include -I/usr/local/include/json-c -I/usr/local/include/glib-2.0 -I/usr/local/lib/glib-2.0/include -I/usr/local/include/pygobject-3.0 -I/usr/local/include/libpng16 -I/usr/local/include/gtk-3.0 -I/usr/local/include/pango-1.0 -I/usr/local/include/harfbuzz -I/usr/local/include/freetype2 -I/usr/local/include/fribidi -I/usr/local/include/cairo -I/usr/local/include/pixman-1 -I/usr/local/include/gdk-pixbuf-2.0 -I/usr/local/include/gio-unix-2.0 -I/usr/local/include/libepoll-shim -I/usr/local/include/atk-1.0 -I/usr/local/include/at-spi2-atk/2.0 -I/usr/local/include/dbus-1.0 -I/usr/local/lib/dbus-1.0/include -I/usr/local/include/at-spi-2.0 -I/usr/local/in
 clude/python3.8 -c lib/fill/fill_common.cpp -o build/temp.freebsd-14.0-CURRENT-amd64-3.8/lib/fill/fill_common.o --std=c++11 -Wall -Wno-sign-compare -Wno-write-strings -D_POSIX_C_SOURCE=200809L -DNO_TESTS -g -D_THREAD_SAFE -pthread -DMYPAINT_BRUSHES_DIR=\"/usr/local/share/mypaint-data/2.0/brushes\" -fopenmp -O3
In file included from <built-in>:376:
<command line>:5:30: warning: missing terminating '"' character [-Winvalid-pp-token]
#define MYPAINT_BRUSHES_DIR \"/usr/local/share/mypaint-data/2.0/brushes\"
                             ^
1 warning generated.
cc -Wno-unused-result -Wsign-compare -Wunreachable-code -DNDEBUG -O2 -pipe -fstack-protector-strong -fno-strict-aliasing -O2 -pipe -fstack-protector-strong -isystem /usr/local/include -fno-strict-aliasing -isystem /usr/local/include -fPIC -I/usr/local/lib/python3.8/site-packages/numpy/core/include -I/usr/local/include/libmypaint -I/usr/local/include -I/usr/local/include/json-c -I/usr/local/include/glib-2.0 -I/usr/local/lib/glib-2.0/include -I/usr/local/include/pygobject-3.0 -I/usr/local/include/libpng16 -I/usr/local/include/gtk-3.0 -I/usr/local/include/pango-1.0 -I/usr/local/include/harfbuzz -I/usr/local/include/freetype2 -I/usr/local/include/fribidi -I/usr/local/include/cairo -I/usr/local/include/pixman-1 -I/usr/local/include/gdk-pixbuf-2.0 -I/usr/local/include/gio-unix-2.0 -I/usr/local/include/libepoll-shim -I/usr/local/include/atk-1.0 -I/usr/local/include/at-spi2-atk/2.0 -I/usr/local/include/dbus-1.0 -I/usr/local/lib/dbus-1.0/include -I/usr/local/include/at-spi-2.0 -I/usr/local/in
 clude/python3.8 -c lib/fill/fill_constants.cpp -o build/temp.freebsd-14.0-CURRENT-amd64-3.8/lib/fill/fill_constants.o --std=c++11 -Wall -Wno-sign-compare -Wno-write-strings -D_POSIX_C_SOURCE=200809L -DNO_TESTS -g -D_THREAD_SAFE -pthread -DMYPAINT_BRUSHES_DIR=\"/usr/local/share/mypaint-data/2.0/brushes\" -fopenmp -O3
In file included from <built-in>:376:
<command line>:5:30: warning: missing terminating '"' character [-Winvalid-pp-token]
#define MYPAINT_BRUSHES_DIR \"/usr/local/share/mypaint-data/2.0/brushes\"
                             ^
1 warning generated.
cc -Wno-unused-result -Wsign-compare -Wunreachable-code -DNDEBUG -O2 -pipe -fstack-protector-strong -fno-strict-aliasing -O2 -pipe -fstack-protector-strong -isystem /usr/local/include -fno-strict-aliasing -isystem /usr/local/include -fPIC -I/usr/local/lib/python3.8/site-packages/numpy/core/include -I/usr/local/include/libmypaint -I/usr/local/include -I/usr/local/include/json-c -I/usr/local/include/glib-2.0 -I/usr/local/lib/glib-2.0/include -I/usr/local/include/pygobject-3.0 -I/usr/local/include/libpng16 -I/usr/local/include/gtk-3.0 -I/usr/local/include/pango-1.0 -I/usr/local/include/harfbuzz -I/usr/local/include/freetype2 -I/usr/local/include/fribidi -I/usr/local/include/cairo -I/usr/local/include/pixman-1 -I/usr/local/include/gdk-pixbuf-2.0 -I/usr/local/include/gio-unix-2.0 -I/usr/local/include/libepoll-shim -I/usr/local/include/atk-1.0 -I/usr/local/include/at-spi2-atk/2.0 -I/usr/local/include/dbus-1.0 -I/usr/local/lib/dbus-1.0/include -I/usr/local/include/at-spi-2.0 -I/usr/local/in
 clude/python3.8 -c lib/fill/floodfill.cpp -o build/temp.freebsd-14.0-CURRENT-amd64-3.8/lib/fill/floodfill.o --std=c++11 -Wall -Wno-sign-compare -Wno-write-strings -D_POSIX_C_SOURCE=200809L -DNO_TESTS -g -D_THREAD_SAFE -pthread -DMYPAINT_BRUSHES_DIR=\"/usr/local/share/mypaint-data/2.0/brushes\" -fopenmp -O3
In file included from <built-in>:376:
<command line>:5:30: warning: missing terminating '"' character [-Winvalid-pp-token]
#define MYPAINT_BRUSHES_DIR \"/usr/local/share/mypaint-data/2.0/brushes\"
                             ^
In file included from lib/fill/floodfill.cpp:10:
In file included from lib/fill/floodfill.hpp:15:
In file included from lib/fill/fill_common.hpp:17:
In file included from /usr/local/include/python3.8/Python.h:36:
/usr/include/unistd.h:509:19: error: use of undeclared identifier 'u_long'; did you mean 'long'?
char    *fflagstostr(u_long);
                     ^
/usr/include/unistd.h:563:18: error: unknown type name 'fd_set'
int      select(int, fd_set *, fd_set *, fd_set *, struct timeval *);
                     ^
/usr/include/unistd.h:563:28: error: unknown type name 'fd_set'
int      select(int, fd_set *, fd_set *, fd_set *, struct timeval *);
                               ^
/usr/include/unistd.h:563:38: error: unknown type name 'fd_set'
int      select(int, fd_set *, fd_set *, fd_set *, struct timeval *);
                                         ^
/usr/include/unistd.h:580:27: error: unknown type name 'u_long'; did you mean 'long'?
int      strtofflags(char **, u_long *, u_long *);
                              ^
/usr/include/unistd.h:580:37: error: unknown type name 'u_long'; did you mean 'long'?
int      strtofflags(char **, u_long *, u_long *);
                                        ^
In file included from lib/fill/floodfill.cpp:10:
In file included from lib/fill/floodfill.hpp:15:
In file included from lib/fill/fill_common.hpp:17:
In file included from /usr/local/include/python3.8/Python.h:63:
In file included from /usr/local/include/python3.8/pyport.h:219:
/usr/include/sys/time.h:97:34: error: unknown type name 'u_int'
bintime_mul(struct bintime *_bt, u_int _x)
                                 ^
1 warning and 7 errors generated.
/usr/local/lib/python3.8/site-packages/setuptools/dist.py:691: UserWarning: Usage of dash-separated 'install-scripts' will not be supported in future versions. Please use the underscore name 'install_scripts' instead
  warnings.warn(
/usr/local/lib/python3.8/site-packages/setuptools/dist.py:691: UserWarning: Usage of dash-separated 'install-platlib' will not be supported in future versions. Please use the underscore name 'install_platlib' instead
  warnings.warn(
/usr/local/lib/python3.8/site-packages/setuptools/dist.py:691: UserWarning: Usage of dash-separated 'install-purelib' will not be supported in future versions. Please use the underscore name 'install_purelib' instead
  warnings.warn(
/usr/local/lib/python3.8/site-packages/setuptools/dist.py:691: UserWarning: Usage of dash-separated 'install-data' will not be supported in future versions. Please use the underscore name 'install_data' instead
  warnings.warn(
/usr/local/lib/python3.8/site-packages/setuptools/dist.py:691: UserWarning: Usage of dash-separated 'install-headers' will not be supported in future versions. Please use the underscore name 'install_headers' instead
  warnings.warn(
error: command 'cc' failed with exit status 1
*** Error code 1

Stop.
make: stopped in /usr/ports/graphics/mypaint