[package - main-amd64-default][emulators/wine-devel] Failed for wine-devel-6.22,1 in build

From: <pkg-fallout_at_FreeBSD.org>
Date: Sat, 04 Dec 2021 14:55:57 UTC
You are receiving this mail as a port that you maintain
is failing to build on the FreeBSD package build server.
Please investigate the failure and submit a PR to fix
build.

Maintainer:     damjan.jov@gmail.com
Log URL:        http://beefy18.nyi.freebsd.org/data/main-amd64-default/pd684832c1aed_sfc21aafe5f/logs/wine-devel-6.22,1.log
Build URL:      http://beefy18.nyi.freebsd.org/build.html?mastername=main-amd64-default&build=pd684832c1aed_sfc21aafe5f
Log:

=>> Building emulators/wine-devel
build started at Sat Dec  4 14:49:03 UTC 2021
port directory: /usr/ports/emulators/wine-devel
package name: wine-devel-6.22,1
building for: FreeBSD main-amd64-default-job-12 14.0-CURRENT FreeBSD 14.0-CURRENT 1400043 amd64
maintained by: damjan.jov@gmail.com
Makefile ident: 
Poudriere version: 3.2.8-21-g883afb07
Host OSVERSION: 1400042
Jail OSVERSION: 1400043
Job Id: 12




!!! Jail is newer than host. (Jail: 1400043, Host: 1400042) !!!
!!! This is not supported. !!!
!!! Host kernel must be same or newer than jail. !!!
!!! Expect build failures. !!!



---Begin Environment---
SHELL=/bin/sh
OSVERSION=1400043
UNAME_v=FreeBSD 14.0-CURRENT 1400043
UNAME_r=14.0-CURRENT
BLOCKSIZE=K
MAIL=/var/mail/root
MM_CHARSET=UTF-8
LANG=C.UTF-8
STATUS=1
HOME=/root
PATH=/sbin:/bin:/usr/sbin:/usr/bin:/usr/local/sbin:/usr/local/bin:/root/bin
LOCALBASE=/usr/local
USER=root
LIBEXECPREFIX=/usr/local/libexec/poudriere
POUDRIERE_VERSION=3.2.8-21-g883afb07
MASTERMNT=/usr/local/poudriere/data/.m/main-amd64-default/ref
POUDRIERE_BUILD_TYPE=bulk
PACKAGE_BUILDING=yes
SAVED_TERM=
PWD=/usr/local/poudriere/data/.m/main-amd64-default/ref/.p/pool
P_PORTS_FEATURES=FLAVORS SELECTED_OPTIONS
MASTERNAME=main-amd64-default
SCRIPTPREFIX=/usr/local/share/poudriere
OLDPWD=/usr/local/poudriere/data/.m/main-amd64-default/ref/.p
SCRIPTPATH=/usr/local/share/poudriere/bulk.sh
POUDRIEREPATH=/usr/local/bin/poudriere
---End Environment---

---Begin Poudriere Port Flags/Env---
PORT_FLAGS=
PKGENV=
FLAVOR=
DEPENDS_ARGS=
MAKE_ARGS=
---End Poudriere Port Flags/Env---

---Begin OPTIONS List---
===> The following configuration options are available for wine-devel-6.22,1:
     CUPS=off: CUPS printing system support
     DOCS=on: Build and/or install documentation
     DOSBOX=off: Use DOSBox to run MS-DOS programs
     GECKO=off: Bundle Gecko MSI package for Wine
     GNUTLS=on: SSL/TLS support via GnuTLS
     LDAP=off: LDAP protocol support
     MONO=off: Bundle Mono MSI package for Wine
     OPENAL=on: Audio support via OpenAL
     STAGING=off: Include Wine Staging patchset (experimental&unsupported)
     V4L=off: Video 4 Linux support
     WINEMAKER=off: Fully support winemaker (requires Perl)
     X11=on: X11 (graphics) support
===> Use 'make config' to modify these settings
---End OPTIONS List---

--MAINTAINER--
damjan.jov@gmail.com
--End MAINTAINER--

--CONFIGURE_ARGS--
--verbose  --disable-kerberos  --disable-tests  --without-alsa  --without-capi  --without-coreaudio  --without-dbus  --without-gettext --without-gettextpo  --without-gphoto  --without-gstreamer  --without-hal  --without-inotify  --without-krb5  --without-mingw  --without-netapi  --without-opencl  --without-osmesa  --with-oss  --with-pcap  --with-pthread  --without-pulse  --without-quicktime  --without-sane  --with-sdl  --without-udev  --without-unwind  --without-usb --without-cups --with-gnutls --without-ldap --with-openal --without-v4l2 --with-x --with-fontconfig --with-freetype --with-opengl --with-vkd3d --with-xinerama --with-xinput2 --with-xrandr --with-xrender --enable-win64 --libdir=/usr/local/lib --x-libraries=/usr/local/lib --x-includes=/usr/local/include --prefix=/usr/local ${_LATE_CONFIGURE_ARGS}
--End CONFIGURE_ARGS--

--CONFIGURE_ENV--
CPPBIN="cpp10" FLEX="/usr/local/bin/flex" MAKE=gmake PKG_CONFIG=pkgconf SDL2_CONFIG=/usr/local/bin/sdl2-config XDG_DATA_HOME=/wrkdirs/usr/ports/emulators/wine-devel/work  XDG_CONFIG_HOME=/wrkdirs/usr/ports/emulators/wine-devel/work  XDG_CACHE_HOME=/wrkdirs/usr/ports/emulators/wine-devel/work/.cache  HOME=/wrkdirs/usr/ports/emulators/wine-devel/work TMPDIR="/tmp" PATH=/wrkdirs/usr/ports/emulators/wine-devel/work/.bin:/sbin:/bin:/usr/sbin:/usr/bin:/usr/local/sbin:/usr/local/bin:/root/bin SHELL=/bin/sh CONFIG_SHELL=/bin/sh ADDR2LINE="/usr/local/bin/addr2line" AR="/usr/local/bin/ar" AS="/usr/local/bin/as" CPPFILT="/usr/local/bin/c++filt" GPROF="/usr/local/bin/gprof" LD="/usr/local/bin/ld" NM="/usr/local/bin/nm" OBJCOPY="/usr/local/bin/objcopy" OBJDUMP="/usr/local/bin/objdump" RANLIB="/usr/local/bin/ranlib" READELF="/usr/local/bin/readelf" SIZE="/usr/local/bin/size" STRINGS="/usr/local/bin/strings" CMAKE_PREFIX_PATH="/usr/local" CONFIG_SITE=/usr/ports/Templates/config.site lt_cv_sys_max_c
 md_len=524288
--End CONFIGURE_ENV--

--MAKE_ENV--
SDL2_CONFIG=/usr/local/bin/sdl2-config XDG_DATA_HOME=/wrkdirs/usr/ports/emulators/wine-devel/work  XDG_CONFIG_HOME=/wrkdirs/usr/ports/emulators/wine-devel/work  XDG_CACHE_HOME=/wrkdirs/usr/ports/emulators/wine-devel/work/.cache  HOME=/wrkdirs/usr/ports/emulators/wine-devel/work TMPDIR="/tmp" PATH=/wrkdirs/usr/ports/emulators/wine-devel/work/.bin:/sbin:/bin:/usr/sbin:/usr/bin:/usr/local/sbin:/usr/local/bin:/root/bin NO_PIE=yes MK_DEBUG_FILES=no MK_KERNEL_SYMBOLS=no SHELL=/bin/sh NO_LINT=YES ADDR2LINE="/usr/local/bin/addr2line" AR="/usr/local/bin/ar" AS="/usr/local/bin/as" CPPFILT="/usr/local/bin/c++filt" GPROF="/usr/local/bin/gprof" LD="/usr/local/bin/ld" NM="/usr/local/bin/nm" OBJCOPY="/usr/local/bin/objcopy" OBJDUMP="/usr/local/bin/objdump" RANLIB="/usr/local/bin/ranlib" READELF="/usr/local/bin/readelf" SIZE="/usr/local/bin/size" STRINGS="/usr/local/bin/strings" PREFIX=/usr/local  LOCALBASE=/usr/local  CC="gcc10" CFLAGS="-O2 -pipe  -fstack-protector-strong -Wl,-rpath=/usr/local/lib/
 gcc10 -isystem /usr/local/include -fno-strict-aliasing "  CPP="cpp10" CPPFLAGS="-isystem /usr/local/include"  LDFLAGS=" -fstack-protector-strong -Wl,-rpath=/usr/local/lib/gcc10 -L/usr/local/lib/gcc10 " LIBS="-L/usr/local/lib"  CXX="g++10" CXXFLAGS="-O2 -pipe  -fstack-protector-strong -Wl,-rpath=/usr/local/lib/gcc10  -Wl,-rpath=/usr/local/lib/gcc10 -isystem /usr/local/include "  MANPREFIX="/usr/local" BSD_INSTALL_PROGRAM="install  -s -m 555"  BSD_INSTALL_LIB="install  -s -m 0644"  BSD_INSTALL_SCRIPT="install  -m 555"  BSD_INSTALL_DATA="install  -m 0644"  BSD_INSTALL_MAN="install  -m 444"
--End MAKE_ENV--

--PLIST_SUB--
PORTDOCS="" CUPS="@comment " NO_CUPS="" DOCS="" NO_DOCS="@comment " DOSBOX="@comment " NO_DOSBOX="" GECKO="@comment " NO_GECKO="" GNUTLS="" NO_GNUTLS="@comment " LDAP="@comment " NO_LDAP="" MONO="@comment " NO_MONO="" OPENAL="" NO_OPENAL="@comment " STAGING="@comment " NO_STAGING="" V4L="@comment " NO_V4L="" WINEMAKER="@comment " NO_WINEMAKER="" X11="" NO_X11="@comment " WINE32="@comment " WINE64="" WINEARCH="x86_64" OSREL=14.0 PREFIX=%D LOCALBASE=/usr/local  RESETPREFIX=/usr/local LIB32DIR=lib DOCSDIR="share/doc/wine"  EXAMPLESDIR="share/examples/wine"  DATADIR="share/wine"  WWWDIR="www/wine"  ETCDIR="etc/wine"
--End PLIST_SUB--

--SUB_LIST--
CUPS="@comment " NO_CUPS="" DOCS="" NO_DOCS="@comment " DOSBOX="@comment " NO_DOSBOX="" GECKO="@comment " NO_GECKO="" GNUTLS="" NO_GNUTLS="@comment " LDAP="@comment " NO_LDAP="" MONO="@comment " NO_MONO="" OPENAL="" NO_OPENAL="@comment " STAGING="@comment " NO_STAGING="" V4L="@comment " NO_V4L="" WINEMAKER="@comment " NO_WINEMAKER="" X11="" NO_X11="@comment " PREFIX=/usr/local LOCALBASE=/usr/local  DATADIR=/usr/local/share/wine DOCSDIR=/usr/local/share/doc/wine EXAMPLESDIR=/usr/local/share/examples/wine  WWWDIR=/usr/local/www/wine ETCDIR=/usr/local/etc/wine
--End SUB_LIST--

---Begin make.conf---
USE_PACKAGE_DEPENDS=yes
BATCH=yes
WRKDIRPREFIX=/wrkdirs
PORTSDIR=/usr/ports
PACKAGES=/packages
DISTDIR=/distfiles
PACKAGE_BUILDING=yes
PACKAGE_BUILDING_FLAVORS=yes
#### /usr/local/etc/poudriere.d/make.conf ####
# XXX: We really need this but cannot use it while 'make checksum' does not
# try the next mirror on checksum failure.  It currently retries the same
# failed mirror and then fails rather then trying another.  It *does*
# try the next if the size is mismatched though.
#MASTER_SITE_FREEBSD=yes
# Build ALLOW_MAKE_JOBS_PACKAGES with 2 jobs
MAKE_JOBS_NUMBER=2
#### /usr/ports/Mk/Scripts/ports_env.sh ####
_CCVERSION_921dbbb2=FreeBSD clang version 13.0.0 (git@github.com:llvm/llvm-project.git llvmorg-13.0.0-0-gd7b669b3a303) Target: x86_64-unknown-freebsd14.0 Thread model: posix InstalledDir: /usr/bin
_ALTCCVERSION_921dbbb2=none
_CXXINTERNAL_acaad9ca=FreeBSD clang version 13.0.0 (git@github.com:llvm/llvm-project.git llvmorg-13.0.0-0-gd7b669b3a303) Target: x86_64-unknown-freebsd14.0 Thread model: posix InstalledDir: /usr/bin "/usr/bin/ld" "--eh-frame-hdr" "-dynamic-linker" "/libexec/ld-elf.so.1" "--hash-style=both" "--enable-new-dtags" "-o" "a.out" "/usr/lib/crt1.o" "/usr/lib/crti.o" "/usr/lib/crtbegin.o" "-L/usr/lib" "/dev/null" "-lc++" "-lm" "-lgcc" "--as-needed" "-lgcc_s" "--no-as-needed" "-lc" "-lgcc" "--as-needed" "-lgcc_s" "--no-as-needed" "/usr/lib/crtend.o" "/usr/lib/crtn.o"
CC_OUTPUT_921dbbb2_58173849=yes
CC_OUTPUT_921dbbb2_9bdba57c=yes
CC_OUTPUT_921dbbb2_6a4fe7f5=yes
CC_OUTPUT_921dbbb2_6bcac02b=yes
CC_OUTPUT_921dbbb2_67d20829=yes
CC_OUTPUT_921dbbb2_bfa62e83=yes
CC_OUTPUT_921dbbb2_f0b4d593=yes
CC_OUTPUT_921dbbb2_308abb44=yes
CC_OUTPUT_921dbbb2_f00456e5=yes
CC_OUTPUT_921dbbb2_65ad290d=yes
CC_OUTPUT_921dbbb2_f2776b26=yes
CC_OUTPUT_921dbbb2_b2657cc3=yes
CC_OUTPUT_921dbbb2_380987f7=yes
CC_OUTPUT_921dbbb2_160933ec=yes
CC_OUTPUT_921dbbb2_fb62803b=yes
_OBJC_CCVERSION_921dbbb2=FreeBSD clang version 13.0.0 (git@github.com:llvm/llvm-project.git llvmorg-13.0.0-0-gd7b669b3a303) Target: x86_64-unknown-freebsd14.0 Thread model: posix InstalledDir: /usr/bin
_OBJC_ALTCCVERSION_921dbbb2=none
ARCH=amd64
OPSYS=FreeBSD
_OSRELEASE=14.0-CURRENT
OSREL=14.0
OSVERSION=1400043
PYTHONBASE=/usr/local
HAVE_COMPAT_IA32_KERN=YES
CONFIGURE_MAX_CMD_LEN=524288
HAVE_PORTS_ENV=1
#### Misc Poudriere ####
GID=0
UID=0
---End make.conf---
--Resource limits--
cpu time               (seconds, -t)  unlimited
file size           (512-blocks, -f)  unlimited
data seg size           (kbytes, -d)  33554432
stack size              (kbytes, -s)  524288
core file size      (512-blocks, -c)  unlimited
max memory size         (kbytes, -m)  unlimited
locked memory           (kbytes, -l)  unlimited
max user processes              (-u)  89999
open files                      (-n)  1024
virtual mem size        (kbytes, -v)  unlimited
swap limit              (kbytes, -w)  unlimited
socket buffer size       (bytes, -b)  unlimited
pseudo-terminals                (-p)  unlimited
kqueues                         (-k)  unlimited
umtx shared locks               (-o)  unlimited
--End resource limits--
=======================<phase: check-sanity   >============================
===>  License LGPL21 LGPL3 accepted by the user
===========================================================================
=======================<phase: pkg-depends    >============================
===>   wine-devel-6.22,1 depends on file: /usr/local/sbin/pkg - not found
===>   Installing existing package /packages/All/pkg-1.17.5.pkg
[main-amd64-default-job-12] Installing pkg-1.17.5...
[main-amd64-default-job-12] Extracting pkg-1.17.5: .......... done
===>   wine-devel-6.22,1 depends on file: /usr/local/sbin/pkg - found
===>   Returning to build of wine-devel-6.22,1
===========================================================================
=======================<phase: fetch-depends  >============================
===========================================================================
=======================<phase: fetch          >============================
===>  License LGPL21 LGPL3 accepted by the user
===> Fetching all distfiles required by wine-devel-6.22,1 for building
===========================================================================
=======================<phase: checksum       >============================
===>  License LGPL21 LGPL3 accepted by the user
===> Fetching all distfiles required by wine-devel-6.22,1 for building
=> SHA256 Checksum OK for wine-6.22.tar.xz.
===========================================================================
=======================<phase: extract-depends>============================
===========================================================================
=======================<phase: extract        >============================
===>  License LGPL21 LGPL3 accepted by the user
===> Fetching all distfiles required by wine-devel-6.22,1 for building
===>  Extracting for wine-devel-6.22,1
=> SHA256 Checksum OK for wine-6.22.tar.xz.
===========================================================================
=======================<phase: patch-depends  >============================
<snip>
      | ^~~~
gcc10 -m64 -c -o server/file.o server/file.c -Iserver -Iinclude -D__WINESRC__ -Wall -pipe -fcf-protection=none \
  -fno-stack-protector -fno-strict-aliasing -Wdeclaration-after-statement -Wempty-body \
  -Wignored-qualifiers -Winit-self -Wno-packed-not-aligned -Wshift-overflow=2 -Wstrict-prototypes \
  -Wtype-limits -Wunused-but-set-parameter -Wvla -Wwrite-strings -Wpointer-arith -Wlogical-op \
  -isystem /usr/local/include -O2 -pipe  -fstack-protector-strong -Wl,-rpath=/usr/local/lib/gcc10 -isystem /usr/local/include -fno-strict-aliasing 
gcc10 -m64 -c -o server/handle.o server/handle.c -Iserver -Iinclude -D__WINESRC__ -Wall -pipe -fcf-protection=none \
  -fno-stack-protector -fno-strict-aliasing -Wdeclaration-after-statement -Wempty-body \
  -Wignored-qualifiers -Winit-self -Wno-packed-not-aligned -Wshift-overflow=2 -Wstrict-prototypes \
  -Wtype-limits -Wunused-but-set-parameter -Wvla -Wwrite-strings -Wpointer-arith -Wlogical-op \
  -isystem /usr/local/include -O2 -pipe  -fstack-protector-strong -Wl,-rpath=/usr/local/lib/gcc10 -isystem /usr/local/include -fno-strict-aliasing 
gcc10 -m64 -c -o server/hook.o server/hook.c -Iserver -Iinclude -D__WINESRC__ -Wall -pipe -fcf-protection=none \
  -fno-stack-protector -fno-strict-aliasing -Wdeclaration-after-statement -Wempty-body \
  -Wignored-qualifiers -Winit-self -Wno-packed-not-aligned -Wshift-overflow=2 -Wstrict-prototypes \
  -Wtype-limits -Wunused-but-set-parameter -Wvla -Wwrite-strings -Wpointer-arith -Wlogical-op \
  -isystem /usr/local/include -O2 -pipe  -fstack-protector-strong -Wl,-rpath=/usr/local/lib/gcc10 -isystem /usr/local/include -fno-strict-aliasing 
gcc10 -m64 -c -o server/mach.o server/mach.c -Iserver -Iinclude -D__WINESRC__ -Wall -pipe -fcf-protection=none \
  -fno-stack-protector -fno-strict-aliasing -Wdeclaration-after-statement -Wempty-body \
  -Wignored-qualifiers -Winit-self -Wno-packed-not-aligned -Wshift-overflow=2 -Wstrict-prototypes \
  -Wtype-limits -Wunused-but-set-parameter -Wvla -Wwrite-strings -Wpointer-arith -Wlogical-op \
  -isystem /usr/local/include -O2 -pipe  -fstack-protector-strong -Wl,-rpath=/usr/local/lib/gcc10 -isystem /usr/local/include -fno-strict-aliasing 
gcc10 -m64 -c -o server/mailslot.o server/mailslot.c -Iserver -Iinclude -D__WINESRC__ -Wall -pipe -fcf-protection=none \
  -fno-stack-protector -fno-strict-aliasing -Wdeclaration-after-statement -Wempty-body \
  -Wignored-qualifiers -Winit-self -Wno-packed-not-aligned -Wshift-overflow=2 -Wstrict-prototypes \
  -Wtype-limits -Wunused-but-set-parameter -Wvla -Wwrite-strings -Wpointer-arith -Wlogical-op \
  -isystem /usr/local/include -O2 -pipe  -fstack-protector-strong -Wl,-rpath=/usr/local/lib/gcc10 -isystem /usr/local/include -fno-strict-aliasing 
gcc10 -m64 -c -o server/main.o server/main.c -Iserver -Iinclude -D__WINESRC__ -Wall -pipe -fcf-protection=none \
  -fno-stack-protector -fno-strict-aliasing -Wdeclaration-after-statement -Wempty-body \
  -Wignored-qualifiers -Winit-self -Wno-packed-not-aligned -Wshift-overflow=2 -Wstrict-prototypes \
  -Wtype-limits -Wunused-but-set-parameter -Wvla -Wwrite-strings -Wpointer-arith -Wlogical-op \
  -isystem /usr/local/include -O2 -pipe  -fstack-protector-strong -Wl,-rpath=/usr/local/lib/gcc10 -isystem /usr/local/include -fno-strict-aliasing 
gcc10 -m64 -c -o server/mapping.o server/mapping.c -Iserver -Iinclude -D__WINESRC__ -Wall -pipe -fcf-protection=none \
  -fno-stack-protector -fno-strict-aliasing -Wdeclaration-after-statement -Wempty-body \
  -Wignored-qualifiers -Winit-self -Wno-packed-not-aligned -Wshift-overflow=2 -Wstrict-prototypes \
  -Wtype-limits -Wunused-but-set-parameter -Wvla -Wwrite-strings -Wpointer-arith -Wlogical-op \
  -isystem /usr/local/include -O2 -pipe  -fstack-protector-strong -Wl,-rpath=/usr/local/lib/gcc10 -isystem /usr/local/include -fno-strict-aliasing 
gcc10 -m64 -c -o server/mutex.o server/mutex.c -Iserver -Iinclude -D__WINESRC__ -Wall -pipe -fcf-protection=none \
  -fno-stack-protector -fno-strict-aliasing -Wdeclaration-after-statement -Wempty-body \
  -Wignored-qualifiers -Winit-self -Wno-packed-not-aligned -Wshift-overflow=2 -Wstrict-prototypes \
  -Wtype-limits -Wunused-but-set-parameter -Wvla -Wwrite-strings -Wpointer-arith -Wlogical-op \
  -isystem /usr/local/include -O2 -pipe  -fstack-protector-strong -Wl,-rpath=/usr/local/lib/gcc10 -isystem /usr/local/include -fno-strict-aliasing 
In file included from server/mapping.c:39:
include/ddk/wdm.h:1653:1: warning: 'fastcall' attribute ignored [-Wattributes]
 1653 | void    FASTCALL ExAcquireFastMutex(FAST_MUTEX*);
      | ^~~~
include/ddk/wdm.h:1654:1: warning: 'fastcall' attribute ignored [-Wattributes]
 1654 | void    FASTCALL ExAcquireFastMutexUnsafe(PFAST_MUTEX);
      | ^~~~
include/ddk/wdm.h:1680:1: warning: 'fastcall' attribute ignored [-Wattributes]
 1680 | void    FASTCALL ExReleaseFastMutex(FAST_MUTEX*);
      | ^~~~
include/ddk/wdm.h:1681:1: warning: 'fastcall' attribute ignored [-Wattributes]
 1681 | void    FASTCALL ExReleaseFastMutexUnsafe(PFAST_MUTEX);
      | ^~~~
include/ddk/wdm.h:1739:1: warning: 'fastcall' attribute ignored [-Wattributes]
 1739 | void    FASTCALL KeAcquireInStackQueuedSpinLockAtDpcLevel(KSPIN_LOCK*,KLOCK_QUEUE_HANDLE*);
      | ^~~~
include/ddk/wdm.h:1774:1: warning: 'fastcall' attribute ignored [-Wattributes]
 1774 | void    FASTCALL KeReleaseInStackQueuedSpinLockFromDpcLevel(KLOCK_QUEUE_HANDLE*);
      | ^~~~
include/ddk/wdm.h:1814:1: warning: 'fastcall' attribute ignored [-Wattributes]
 1814 | void    FASTCALL ObfReferenceObject(void*);
      | ^~~~
gcc10 -m64 -c -o server/named_pipe.o server/named_pipe.c -Iserver -Iinclude -D__WINESRC__ -Wall -pipe \
  -fcf-protection=none -fno-stack-protector -fno-strict-aliasing -Wdeclaration-after-statement \
  -Wempty-body -Wignored-qualifiers -Winit-self -Wno-packed-not-aligned -Wshift-overflow=2 \
  -Wstrict-prototypes -Wtype-limits -Wunused-but-set-parameter -Wvla -Wwrite-strings -Wpointer-arith \
  -Wlogical-op -isystem /usr/local/include -O2 -pipe  -fstack-protector-strong -Wl,-rpath=/usr/local/lib/gcc10 -isystem /usr/local/include -fno-strict-aliasing 
gcc10 -m64 -c -o server/object.o server/object.c -Iserver -Iinclude -D__WINESRC__ -Wall -pipe -fcf-protection=none \
  -fno-stack-protector -fno-strict-aliasing -Wdeclaration-after-statement -Wempty-body \
  -Wignored-qualifiers -Winit-self -Wno-packed-not-aligned -Wshift-overflow=2 -Wstrict-prototypes \
  -Wtype-limits -Wunused-but-set-parameter -Wvla -Wwrite-strings -Wpointer-arith -Wlogical-op \
  -isystem /usr/local/include -O2 -pipe  -fstack-protector-strong -Wl,-rpath=/usr/local/lib/gcc10 -isystem /usr/local/include -fno-strict-aliasing 
gcc10 -m64 -c -o server/process.o server/process.c -Iserver -Iinclude -D__WINESRC__ -Wall -pipe -fcf-protection=none \
  -fno-stack-protector -fno-strict-aliasing -Wdeclaration-after-statement -Wempty-body \
  -Wignored-qualifiers -Winit-self -Wno-packed-not-aligned -Wshift-overflow=2 -Wstrict-prototypes \
  -Wtype-limits -Wunused-but-set-parameter -Wvla -Wwrite-strings -Wpointer-arith -Wlogical-op \
  -isystem /usr/local/include -O2 -pipe  -fstack-protector-strong -Wl,-rpath=/usr/local/lib/gcc10 -isystem /usr/local/include -fno-strict-aliasing 
gcc10 -m64 -c -o server/procfs.o server/procfs.c -Iserver -Iinclude -D__WINESRC__ -Wall -pipe -fcf-protection=none \
  -fno-stack-protector -fno-strict-aliasing -Wdeclaration-after-statement -Wempty-body \
  -Wignored-qualifiers -Winit-self -Wno-packed-not-aligned -Wshift-overflow=2 -Wstrict-prototypes \
  -Wtype-limits -Wunused-but-set-parameter -Wvla -Wwrite-strings -Wpointer-arith -Wlogical-op \
  -isystem /usr/local/include -O2 -pipe  -fstack-protector-strong -Wl,-rpath=/usr/local/lib/gcc10 -isystem /usr/local/include -fno-strict-aliasing 
gcc10 -m64 -c -o server/ptrace.o server/ptrace.c -Iserver -Iinclude -D__WINESRC__ -Wall -pipe -fcf-protection=none \
  -fno-stack-protector -fno-strict-aliasing -Wdeclaration-after-statement -Wempty-body \
  -Wignored-qualifiers -Winit-self -Wno-packed-not-aligned -Wshift-overflow=2 -Wstrict-prototypes \
  -Wtype-limits -Wunused-but-set-parameter -Wvla -Wwrite-strings -Wpointer-arith -Wlogical-op \
  -isystem /usr/local/include -O2 -pipe  -fstack-protector-strong -Wl,-rpath=/usr/local/lib/gcc10 -isystem /usr/local/include -fno-strict-aliasing 
server/ptrace.c:166:12: warning: 'get_ptrace_tid' defined but not used [-Wunused-function]
  166 | static int get_ptrace_tid( struct thread *thread )
      |            ^~~~~~~~~~~~~~
gcc10 -m64 -c -o server/queue.o server/queue.c -Iserver -Iinclude -D__WINESRC__ -Wall -pipe -fcf-protection=none \
  -fno-stack-protector -fno-strict-aliasing -Wdeclaration-after-statement -Wempty-body \
  -Wignored-qualifiers -Winit-self -Wno-packed-not-aligned -Wshift-overflow=2 -Wstrict-prototypes \
  -Wtype-limits -Wunused-but-set-parameter -Wvla -Wwrite-strings -Wpointer-arith -Wlogical-op \
  -isystem /usr/local/include -O2 -pipe  -fstack-protector-strong -Wl,-rpath=/usr/local/lib/gcc10 -isystem /usr/local/include -fno-strict-aliasing 
gcc10 -m64 -c -o server/region.o server/region.c -Iserver -Iinclude -D__WINESRC__ -Wall -pipe -fcf-protection=none \
  -fno-stack-protector -fno-strict-aliasing -Wdeclaration-after-statement -Wempty-body \
  -Wignored-qualifiers -Winit-self -Wno-packed-not-aligned -Wshift-overflow=2 -Wstrict-prototypes \
  -Wtype-limits -Wunused-but-set-parameter -Wvla -Wwrite-strings -Wpointer-arith -Wlogical-op \
  -isystem /usr/local/include -O2 -pipe  -fstack-protector-strong -Wl,-rpath=/usr/local/lib/gcc10 -isystem /usr/local/include -fno-strict-aliasing 
gcc10 -m64 -c -o server/registry.o server/registry.c -Iserver -Iinclude -D__WINESRC__ -Wall -pipe -fcf-protection=none \
  -fno-stack-protector -fno-strict-aliasing -Wdeclaration-after-statement -Wempty-body \
  -Wignored-qualifiers -Winit-self -Wno-packed-not-aligned -Wshift-overflow=2 -Wstrict-prototypes \
  -Wtype-limits -Wunused-but-set-parameter -Wvla -Wwrite-strings -Wpointer-arith -Wlogical-op \
  -isystem /usr/local/include -O2 -pipe  -fstack-protector-strong -Wl,-rpath=/usr/local/lib/gcc10 -isystem /usr/local/include -fno-strict-aliasing 
gcc10 -m64 -c -o server/request.o server/request.c -Iserver -Iinclude -D__WINESRC__ -Wall -pipe -fcf-protection=none \
  -fno-stack-protector -fno-strict-aliasing -Wdeclaration-after-statement -Wempty-body \
  -Wignored-qualifiers -Winit-self -Wno-packed-not-aligned -Wshift-overflow=2 -Wstrict-prototypes \
  -Wtype-limits -Wunused-but-set-parameter -Wvla -Wwrite-strings -Wpointer-arith -Wlogical-op \
  -isystem /usr/local/include -O2 -pipe  -fstack-protector-strong -Wl,-rpath=/usr/local/lib/gcc10 -isystem /usr/local/include -fno-strict-aliasing 
gcc10 -m64 -c -o server/semaphore.o server/semaphore.c -Iserver -Iinclude -D__WINESRC__ -Wall -pipe -fcf-protection=none \
  -fno-stack-protector -fno-strict-aliasing -Wdeclaration-after-statement -Wempty-body \
  -Wignored-qualifiers -Winit-self -Wno-packed-not-aligned -Wshift-overflow=2 -Wstrict-prototypes \
  -Wtype-limits -Wunused-but-set-parameter -Wvla -Wwrite-strings -Wpointer-arith -Wlogical-op \
  -isystem /usr/local/include -O2 -pipe  -fstack-protector-strong -Wl,-rpath=/usr/local/lib/gcc10 -isystem /usr/local/include -fno-strict-aliasing 
gcc10 -m64 -c -o server/serial.o server/serial.c -Iserver -Iinclude -D__WINESRC__ -Wall -pipe -fcf-protection=none \
  -fno-stack-protector -fno-strict-aliasing -Wdeclaration-after-statement -Wempty-body \
  -Wignored-qualifiers -Winit-self -Wno-packed-not-aligned -Wshift-overflow=2 -Wstrict-prototypes \
  -Wtype-limits -Wunused-but-set-parameter -Wvla -Wwrite-strings -Wpointer-arith -Wlogical-op \
  -isystem /usr/local/include -O2 -pipe  -fstack-protector-strong -Wl,-rpath=/usr/local/lib/gcc10 -isystem /usr/local/include -fno-strict-aliasing 
gcc10 -m64 -c -o server/signal.o server/signal.c -Iserver -Iinclude -D__WINESRC__ -Wall -pipe -fcf-protection=none \
  -fno-stack-protector -fno-strict-aliasing -Wdeclaration-after-statement -Wempty-body \
  -Wignored-qualifiers -Winit-self -Wno-packed-not-aligned -Wshift-overflow=2 -Wstrict-prototypes \
  -Wtype-limits -Wunused-but-set-parameter -Wvla -Wwrite-strings -Wpointer-arith -Wlogical-op \
  -isystem /usr/local/include -O2 -pipe  -fstack-protector-strong -Wl,-rpath=/usr/local/lib/gcc10 -isystem /usr/local/include -fno-strict-aliasing 
gcc10 -m64 -c -o server/symlink.o server/symlink.c -Iserver -Iinclude -D__WINESRC__ -Wall -pipe -fcf-protection=none \
  -fno-stack-protector -fno-strict-aliasing -Wdeclaration-after-statement -Wempty-body \
  -Wignored-qualifiers -Winit-self -Wno-packed-not-aligned -Wshift-overflow=2 -Wstrict-prototypes \
  -Wtype-limits -Wunused-but-set-parameter -Wvla -Wwrite-strings -Wpointer-arith -Wlogical-op \
  -isystem /usr/local/include -O2 -pipe  -fstack-protector-strong -Wl,-rpath=/usr/local/lib/gcc10 -isystem /usr/local/include -fno-strict-aliasing 
gcc10 -m64 -c -o server/thread.o server/thread.c -Iserver -Iinclude -D__WINESRC__ -Wall -pipe -fcf-protection=none \
  -fno-stack-protector -fno-strict-aliasing -Wdeclaration-after-statement -Wempty-body \
  -Wignored-qualifiers -Winit-self -Wno-packed-not-aligned -Wshift-overflow=2 -Wstrict-prototypes \
  -Wtype-limits -Wunused-but-set-parameter -Wvla -Wwrite-strings -Wpointer-arith -Wlogical-op \
  -isystem /usr/local/include -O2 -pipe  -fstack-protector-strong -Wl,-rpath=/usr/local/lib/gcc10 -isystem /usr/local/include -fno-strict-aliasing 
In file included from server/symlink.c:33:
include/ddk/wdm.h:1653:1: warning: 'fastcall' attribute ignored [-Wattributes]
 1653 | void    FASTCALL ExAcquireFastMutex(FAST_MUTEX*);
      | ^~~~
include/ddk/wdm.h:1654:1: warning: 'fastcall' attribute ignored [-Wattributes]
 1654 | void    FASTCALL ExAcquireFastMutexUnsafe(PFAST_MUTEX);
      | ^~~~
include/ddk/wdm.h:1680:1: warning: 'fastcall' attribute ignored [-Wattributes]
 1680 | void    FASTCALL ExReleaseFastMutex(FAST_MUTEX*);
      | ^~~~
include/ddk/wdm.h:1681:1: warning: 'fastcall' attribute ignored [-Wattributes]
 1681 | void    FASTCALL ExReleaseFastMutexUnsafe(PFAST_MUTEX);
      | ^~~~
include/ddk/wdm.h:1739:1: warning: 'fastcall' attribute ignored [-Wattributes]
 1739 | void    FASTCALL KeAcquireInStackQueuedSpinLockAtDpcLevel(KSPIN_LOCK*,KLOCK_QUEUE_HANDLE*);
      | ^~~~
include/ddk/wdm.h:1774:1: warning: 'fastcall' attribute ignored [-Wattributes]
 1774 | void    FASTCALL KeReleaseInStackQueuedSpinLockFromDpcLevel(KLOCK_QUEUE_HANDLE*);
      | ^~~~
include/ddk/wdm.h:1814:1: warning: 'fastcall' attribute ignored [-Wattributes]
 1814 | void    FASTCALL ObfReferenceObject(void*);
      | ^~~~
server/thread.c: In function 'set_thread_affinity':
server/thread.c:574:9: error: unknown type name 'cpu_set_t'; did you mean 'cpusetid_t'?
  574 |         cpu_set_t set;
      |         ^~~~~~~~~
      |         cpusetid_t
server/thread.c:578:9: warning: implicit declaration of function 'CPU_ZERO' [-Wimplicit-function-declaration]
  578 |         CPU_ZERO( &set );
      |         ^~~~~~~~
server/thread.c:580:34: warning: implicit declaration of function 'CPU_SET'; did you mean 'L_SET'? [-Wimplicit-function-declaration]
  580 |             if (affinity & mask) CPU_SET( i, &set );
      |                                  ^~~~~~~
      |                                  L_SET
gcc10 -m64 -c -o server/timer.o server/timer.c -Iserver -Iinclude -D__WINESRC__ -Wall -pipe -fcf-protection=none \
  -fno-stack-protector -fno-strict-aliasing -Wdeclaration-after-statement -Wempty-body \
  -Wignored-qualifiers -Winit-self -Wno-packed-not-aligned -Wshift-overflow=2 -Wstrict-prototypes \
  -Wtype-limits -Wunused-but-set-parameter -Wvla -Wwrite-strings -Wpointer-arith -Wlogical-op \
  -isystem /usr/local/include -O2 -pipe  -fstack-protector-strong -Wl,-rpath=/usr/local/lib/gcc10 -isystem /usr/local/include -fno-strict-aliasing 
server/thread.c:582:15: warning: implicit declaration of function 'sched_setaffinity' [-Wimplicit-function-declaration]
  582 |         ret = sched_setaffinity( thread->unix_tid, sizeof(set), &set );
      |               ^~~~~~~~~~~~~~~~~
server/thread.c: In function 'get_thread_affinity':
server/thread.c:595:9: error: unknown type name 'cpu_set_t'; did you mean 'cpusetid_t'?
  595 |         cpu_set_t set;
      |         ^~~~~~~~~
      |         cpusetid_t
server/thread.c:598:14: warning: implicit declaration of function 'sched_getaffinity' [-Wimplicit-function-declaration]
  598 |         if (!sched_getaffinity( thread->unix_tid, sizeof(set), &set ))
      |              ^~~~~~~~~~~~~~~~~
server/thread.c:600:21: warning: implicit declaration of function 'CPU_ISSET'; did you mean 'FD_ISSET'? [-Wimplicit-function-declaration]
  600 |                 if (CPU_ISSET( i, &set )) mask |= (affinity_t)1 << i;
      |                     ^~~~~~~~~
      |                     FD_ISSET
gmake[1]: *** [Makefile:184152: server/thread.o] Error 1
gmake[1]: *** Waiting for unfinished jobs....
gmake[1]: Leaving directory '/wrkdirs/usr/ports/emulators/wine-devel/work/wine-6.22'
===> Compilation failed unexpectedly.
Try to set MAKE_JOBS_UNSAFE=yes and rebuild before reporting the failure to
the maintainer.
*** Error code 1

Stop.
make: stopped in /usr/ports/emulators/wine-devel