[package - 130arm64-quarterly][astro/opencpn] Failed for opencpn-5.2.4_3 in build

From: <pkg-fallout_at_FreeBSD.org>
Date: Sun, 1 Aug 2021 18:12:16 GMT
You are receiving this mail as a port that you maintain
is failing to build on the FreeBSD package build server.
Please investigate the failure and submit a PR to fix
build.

Maintainer:     ml_at_netfence.it
Log URL:        http://ampere1.nyi.freebsd.org/data/130arm64-quarterly/e17f46c5dd6b/logs/opencpn-5.2.4_3.log
Build URL:      http://ampere1.nyi.freebsd.org/build.html?mastername=130arm64-quarterly&build=e17f46c5dd6b
Log:

=>> Building astro/opencpn
build started at Sun Aug  1 17:54:39 UTC 2021
port directory: /usr/ports/astro/opencpn
package name: opencpn-5.2.4_3
building for: FreeBSD 130arm64-quarterly-job-12 13.0-RELEASE-p3 FreeBSD 13.0-RELEASE-p3 arm64
maintained by: ml_at_netfence.it
Makefile ident: 
Poudriere version: 3.2.8-21-g883afb07
Host OSVERSION: 1400008
Jail OSVERSION: 1300139
Job Id: 12

---Begin Environment---
SHELL=/bin/csh
OSVERSION=1300139
UNAME_v=FreeBSD 13.0-RELEASE-p3
UNAME_r=13.0-RELEASE-p3
BLOCKSIZE=K
MAIL=/var/mail/root
MM_CHARSET=UTF-8
LANG=C.UTF-8
STATUS=1
HOME=/root
PATH=/sbin:/bin:/usr/sbin:/usr/bin:/usr/local/sbin:/usr/local/bin:/root/bin
LOCALBASE=/usr/local
USER=root
LIBEXECPREFIX=/usr/local/libexec/poudriere
POUDRIERE_VERSION=3.2.8-21-g883afb07
MASTERMNT=/usr/local/poudriere/data/.m/130arm64-quarterly/ref
POUDRIERE_BUILD_TYPE=bulk
PACKAGE_BUILDING=yes
SAVED_TERM=
PWD=/usr/local/poudriere/data/.m/130arm64-quarterly/ref/.p/pool
P_PORTS_FEATURES=FLAVORS SELECTED_OPTIONS
MASTERNAME=130arm64-quarterly
SCRIPTPREFIX=/usr/local/share/poudriere
OLDPWD=/usr/local/poudriere/data/.m/130arm64-quarterly/ref/.p
SCRIPTPATH=/usr/local/share/poudriere/bulk.sh
POUDRIEREPATH=/usr/local/bin/poudriere
---End Environment---

---Begin Poudriere Port Flags/Env---
PORT_FLAGS=
PKGENV=
FLAVOR=
DEPENDS_ARGS=
MAKE_ARGS=
---End Poudriere Port Flags/Env---

---Begin OPTIONS List---
===> The following configuration options are available for opencpn-5.2.4_3:
     DOCS=on: Build and/or install documentation
===> Use 'make config' to modify these settings
---End OPTIONS List---

--MAINTAINER--
ml_at_netfence.it
--End MAINTAINER--

--CONFIGURE_ARGS--
--with-wx-config=/usr/local/bin/wxgtk3u-3.0-config
--End CONFIGURE_ARGS--

--CONFIGURE_ENV--
PKG_CONFIG=pkgconf XDG_DATA_HOME=/wrkdirs/usr/ports/astro/opencpn/work  XDG_CONFIG_HOME=/wrkdirs/usr/ports/astro/opencpn/work  HOME=/wrkdirs/usr/ports/astro/opencpn/work TMPDIR="/tmp" PATH=/wrkdirs/usr/ports/astro/opencpn/work/.bin:/sbin:/bin:/usr/sbin:/usr/bin:/usr/local/sbin:/usr/local/bin:/root/bin SHELL=/bin/sh CONFIG_SHELL=/bin/sh WX_CONFIG=/usr/local/bin/wxgtk3u-3.0-config CMAKE_PREFIX_PATH="/usr/local" LANG=en_US.UTF-8 LC_ALL=en_US.UTF-8
--End CONFIGURE_ENV--

--MAKE_ENV--
NINJA_STATUS="[%p %s/%t] " XDG_DATA_HOME=/wrkdirs/usr/ports/astro/opencpn/work  XDG_CONFIG_HOME=/wrkdirs/usr/ports/astro/opencpn/work  HOME=/wrkdirs/usr/ports/astro/opencpn/work TMPDIR="/tmp" PATH=/wrkdirs/usr/ports/astro/opencpn/work/.bin:/sbin:/bin:/usr/sbin:/usr/bin:/usr/local/sbin:/usr/local/bin:/root/bin NO_PIE=yes MK_DEBUG_FILES=no MK_KERNEL_SYMBOLS=no SHELL=/bin/sh NO_LINT=YES DESTDIR=/wrkdirs/usr/ports/astro/opencpn/work/stage WX_CONFIG=/usr/local/bin/wxgtk3u-3.0-config LANG=en_US.UTF-8 LC_ALL=en_US.UTF-8 PREFIX=/usr/local  LOCALBASE=/usr/local  CC="cc" CFLAGS="-O2 -pipe  -fstack-protector-strong -isystem /usr/local/include -fno-strict-aliasing "  CPP="cpp" CPPFLAGS="-isystem /usr/local/include"  LDFLAGS=" -fstack-protector-strong " LIBS="-L/usr/local/lib"  CXX="c++" CXXFLAGS="-O2 -pipe  -fstack-protector-strong -isystem /usr/local/include -fno-strict-aliasing   -isystem /usr/local/include -std=c++11 "  MANPREFIX="/usr/local" BSD_INSTALL_PROGRAM="install  -s -m 555"  BSD_INST
 ALL_LIB="install  -s -m 0644"  BSD_INSTALL_SCRIPT="install  -m 555"  BSD_INSTALL_DATA="install  -m 0644"  BSD_INSTALL_MAN="install  -m 444"
--End MAKE_ENV--

--PLIST_SUB--
PORTDOCS="" DOCS="" NO_DOCS="_at_comment " CMAKE_BUILD_TYPE="release" GTK2_VERSION="2.10.0"  GTK3_VERSION="3.0.0"  GTK4_VERSION="4.0.0" OSREL=13.0 PREFIX=%D LOCALBASE=/usr/local  RESETPREFIX=/usr/local LIB32DIR=lib DOCSDIR="share/doc/opencpn"  EXAMPLESDIR="share/examples/opencpn"  DATADIR="share/opencpn"  WWWDIR="www/opencpn"  ETCDIR="etc/opencpn"
--End PLIST_SUB--

--SUB_LIST--
DOCS="" NO_DOCS="_at_comment " PREFIX=/usr/local LOCALBASE=/usr/local  DATADIR=/usr/local/share/opencpn DOCSDIR=/usr/local/share/doc/opencpn EXAMPLESDIR=/usr/local/share/examples/opencpn  WWWDIR=/usr/local/www/opencpn ETCDIR=/usr/local/etc/opencpn
--End SUB_LIST--

---Begin make.conf---
USE_PACKAGE_DEPENDS=yes
BATCH=yes
WRKDIRPREFIX=/wrkdirs
PORTSDIR=/usr/ports
PACKAGES=/packages
DISTDIR=/distfiles
PACKAGE_BUILDING=yes
PACKAGE_BUILDING_FLAVORS=yes
#### /usr/local/etc/poudriere.d/make.conf ####
# XXX: We really need this but cannot use it while 'make checksum' does not
# try the next mirror on checksum failure.  It currently retries the same
# failed mirror and then fails rather then trying another.  It *does*
# try the next if the size is mismatched though.
#MASTER_SITE_FREEBSD=yes
# Build ALLOW_MAKE_JOBS_PACKAGES with 2 jobs
MAKE_JOBS_NUMBER=2
#### /usr/ports/Mk/Scripts/ports_env.sh ####
_CCVERSION_921dbbb2=FreeBSD clang version 11.0.1 (git_at_github.com:llvm/llvm-project.git llvmorg-11.0.1-0-g43ff75f2c3fe) Target: aarch64-unknown-freebsd13.0 Thread model: posix InstalledDir: /usr/bin
_ALTCCVERSION_921dbbb2=none
_CXXINTERNAL_acaad9ca=FreeBSD clang version 11.0.1 (git_at_github.com:llvm/llvm-project.git llvmorg-11.0.1-0-g43ff75f2c3fe) Target: aarch64-unknown-freebsd13.0 Thread model: posix InstalledDir: /usr/bin "/usr/bin/ld" "--eh-frame-hdr" "-dynamic-linker" "/libexec/ld-elf.so.1" "--enable-new-dtags" "-o" "a.out" "/usr/lib/crt1.o" "/usr/lib/crti.o" "/usr/lib/crtbegin.o" "-L/usr/lib" "/dev/null" "-lc++" "-lm" "-lgcc" "--as-needed" "-lgcc_s" "--no-as-needed" "-lc" "-lgcc" "--as-needed" "-lgcc_s" "--no-as-needed" "/usr/lib/crtend.o" "/usr/lib/crtn.o"
CC_OUTPUT_921dbbb2_58173849=yes
CC_OUTPUT_921dbbb2_9bdba57c=yes
CC_OUTPUT_921dbbb2_6a4fe7f5=yes
CC_OUTPUT_921dbbb2_6bcac02b=yes
CC_OUTPUT_921dbbb2_67d20829=yes
CC_OUTPUT_921dbbb2_bfa62e83=yes
CC_OUTPUT_921dbbb2_f0b4d593=yes
CC_OUTPUT_921dbbb2_308abb44=yes
CC_OUTPUT_921dbbb2_f00456e5=yes
CC_OUTPUT_921dbbb2_65ad290d=yes
CC_OUTPUT_921dbbb2_f2776b26=yes
CC_OUTPUT_921dbbb2_b2657cc3=yes
CC_OUTPUT_921dbbb2_380987f7=yes
CC_OUTPUT_921dbbb2_160933ec=yes
CC_OUTPUT_921dbbb2_fb62803b=yes
_OBJC_CCVERSION_921dbbb2=FreeBSD clang version 11.0.1 (git_at_github.com:llvm/llvm-project.git llvmorg-11.0.1-0-g43ff75f2c3fe) Target: aarch64-unknown-freebsd13.0 Thread model: posix InstalledDir: /usr/bin
_OBJC_ALTCCVERSION_921dbbb2=none
ARCH=aarch64
OPSYS=FreeBSD
_OSRELEASE=13.0-RELEASE-p3
OSREL=13.0
OSVERSION=1300139
PYTHONBASE=/usr/local
CONFIGURE_MAX_CMD_LEN=524288
HAVE_PORTS_ENV=1
#### Misc Poudriere ####
GID=0
UID=0
---End make.conf---
--Resource limits--
cpu time               (seconds, -t)  unlimited
file size           (512-blocks, -f)  unlimited
data seg size           (kbytes, -d)  1048576
stack size              (kbytes, -s)  1048576
core file size      (512-blocks, -c)  unlimited
max memory size         (kbytes, -m)  unlimited
locked memory           (kbytes, -l)  unlimited
max user processes              (-u)  89999
open files                      (-n)  1024
virtual mem size        (kbytes, -v)  unlimited
swap limit              (kbytes, -w)  unlimited
socket buffer size       (bytes, -b)  unlimited
pseudo-terminals                (-p)  unlimited
kqueues                         (-k)  unlimited
umtx shared locks               (-o)  unlimited
--End resource limits--
=======================<phase: check-sanity   >============================
===>  License GPLv2+ accepted by the user
===========================================================================
=======================<phase: pkg-depends    >============================
===>   opencpn-5.2.4_3 depends on file: /usr/local/sbin/pkg - not found
===>   Installing existing package /packages/All/pkg-1.16.3.txz
[130arm64-quarterly-job-12] Installing pkg-1.16.3...
[130arm64-quarterly-job-12] Extracting pkg-1.16.3: .......... done
===>   opencpn-5.2.4_3 depends on file: /usr/local/sbin/pkg - found
===>   Returning to build of opencpn-5.2.4_3
===========================================================================
=======================<phase: fetch-depends  >============================
===========================================================================
=======================<phase: fetch          >============================
===>  License GPLv2+ accepted by the user
===> Fetching all distfiles required by opencpn-5.2.4_3 for building
===========================================================================
=======================<phase: checksum       >============================
===>  License GPLv2+ accepted by the user
===> Fetching all distfiles required by opencpn-5.2.4_3 for building
=> SHA256 Checksum OK for OpenCPN-OpenCPN-v5.2.4_GH0.tar.gz.
===========================================================================
=======================<phase: extract-depends>============================
===========================================================================
=======================<phase: extract        >============================
===>  License GPLv2+ accepted by the user
===> Fetching all distfiles required by opencpn-5.2.4_3 for building
===>  Extracting for opencpn-5.2.4_3
=> SHA256 Checksum OK for OpenCPN-OpenCPN-v5.2.4_GH0.tar.gz.
===========================================================================
=======================<phase: patch-depends  >============================
===========================================================================
=======================<phase: patch          >============================
===>  Patching for opencpn-5.2.4_3
===>  Applying FreeBSD patches for opencpn-5.2.4_3 from /usr/ports/astro/opencpn/files
===========================================================================
=======================<phase: build-depends  >============================
===>   opencpn-5.2.4_3 depends on file: /usr/local/bin/cmake - not found
===>   Installing existing package /packages/All/cmake-3.20.4.txz
[130arm64-quarterly-job-12] Installing cmake-3.20.4...
[130arm64-quarterly-job-12] `-- Installing curl-7.77.0...
[130arm64-quarterly-job-12] |   `-- Installing ca_root_nss-3.63...
[130arm64-quarterly-job-12] |   `-- Extracting ca_root_nss-3.63: ........ done
[130arm64-quarterly-job-12] |   `-- Installing libnghttp2-1.43.0...
[130arm64-quarterly-job-12] |   `-- Extracting libnghttp2-1.43.0: .......... done
[130arm64-quarterly-job-12] `-- Extracting curl-7.77.0: .......... done
[130arm64-quarterly-job-12] `-- Installing expat-2.4.1...
[130arm64-quarterly-job-12] `-- Extracting expat-2.4.1: .......... done
[130arm64-quarterly-job-12] `-- Installing jsoncpp-1.9.4...
[130arm64-quarterly-job-12] `-- Extracting jsoncpp-1.9.4: .......... done
[130arm64-quarterly-job-12] `-- Installing libarchive-3.5.1,1...
[130arm64-quarterly-job-12] |   `-- Installing liblz4-1.9.3,1...
[130arm64-quarterly-job-12] |   `-- Extracting liblz4-1.9.3,1: .......... done
<snip>
c++: warning: treating 'c' input as 'c++' when in C++ mode, this behavior is deprecated [-Wdeprecated]
c++: warning: argument unused during compilation: '-rdynamic' [-Wunused-command-line-argument]
[ 54% 403/734] /usr/bin/c++ -DHAVE_WEBVIEW -DNDEBUG -DUSE_WX_LOGGING -DWXUSINGDLL -D_FILE_OFFSET_BITS=64 -D_THREAD_SAFE -D__WXGTK__ -DocpnUSE_GL -DocpnUSE_SVG -DwxUSE_WEBVIEW=1 -I/wrkdirs/usr/ports/astro/opencpn/work/OpenCPN-5.2.4/libs/garmin/jeeps -isystem /usr/local/lib/wx/include/gtk3-unicode-3.0 -isystem /usr/local/include/wx-3.0 -O2 -pipe  -fstack-protector-strong -isystem /usr/local/include -fno-strict-aliasing   -isystem /usr/local/include -std=c++11 -pthread -O2 -pipe  -fstack-protector-strong -isystem /usr/local/include -fno-strict-aliasing   -isystem /usr/local/include -std=c++11    -DPREFIX=\"/usr/local\" -fvisibility=hidden -Wall -Wno-unused -fexceptions -rdynamic -fno-strict-aliasing -Wno-deprecated-declarations -std=gnu++11 -MD -MT libs/garmin/CMakeFiles/GARMINHOST.dir/jeeps/gpsdevice_usb.c.o -MF libs/garmin/CMakeFiles/GARMINHOST.dir/jeeps/gpsdevice_usb.c.o.d -o libs/garmin/CMakeFiles/GARMINHOST.dir/jeeps/gpsdevice_usb.c.o -c /wrkdirs/usr/ports/astro/opencpn/work/OpenCP
 N-5.2.4/libs/garmin/jeeps/gpsdevice_usb.c
c++: warning: treating 'c' input as 'c++' when in C++ mode, this behavior is deprecated [-Wdeprecated]
c++: warning: argument unused during compilation: '-rdynamic' [-Wunused-command-line-argument]
[ 54% 404/734] /usr/bin/c++ -DHAVE_WEBVIEW -DNDEBUG -DUSE_WX_LOGGING -DWXUSINGDLL -D_FILE_OFFSET_BITS=64 -D_THREAD_SAFE -D__WXGTK__ -DocpnUSE_GL -DocpnUSE_SVG -DwxUSE_WEBVIEW=1 -I/wrkdirs/usr/ports/astro/opencpn/work/OpenCPN-5.2.4/libs/garmin/jeeps -isystem /usr/local/lib/wx/include/gtk3-unicode-3.0 -isystem /usr/local/include/wx-3.0 -O2 -pipe  -fstack-protector-strong -isystem /usr/local/include -fno-strict-aliasing   -isystem /usr/local/include -std=c++11 -pthread -O2 -pipe  -fstack-protector-strong -isystem /usr/local/include -fno-strict-aliasing   -isystem /usr/local/include -std=c++11    -DPREFIX=\"/usr/local\" -fvisibility=hidden -Wall -Wno-unused -fexceptions -rdynamic -fno-strict-aliasing -Wno-deprecated-declarations -std=gnu++11 -MD -MT libs/garmin/CMakeFiles/GARMINHOST.dir/jeeps/gpsread.c.o -MF libs/garmin/CMakeFiles/GARMINHOST.dir/jeeps/gpsread.c.o.d -o libs/garmin/CMakeFiles/GARMINHOST.dir/jeeps/gpsread.c.o -c /wrkdirs/usr/ports/astro/opencpn/work/OpenCPN-5.2.4/libs/garmi
 n/jeeps/gpsread.c
c++: warning: treating 'c' input as 'c++' when in C++ mode, this behavior is deprecated [-Wdeprecated]
c++: warning: argument unused during compilation: '-rdynamic' [-Wunused-command-line-argument]
[ 55% 405/734] /usr/bin/c++ -DHAVE_WEBVIEW -DNDEBUG -DUSE_WX_LOGGING -DWXUSINGDLL -D_FILE_OFFSET_BITS=64 -D_THREAD_SAFE -D__WXGTK__ -DocpnUSE_GL -DocpnUSE_SVG -DwxUSE_WEBVIEW=1 -I/wrkdirs/usr/ports/astro/opencpn/work/OpenCPN-5.2.4/libs/garmin/jeeps -isystem /usr/local/lib/wx/include/gtk3-unicode-3.0 -isystem /usr/local/include/wx-3.0 -O2 -pipe  -fstack-protector-strong -isystem /usr/local/include -fno-strict-aliasing   -isystem /usr/local/include -std=c++11 -pthread -O2 -pipe  -fstack-protector-strong -isystem /usr/local/include -fno-strict-aliasing   -isystem /usr/local/include -std=c++11    -DPREFIX=\"/usr/local\" -fvisibility=hidden -Wall -Wno-unused -fexceptions -rdynamic -fno-strict-aliasing -Wno-deprecated-declarations -std=gnu++11 -MD -MT libs/garmin/CMakeFiles/GARMINHOST.dir/jeeps/gpsrqst.c.o -MF libs/garmin/CMakeFiles/GARMINHOST.dir/jeeps/gpsrqst.c.o.d -o libs/garmin/CMakeFiles/GARMINHOST.dir/jeeps/gpsrqst.c.o -c /wrkdirs/usr/ports/astro/opencpn/work/OpenCPN-5.2.4/libs/garmi
 n/jeeps/gpsrqst.c
c++: warning: treating 'c' input as 'c++' when in C++ mode, this behavior is deprecated [-Wdeprecated]
c++: warning: argument unused during compilation: '-rdynamic' [-Wunused-command-line-argument]
[ 55% 406/734] /usr/bin/c++ -DHAVE_WEBVIEW -DNDEBUG -DUSE_WX_LOGGING -DWXUSINGDLL -D_FILE_OFFSET_BITS=64 -D_THREAD_SAFE -D__WXGTK__ -DocpnUSE_GL -DocpnUSE_SVG -DwxUSE_WEBVIEW=1 -I/wrkdirs/usr/ports/astro/opencpn/work/OpenCPN-5.2.4/libs/garmin/jeeps -isystem /usr/local/lib/wx/include/gtk3-unicode-3.0 -isystem /usr/local/include/wx-3.0 -O2 -pipe  -fstack-protector-strong -isystem /usr/local/include -fno-strict-aliasing   -isystem /usr/local/include -std=c++11 -pthread -O2 -pipe  -fstack-protector-strong -isystem /usr/local/include -fno-strict-aliasing   -isystem /usr/local/include -std=c++11    -DPREFIX=\"/usr/local\" -fvisibility=hidden -Wall -Wno-unused -fexceptions -rdynamic -fno-strict-aliasing -Wno-deprecated-declarations -std=gnu++11 -MD -MT libs/garmin/CMakeFiles/GARMINHOST.dir/jeeps/gpssend.c.o -MF libs/garmin/CMakeFiles/GARMINHOST.dir/jeeps/gpssend.c.o.d -o libs/garmin/CMakeFiles/GARMINHOST.dir/jeeps/gpssend.c.o -c /wrkdirs/usr/ports/astro/opencpn/work/OpenCPN-5.2.4/libs/garmi
 n/jeeps/gpssend.c
c++: warning: treating 'c' input as 'c++' when in C++ mode, this behavior is deprecated [-Wdeprecated]
c++: warning: argument unused during compilation: '-rdynamic' [-Wunused-command-line-argument]
[ 55% 407/734] /usr/bin/c++ -DHAVE_WEBVIEW -DNDEBUG -DUSE_WX_LOGGING -DWXUSINGDLL -D_FILE_OFFSET_BITS=64 -D_THREAD_SAFE -D__WXGTK__ -DocpnUSE_GL -DocpnUSE_SVG -DwxUSE_WEBVIEW=1 -I/wrkdirs/usr/ports/astro/opencpn/work/OpenCPN-5.2.4/libs/garmin/jeeps -isystem /usr/local/lib/wx/include/gtk3-unicode-3.0 -isystem /usr/local/include/wx-3.0 -O2 -pipe  -fstack-protector-strong -isystem /usr/local/include -fno-strict-aliasing   -isystem /usr/local/include -std=c++11 -pthread -O2 -pipe  -fstack-protector-strong -isystem /usr/local/include -fno-strict-aliasing   -isystem /usr/local/include -std=c++11    -DPREFIX=\"/usr/local\" -fvisibility=hidden -Wall -Wno-unused -fexceptions -rdynamic -fno-strict-aliasing -Wno-deprecated-declarations -std=gnu++11 -MD -MT libs/garmin/CMakeFiles/GARMINHOST.dir/jeeps/gpsutil.c.o -MF libs/garmin/CMakeFiles/GARMINHOST.dir/jeeps/gpsutil.c.o.d -o libs/garmin/CMakeFiles/GARMINHOST.dir/jeeps/gpsutil.c.o -c /wrkdirs/usr/ports/astro/opencpn/work/OpenCPN-5.2.4/libs/garmi
 n/jeeps/gpsutil.c
c++: warning: treating 'c' input as 'c++' when in C++ mode, this behavior is deprecated [-Wdeprecated]
c++: warning: argument unused during compilation: '-rdynamic' [-Wunused-command-line-argument]
[ 55% 408/734] /usr/bin/c++ -DHAVE_WEBVIEW -DNDEBUG -DUSE_WX_LOGGING -DWXUSINGDLL -D_FILE_OFFSET_BITS=64 -D_THREAD_SAFE -D__WXGTK__ -DocpnUSE_GL -DocpnUSE_SVG -DwxUSE_WEBVIEW=1 -I/wrkdirs/usr/ports/astro/opencpn/work/OpenCPN-5.2.4/libs/garmin/jeeps -isystem /usr/local/lib/wx/include/gtk3-unicode-3.0 -isystem /usr/local/include/wx-3.0 -O2 -pipe  -fstack-protector-strong -isystem /usr/local/include -fno-strict-aliasing   -isystem /usr/local/include -std=c++11 -pthread -O2 -pipe  -fstack-protector-strong -isystem /usr/local/include -fno-strict-aliasing   -isystem /usr/local/include -std=c++11    -DPREFIX=\"/usr/local\" -fvisibility=hidden -Wall -Wno-unused -fexceptions -rdynamic -fno-strict-aliasing -Wno-deprecated-declarations -std=gnu++11 -MD -MT libs/garmin/CMakeFiles/GARMINHOST.dir/jeeps/gpsserial.c.o -MF libs/garmin/CMakeFiles/GARMINHOST.dir/jeeps/gpsserial.c.o.d -o libs/garmin/CMakeFiles/GARMINHOST.dir/jeeps/gpsserial.c.o -c /wrkdirs/usr/ports/astro/opencpn/work/OpenCPN-5.2.4/libs
 /garmin/jeeps/gpsserial.c
c++: warning: treating 'c' input as 'c++' when in C++ mode, this behavior is deprecated [-Wdeprecated]
c++: warning: argument unused during compilation: '-rdynamic' [-Wunused-command-line-argument]
[ 55% 409/734] /usr/bin/c++ -DHAVE_WEBVIEW -DNDEBUG -DUSE_WX_LOGGING -DWXUSINGDLL -D_FILE_OFFSET_BITS=64 -D_THREAD_SAFE -D__WXGTK__ -DocpnUSE_GL -DocpnUSE_SVG -DwxUSE_WEBVIEW=1 -I/wrkdirs/usr/ports/astro/opencpn/work/OpenCPN-5.2.4/libs/garmin/jeeps -isystem /usr/local/lib/wx/include/gtk3-unicode-3.0 -isystem /usr/local/include/wx-3.0 -O2 -pipe  -fstack-protector-strong -isystem /usr/local/include -fno-strict-aliasing   -isystem /usr/local/include -std=c++11 -pthread -O2 -pipe  -fstack-protector-strong -isystem /usr/local/include -fno-strict-aliasing   -isystem /usr/local/include -std=c++11    -DPREFIX=\"/usr/local\" -fvisibility=hidden -Wall -Wno-unused -fexceptions -rdynamic -fno-strict-aliasing -Wno-deprecated-declarations -std=gnu++11 -MD -MT libs/garmin/CMakeFiles/GARMINHOST.dir/jeeps/gpsusbread.c.o -MF libs/garmin/CMakeFiles/GARMINHOST.dir/jeeps/gpsusbread.c.o.d -o libs/garmin/CMakeFiles/GARMINHOST.dir/jeeps/gpsusbread.c.o -c /wrkdirs/usr/ports/astro/opencpn/work/OpenCPN-5.2.4/l
 ibs/garmin/jeeps/gpsusbread.c
c++: warning: treating 'c' input as 'c++' when in C++ mode, this behavior is deprecated [-Wdeprecated]
c++: warning: argument unused during compilation: '-rdynamic' [-Wunused-command-line-argument]
[ 55% 410/734] /usr/bin/c++ -DHAVE_WEBVIEW -DNDEBUG -DUSE_WX_LOGGING -DWXUSINGDLL -D_FILE_OFFSET_BITS=64 -D_THREAD_SAFE -D__WXGTK__ -DocpnUSE_GL -DocpnUSE_SVG -DwxUSE_WEBVIEW=1 -I/wrkdirs/usr/ports/astro/opencpn/work/OpenCPN-5.2.4/libs/garmin/jeeps -isystem /usr/local/lib/wx/include/gtk3-unicode-3.0 -isystem /usr/local/include/wx-3.0 -O2 -pipe  -fstack-protector-strong -isystem /usr/local/include -fno-strict-aliasing   -isystem /usr/local/include -std=c++11 -pthread -O2 -pipe  -fstack-protector-strong -isystem /usr/local/include -fno-strict-aliasing   -isystem /usr/local/include -std=c++11    -DPREFIX=\"/usr/local\" -fvisibility=hidden -Wall -Wno-unused -fexceptions -rdynamic -fno-strict-aliasing -Wno-deprecated-declarations -std=gnu++11 -MD -MT libs/garmin/CMakeFiles/GARMINHOST.dir/jeeps/gpsusbsend.c.o -MF libs/garmin/CMakeFiles/GARMINHOST.dir/jeeps/gpsusbsend.c.o.d -o libs/garmin/CMakeFiles/GARMINHOST.dir/jeeps/gpsusbsend.c.o -c /wrkdirs/usr/ports/astro/opencpn/work/OpenCPN-5.2.4/l
 ibs/garmin/jeeps/gpsusbsend.c
c++: warning: treating 'c' input as 'c++' when in C++ mode, this behavior is deprecated [-Wdeprecated]
c++: warning: argument unused during compilation: '-rdynamic' [-Wunused-command-line-argument]
[ 55% 411/734] /usr/bin/c++ -DHAVE_WEBVIEW -DNDEBUG -DUSE_WX_LOGGING -DWXUSINGDLL -D_FILE_OFFSET_BITS=64 -D_THREAD_SAFE -D__WXGTK__ -DocpnUSE_GL -DocpnUSE_SVG -DwxUSE_WEBVIEW=1 -I/wrkdirs/usr/ports/astro/opencpn/work/OpenCPN-5.2.4/libs/garmin/jeeps -isystem /usr/local/lib/wx/include/gtk3-unicode-3.0 -isystem /usr/local/include/wx-3.0 -O2 -pipe  -fstack-protector-strong -isystem /usr/local/include -fno-strict-aliasing   -isystem /usr/local/include -std=c++11 -pthread -O2 -pipe  -fstack-protector-strong -isystem /usr/local/include -fno-strict-aliasing   -isystem /usr/local/include -std=c++11    -DPREFIX=\"/usr/local\" -fvisibility=hidden -Wall -Wno-unused -fexceptions -rdynamic -fno-strict-aliasing -Wno-deprecated-declarations -std=gnu++11 -MD -MT libs/garmin/CMakeFiles/GARMINHOST.dir/jeeps/gpsusbcommon.c.o -MF libs/garmin/CMakeFiles/GARMINHOST.dir/jeeps/gpsusbcommon.c.o.d -o libs/garmin/CMakeFiles/GARMINHOST.dir/jeeps/gpsusbcommon.c.o -c /wrkdirs/usr/ports/astro/opencpn/work/OpenCPN-5
 .2.4/libs/garmin/jeeps/gpsusbcommon.c
c++: warning: treating 'c' input as 'c++' when in C++ mode, this behavior is deprecated [-Wdeprecated]
c++: warning: argument unused during compilation: '-rdynamic' [-Wunused-command-line-argument]
[ 55% 412/734] /usr/bin/c++ -DHAVE_WEBVIEW -DNDEBUG -DUSE_WX_LOGGING -DWXUSINGDLL -D_FILE_OFFSET_BITS=64 -D_THREAD_SAFE -D__WXGTK__ -DocpnUSE_GL -DocpnUSE_SVG -DwxUSE_WEBVIEW=1 -I/wrkdirs/usr/ports/astro/opencpn/work/OpenCPN-5.2.4/libs/garmin/jeeps -isystem /usr/local/lib/wx/include/gtk3-unicode-3.0 -isystem /usr/local/include/wx-3.0 -O2 -pipe  -fstack-protector-strong -isystem /usr/local/include -fno-strict-aliasing   -isystem /usr/local/include -std=c++11 -pthread -O2 -pipe  -fstack-protector-strong -isystem /usr/local/include -fno-strict-aliasing   -isystem /usr/local/include -std=c++11    -DPREFIX=\"/usr/local\" -fvisibility=hidden -Wall -Wno-unused -fexceptions -rdynamic -fno-strict-aliasing -Wno-deprecated-declarations -std=gnu++11 -MD -MT libs/garmin/CMakeFiles/GARMINHOST.dir/jeeps/garmin_gps.h.o -MF libs/garmin/CMakeFiles/GARMINHOST.dir/jeeps/garmin_gps.h.o.d -o libs/garmin/CMakeFiles/GARMINHOST.dir/jeeps/garmin_gps.h.o -c /wrkdirs/usr/ports/astro/opencpn/work/OpenCPN-5.2.4/l
 ibs/garmin/jeeps/garmin_gps.h
c++: warning: treating 'c-header' input as 'c++-header' when in C++ mode, this behavior is deprecated [-Wdeprecated]
c++: warning: argument unused during compilation: '-rdynamic' [-Wunused-command-line-argument]
[ 56% 413/734] /usr/bin/c++ -DHAVE_WEBVIEW -DNDEBUG -DUSE_WX_LOGGING -DWXUSINGDLL -D_FILE_OFFSET_BITS=64 -D_THREAD_SAFE -D__WXGTK__ -DocpnUSE_GL -DocpnUSE_SVG -DwxUSE_WEBVIEW=1 -I/wrkdirs/usr/ports/astro/opencpn/work/OpenCPN-5.2.4/libs/garmin/jeeps -isystem /usr/local/lib/wx/include/gtk3-unicode-3.0 -isystem /usr/local/include/wx-3.0 -O2 -pipe  -fstack-protector-strong -isystem /usr/local/include -fno-strict-aliasing   -isystem /usr/local/include -std=c++11 -pthread -O2 -pipe  -fstack-protector-strong -isystem /usr/local/include -fno-strict-aliasing   -isystem /usr/local/include -std=c++11    -DPREFIX=\"/usr/local\" -fvisibility=hidden -Wall -Wno-unused -fexceptions -rdynamic -fno-strict-aliasing -Wno-deprecated-declarations -std=gnu++11 -MD -MT libs/garmin/CMakeFiles/GARMINHOST.dir/jeeps/gpsdatum.h.o -MF libs/garmin/CMakeFiles/GARMINHOST.dir/jeeps/gpsdatum.h.o.d -o libs/garmin/CMakeFiles/GARMINHOST.dir/jeeps/gpsdatum.h.o -c /wrkdirs/usr/ports/astro/opencpn/work/OpenCPN-5.2.4/libs/ga
 rmin/jeeps/gpsdatum.h
c++: warning: treating 'c-header' input as 'c++-header' when in C++ mode, this behavior is deprecated [-Wdeprecated]
c++: warning: argument unused during compilation: '-rdynamic' [-Wunused-command-line-argument]
[ 56% 414/734] /usr/bin/c++ -DHAVE_WEBVIEW -DNDEBUG -DUSE_WX_LOGGING -DWXUSINGDLL -D_FILE_OFFSET_BITS=64 -D_THREAD_SAFE -D__WXGTK__ -DocpnUSE_GL -DocpnUSE_SVG -DwxUSE_WEBVIEW=1 -I/wrkdirs/usr/ports/astro/opencpn/work/OpenCPN-5.2.4/libs/garmin/jeeps -isystem /usr/local/lib/wx/include/gtk3-unicode-3.0 -isystem /usr/local/include/wx-3.0 -O2 -pipe  -fstack-protector-strong -isystem /usr/local/include -fno-strict-aliasing   -isystem /usr/local/include -std=c++11 -pthread -O2 -pipe  -fstack-protector-strong -isystem /usr/local/include -fno-strict-aliasing   -isystem /usr/local/include -std=c++11    -DPREFIX=\"/usr/local\" -fvisibility=hidden -Wall -Wno-unused -fexceptions -rdynamic -fno-strict-aliasing -Wno-deprecated-declarations -std=gnu++11 -MD -MT libs/garmin/CMakeFiles/GARMINHOST.dir/jeeps/gpsapp.h.o -MF libs/garmin/CMakeFiles/GARMINHOST.dir/jeeps/gpsapp.h.o.d -o libs/garmin/CMakeFiles/GARMINHOST.dir/jeeps/gpsapp.h.o -c /wrkdirs/usr/ports/astro/opencpn/work/OpenCPN-5.2.4/libs/garmin/j
 eeps/gpsapp.h
c++: warning: treating 'c-header' input as 'c++-header' when in C++ mode, this behavior is deprecated [-Wdeprecated]
c++: warning: argument unused during compilation: '-rdynamic' [-Wunused-command-line-argument]
[ 56% 415/734] /usr/bin/c++ -DHAVE_WEBVIEW -DNDEBUG -DUSE_WX_LOGGING -DWXUSINGDLL -D_FILE_OFFSET_BITS=64 -D_THREAD_SAFE -D__WXGTK__ -DocpnUSE_GL -DocpnUSE_SVG -DwxUSE_WEBVIEW=1 -I/wrkdirs/usr/ports/astro/opencpn/work/OpenCPN-5.2.4/libs/garmin/jeeps -isystem /usr/local/lib/wx/include/gtk3-unicode-3.0 -isystem /usr/local/include/wx-3.0 -O2 -pipe  -fstack-protector-strong -isystem /usr/local/include -fno-strict-aliasing   -isystem /usr/local/include -std=c++11 -pthread -O2 -pipe  -fstack-protector-strong -isystem /usr/local/include -fno-strict-aliasing   -isystem /usr/local/include -std=c++11    -DPREFIX=\"/usr/local\" -fvisibility=hidden -Wall -Wno-unused -fexceptions -rdynamic -fno-strict-aliasing -Wno-deprecated-declarations -std=gnu++11 -MD -MT libs/garmin/CMakeFiles/GARMINHOST.dir/jeeps/gpsfmt.h.o -MF libs/garmin/CMakeFiles/GARMINHOST.dir/jeeps/gpsfmt.h.o.d -o libs/garmin/CMakeFiles/GARMINHOST.dir/jeeps/gpsfmt.h.o -c /wrkdirs/usr/ports/astro/opencpn/work/OpenCPN-5.2.4/libs/garmin/j
 eeps/gpsfmt.h
c++: warning: treating 'c-header' input as 'c++-header' when in C++ mode, this behavior is deprecated [-Wdeprecated]
c++: warning: argument unused during compilation: '-rdynamic' [-Wunused-command-line-argument]
[ 56% 416/734] /usr/bin/c++ -DHAVE_WEBVIEW -DNDEBUG -DUSE_WX_LOGGING -DWXUSINGDLL -D_FILE_OFFSET_BITS=64 -D_THREAD_SAFE -D__WXGTK__ -DocpnUSE_GL -DocpnUSE_SVG -DwxUSE_WEBVIEW=1 -I/wrkdirs/usr/ports/astro/opencpn/work/OpenCPN-5.2.4/libs/garmin/jeeps -isystem /usr/local/lib/wx/include/gtk3-unicode-3.0 -isystem /usr/local/include/wx-3.0 -O2 -pipe  -fstack-protector-strong -isystem /usr/local/include -fno-strict-aliasing   -isystem /usr/local/include -std=c++11 -pthread -O2 -pipe  -fstack-protector-strong -isystem /usr/local/include -fno-strict-aliasing   -isystem /usr/local/include -std=c++11    -DPREFIX=\"/usr/local\" -fvisibility=hidden -Wall -Wno-unused -fexceptions -rdynamic -fno-strict-aliasing -Wno-deprecated-declarations -std=gnu++11 -MD -MT libs/garmin/CMakeFiles/GARMINHOST.dir/jeeps/gpsport.h.o -MF libs/garmin/CMakeFiles/GARMINHOST.dir/jeeps/gpsport.h.o.d -o libs/garmin/CMakeFiles/GARMINHOST.dir/jeeps/gpsport.h.o -c /wrkdirs/usr/ports/astro/opencpn/work/OpenCPN-5.2.4/libs/garmi
 n/jeeps/gpsport.h
c++: warning: treating 'c-header' input as 'c++-header' when in C++ mode, this behavior is deprecated [-Wdeprecated]
c++: warning: argument unused during compilation: '-rdynamic' [-Wunused-command-line-argument]
[ 56% 417/734] /usr/bin/c++ -DHAVE_WEBVIEW -DNDEBUG -DUSE_WX_LOGGING -DWXUSINGDLL -D_FILE_OFFSET_BITS=64 -D_THREAD_SAFE -D__WXGTK__ -DocpnUSE_GL -DocpnUSE_SVG -DwxUSE_WEBVIEW=1 -I/wrkdirs/usr/ports/astro/opencpn/work/OpenCPN-5.2.4/libs/garmin/jeeps -isystem /usr/local/lib/wx/include/gtk3-unicode-3.0 -isystem /usr/local/include/wx-3.0 -O2 -pipe  -fstack-protector-strong -isystem /usr/local/include -fno-strict-aliasing   -isystem /usr/local/include -std=c++11 -pthread -O2 -pipe  -fstack-protector-strong -isystem /usr/local/include -fno-strict-aliasing   -isystem /usr/local/include -std=c++11    -DPREFIX=\"/usr/local\" -fvisibility=hidden -Wall -Wno-unused -fexceptions -rdynamic -fno-strict-aliasing -Wno-deprecated-declarations -std=gnu++11 -MD -MT libs/garmin/CMakeFiles/GARMINHOST.dir/jeeps/gpsmath.h.o -MF libs/garmin/CMakeFiles/GARMINHOST.dir/jeeps/gpsmath.h.o.d -o libs/garmin/CMakeFiles/GARMINHOST.dir/jeeps/gpsmath.h.o -c /wrkdirs/usr/ports/astro/opencpn/work/OpenCPN-5.2.4/libs/garmi
 n/jeeps/gpsmath.h
c++: warning: treating 'c-header' input as 'c++-header' when in C++ mode, this behavior is deprecated [-Wdeprecated]
c++: warning: argument unused during compilation: '-rdynamic' [-Wunused-command-line-argument]
[ 56% 418/734] /usr/bin/c++ -DHAVE_WEBVIEW -DNDEBUG -DUSE_WX_LOGGING -DWXUSINGDLL -D_FILE_OFFSET_BITS=64 -D_THREAD_SAFE -D__WXGTK__ -DocpnUSE_GL -DocpnUSE_SVG -DwxUSE_WEBVIEW=1 -I/wrkdirs/usr/ports/astro/opencpn/work/OpenCPN-5.2.4/libs/garmin/jeeps -isystem /usr/local/lib/wx/include/gtk3-unicode-3.0 -isystem /usr/local/include/wx-3.0 -O2 -pipe  -fstack-protector-strong -isystem /usr/local/include -fno-strict-aliasing   -isystem /usr/local/include -std=c++11 -pthread -O2 -pipe  -fstack-protector-strong -isystem /usr/local/include -fno-strict-aliasing   -isystem /usr/local/include -std=c++11    -DPREFIX=\"/usr/local\" -fvisibility=hidden -Wall -Wno-unused -fexceptions -rdynamic -fno-strict-aliasing -Wno-deprecated-declarations -std=gnu++11 -MD -MT libs/garmin/CMakeFiles/GARMINHOST.dir/jeeps/gpsprot.h.o -MF libs/garmin/CMakeFiles/GARMINHOST.dir/jeeps/gpsprot.h.o.d -o libs/garmin/CMakeFiles/GARMINHOST.dir/jeeps/gpsprot.h.o -c /wrkdirs/usr/ports/astro/opencpn/work/OpenCPN-5.2.4/libs/garmi
 n/jeeps/gpsprot.h
c++: warning: treating 'c-header' input as 'c++-header' when in C++ mode, this behavior is deprecated [-Wdeprecated]
c++: warning: argument unused during compilation: '-rdynamic' [-Wunused-command-line-argument]
[ 56% 419/734] /usr/bin/c++ -DHAVE_WEBVIEW -DNDEBUG -DUSE_WX_LOGGING -DWXUSINGDLL -D_FILE_OFFSET_BITS=64 -D_THREAD_SAFE -D__WXGTK__ -DocpnUSE_GL -DocpnUSE_SVG -DwxUSE_WEBVIEW=1 -I/wrkdirs/usr/ports/astro/opencpn/work/OpenCPN-5.2.4/libs/garmin/jeeps -isystem /usr/local/lib/wx/include/gtk3-unicode-3.0 -isystem /usr/local/include/wx-3.0 -O2 -pipe  -fstack-protector-strong -isystem /usr/local/include -fno-strict-aliasing   -isystem /usr/local/include -std=c++11 -pthread -O2 -pipe  -fstack-protector-strong -isystem /usr/local/include -fno-strict-aliasing   -isystem /usr/local/include -std=c++11    -DPREFIX=\"/usr/local\" -fvisibility=hidden -Wall -Wno-unused -fexceptions -rdynamic -fno-strict-aliasing -Wno-deprecated-declarations -std=gnu++11 -MD -MT libs/garmin/CMakeFiles/GARMINHOST.dir/jeeps/gpsrqst.h.o -MF libs/garmin/CMakeFiles/GARMINHOST.dir/jeeps/gpsrqst.h.o.d -o libs/garmin/CMakeFiles/GARMINHOST.dir/jeeps/gpsrqst.h.o -c /wrkdirs/usr/ports/astro/opencpn/work/OpenCPN-5.2.4/libs/garmi
 n/jeeps/gpsrqst.h
c++: warning: treating 'c-header' input as 'c++-header' when in C++ mode, this behavior is deprecated [-Wdeprecated]
c++: warning: argument unused during compilation: '-rdynamic' [-Wunused-command-line-argument]
[ 57% 420/734] /usr/bin/c++ -DHAVE_WEBVIEW -DNDEBUG -DUSE_WX_LOGGING -DWXUSINGDLL -D_FILE_OFFSET_BITS=64 -D_THREAD_SAFE -D__WXGTK__ -DocpnUSE_GL -DocpnUSE_SVG -DwxUSE_WEBVIEW=1 -I/wrkdirs/usr/ports/astro/opencpn/work/OpenCPN-5.2.4/libs/garmin/jeeps -isystem /usr/local/lib/wx/include/gtk3-unicode-3.0 -isystem /usr/local/include/wx-3.0 -O2 -pipe  -fstack-protector-strong -isystem /usr/local/include -fno-strict-aliasing   -isystem /usr/local/include -std=c++11 -pthread -O2 -pipe  -fstack-protector-strong -isystem /usr/local/include -fno-strict-aliasing   -isystem /usr/local/include -std=c++11    -DPREFIX=\"/usr/local\" -fvisibility=hidden -Wall -Wno-unused -fexceptions -rdynamic -fno-strict-aliasing -Wno-deprecated-declarations -std=gnu++11 -MD -MT libs/garmin/CMakeFiles/GARMINHOST.dir/jeeps/gpsserial.h.o -MF libs/garmin/CMakeFiles/GARMINHOST.dir/jeeps/gpsserial.h.o.d -o libs/garmin/CMakeFiles/GARMINHOST.dir/jeeps/gpsserial.h.o -c /wrkdirs/usr/ports/astro/opencpn/work/OpenCPN-5.2.4/libs
 /garmin/jeeps/gpsserial.h
c++: warning: treating 'c-header' input as 'c++-header' when in C++ mode, this behavior is deprecated [-Wdeprecated]
c++: warning: argument unused during compilation: '-rdynamic' [-Wunused-command-line-argument]
[ 57% 421/734] /usr/bin/c++ -DHAVE_WEBVIEW -DNDEBUG -DUSE_WX_LOGGING -DWXUSINGDLL -D_FILE_OFFSET_BITS=64 -D_THREAD_SAFE -D__WXGTK__ -DocpnUSE_GL -DocpnUSE_SVG -DwxUSE_WEBVIEW=1 -I/wrkdirs/usr/ports/astro/opencpn/work/OpenCPN-5.2.4/libs/garmin/jeeps -isystem /usr/local/lib/wx/include/gtk3-unicode-3.0 -isystem /usr/local/include/wx-3.0 -O2 -pipe  -fstack-protector-strong -isystem /usr/local/include -fno-strict-aliasing   -isystem /usr/local/include -std=c++11 -pthread -O2 -pipe  -fstack-protector-strong -isystem /usr/local/include -fno-strict-aliasing   -isystem /usr/local/include -std=c++11    -DPREFIX=\"/usr/local\" -fvisibility=hidden -Wall -Wno-unused -fexceptions -rdynamic -fno-strict-aliasing -Wno-deprecated-declarations -std=gnu++11 -MD -MT libs/garmin/CMakeFiles/GARMINHOST.dir/jeeps/gpsusbint.h.o -MF libs/garmin/CMakeFiles/GARMINHOST.dir/jeeps/gpsusbint.h.o.d -o libs/garmin/CMakeFiles/GARMINHOST.dir/jeeps/gpsusbint.h.o -c /wrkdirs/usr/ports/astro/opencpn/work/OpenCPN-5.2.4/libs
 /garmin/jeeps/gpsusbint.h
c++: warning: treating 'c-header' input as 'c++-header' when in C++ mode, this behavior is deprecated [-Wdeprecated]
c++: warning: argument unused during compilation: '-rdynamic' [-Wunused-command-line-argument]
[ 57% 422/734] /usr/bin/c++ -DHAVE_WEBVIEW -DNDEBUG -DUSE_WX_LOGGING -DWXUSINGDLL -D_FILE_OFFSET_BITS=64 -D_THREAD_SAFE -D__WXGTK__ -DocpnUSE_GL -DocpnUSE_SVG -DwxUSE_WEBVIEW=1 -I/wrkdirs/usr/ports/astro/opencpn/work/OpenCPN-5.2.4/libs/garmin/jeeps -isystem /usr/local/lib/wx/include/gtk3-unicode-3.0 -isystem /usr/local/include/wx-3.0 -O2 -pipe  -fstack-protector-strong -isystem /usr/local/include -fno-strict-aliasing   -isystem /usr/local/include -std=c++11 -pthread -O2 -pipe  -fstack-protector-strong -isystem /usr/local/include -fno-strict-aliasing   -isystem /usr/local/include -std=c++11    -DPREFIX=\"/usr/local\" -fvisibility=hidden -Wall -Wno-unused -fexceptions -rdynamic -fno-strict-aliasing -Wno-deprecated-declarations -std=gnu++11 -MD -MT libs/garmin/CMakeFiles/GARMINHOST.dir/jeeps/garminusb.h.o -MF libs/garmin/CMakeFiles/GARMINHOST.dir/jeeps/garminusb.h.o.d -o libs/garmin/CMakeFiles/GARMINHOST.dir/jeeps/garminusb.h.o -c /wrkdirs/usr/ports/astro/opencpn/work/OpenCPN-5.2.4/libs
 /garmin/jeeps/garminusb.h
c++: warning: treating 'c-header' input as 'c++-header' when in C++ mode, this behavior is deprecated [-Wdeprecated]
c++: warning: argument unused during compilation: '-rdynamic' [-Wunused-command-line-argument]
[ 57% 423/734] /usr/bin/c++ -DHAVE_WEBVIEW -DNDEBUG -DUSE_WX_LOGGING -DWXUSINGDLL -D_FILE_OFFSET_BITS=64 -D_THREAD_SAFE -D__WXGTK__ -DocpnUSE_GL -DocpnUSE_SVG -DwxUSE_WEBVIEW=1 -I/wrkdirs/usr/ports/astro/opencpn/work/OpenCPN-5.2.4/libs/garmin/jeeps -isystem /usr/local/lib/wx/include/gtk3-unicode-3.0 -isystem /usr/local/include/wx-3.0 -O2 -pipe  -fstack-protector-strong -isystem /usr/local/include -fno-strict-aliasing   -isystem /usr/local/include -std=c++11 -pthread -O2 -pipe  -fstack-protector-strong -isystem /usr/local/include -fno-strict-aliasing   -isystem /usr/local/include -std=c++11    -DPREFIX=\"/usr/local\" -fvisibility=hidden -Wall -Wno-unused -fexceptions -rdynamic -fno-strict-aliasing -Wno-deprecated-declarations -std=gnu++11 -MD -MT libs/garmin/CMakeFiles/GARMINHOST.dir/jeeps/gpscom.h.o -MF libs/garmin/CMakeFiles/GARMINHOST.dir/jeeps/gpscom.h.o.d -o libs/garmin/CMakeFiles/GARMINHOST.dir/jeeps/gpscom.h.o -c /wrkdirs/usr/ports/astro/opencpn/work/OpenCPN-5.2.4/libs/garmin/j
 eeps/gpscom.h
c++: warning: treating 'c-header' input as 'c++-header' when in C++ mode, this behavior is deprecated [-Wdeprecated]
c++: warning: argument unused during compilation: '-rdynamic' [-Wunused-command-line-argument]
[ 57% 424/734] /usr/bin/c++ -DHAVE_WEBVIEW -DNDEBUG -DUSE_WX_LOGGING -DWXUSINGDLL -D_FILE_OFFSET_BITS=64 -D_THREAD_SAFE -D__WXGTK__ -DocpnUSE_GL -DocpnUSE_SVG -DwxUSE_WEBVIEW=1 -I/wrkdirs/usr/ports/astro/opencpn/work/OpenCPN-5.2.4/libs/garmin/jeeps -isystem /usr/local/lib/wx/include/gtk3-unicode-3.0 -isystem /usr/local/include/wx-3.0 -O2 -pipe  -fstack-protector-strong -isystem /usr/local/include -fno-strict-aliasing   -isystem /usr/local/include -std=c++11 -pthread -O2 -pipe  -fstack-protector-strong -isystem /usr/local/include -fno-strict-aliasing   -isystem /usr/local/include -std=c++11    -DPREFIX=\"/usr/local\" -fvisibility=hidden -Wall -Wno-unused -fexceptions -rdynamic -fno-strict-aliasing -Wno-deprecated-declarations -std=gnu++11 -MD -MT libs/garmin/CMakeFiles/GARMINHOST.dir/jeeps/gpsdevice.h.o -MF libs/garmin/CMakeFiles/GARMINHOST.dir/jeeps/gpsdevice.h.o.d -o libs/garmin/CMakeFiles/GARMINHOST.dir/jeeps/gpsdevice.h.o -c /wrkdirs/usr/ports/astro/opencpn/work/OpenCPN-5.2.4/libs
 /garmin/jeeps/gpsdevice.h
c++: warning: treating 'c-header' input as 'c++-header' when in C++ mode, this behavior is deprecated [-Wdeprecated]
c++: warning: argument unused during compilation: '-rdynamic' [-Wunused-command-line-argument]
[ 57% 425/734] /usr/bin/c++ -DHAVE_WEBVIEW -DNDEBUG -DUSE_WX_LOGGING -DWXUSINGDLL -D_FILE_OFFSET_BITS=64 -D_THREAD_SAFE -D__WXGTK__ -DocpnUSE_GL -DocpnUSE_SVG -DwxUSE_WEBVIEW=1 -I/wrkdirs/usr/ports/astro/opencpn/work/OpenCPN-5.2.4/libs/garmin/jeeps -isystem /usr/local/lib/wx/include/gtk3-unicode-3.0 -isystem /usr/local/include/wx-3.0 -O2 -pipe  -fstack-protector-strong -isystem /usr/local/include -fno-strict-aliasing   -isystem /usr/local/include -std=c++11 -pthread -O2 -pipe  -fstack-protector-strong -isystem /usr/local/include -fno-strict-aliasing   -isystem /usr/local/include -std=c++11    -DPREFIX=\"/usr/local\" -fvisibility=hidden -Wall -Wno-unused -fexceptions -rdynamic -fno-strict-aliasing -Wno-deprecated-declarations -std=gnu++11 -MD -MT libs/garmin/CMakeFiles/GARMINHOST.dir/jeeps/gpsinput.h.o -MF libs/garmin/CMakeFiles/GARMINHOST.dir/jeeps/gpsinput.h.o.d -o libs/garmin/CMakeFiles/GARMINHOST.dir/jeeps/gpsinput.h.o -c /wrkdirs/usr/ports/astro/opencpn/work/OpenCPN-5.2.4/libs/ga
 rmin/jeeps/gpsinput.h
c++: warning: treating 'c-header' input as 'c++-header' when in C++ mode, this behavior is deprecated [-Wdeprecated]
c++: warning: argument unused during compilation: '-rdynamic' [-Wunused-command-line-argument]
[ 57% 426/734] /usr/bin/c++ -DHAVE_WEBVIEW -DNDEBUG -DUSE_WX_LOGGING -DWXUSINGDLL -D_FILE_OFFSET_BITS=64 -D_THREAD_SAFE -D__WXGTK__ -DocpnUSE_GL -DocpnUSE_SVG -DwxUSE_WEBVIEW=1 -I/wrkdirs/usr/ports/astro/opencpn/work/OpenCPN-5.2.4/libs/garmin/jeeps -isystem /usr/local/lib/wx/include/gtk3-unicode-3.0 -isystem /usr/local/include/wx-3.0 -O2 -pipe  -fstack-protector-strong -isystem /usr/local/include -fno-strict-aliasing   -isystem /usr/local/include -std=c++11 -pthread -O2 -pipe  -fstack-protector-strong -isystem /usr/local/include -fno-strict-aliasing   -isystem /usr/local/include -std=c++11    -DPREFIX=\"/usr/local\" -fvisibility=hidden -Wall -Wno-unused -fexceptions -rdynamic -fno-strict-aliasing -Wno-deprecated-declarations -std=gnu++11 -MD -MT libs/garmin/CMakeFiles/GARMINHOST.dir/jeeps/gpsmem.h.o -MF libs/garmin/CMakeFiles/GARMINHOST.dir/jeeps/gpsmem.h.o.d -o libs/garmin/CMakeFiles/GARMINHOST.dir/jeeps/gpsmem.h.o -c /wrkdirs/usr/ports/astro/opencpn/work/OpenCPN-5.2.4/libs/garmin/j
 eeps/gpsmem.h
c++: warning: treating 'c-header' input as 'c++-header' when in C++ mode, this behavior is deprecated [-Wdeprecated]
c++: warning: argument unused during compilation: '-rdynamic' [-Wunused-command-line-argument]
[ 58% 427/734] /usr/bin/c++ -DHAVE_WEBVIEW -DNDEBUG -DUSE_WX_LOGGING -DWXUSINGDLL -D_FILE_OFFSET_BITS=64 -D_THREAD_SAFE -D__WXGTK__ -DocpnUSE_GL -DocpnUSE_SVG -DwxUSE_WEBVIEW=1 -I/wrkdirs/usr/ports/astro/opencpn/work/OpenCPN-5.2.4/libs/garmin/jeeps -isystem /usr/local/lib/wx/include/gtk3-unicode-3.0 -isystem /usr/local/include/wx-3.0 -O2 -pipe  -fstack-protector-strong -isystem /usr/local/include -fno-strict-aliasing   -isystem /usr/local/include -std=c++11 -pthread -O2 -pipe  -fstack-protector-strong -isystem /usr/local/include -fno-strict-aliasing   -isystem /usr/local/include -std=c++11    -DPREFIX=\"/usr/local\" -fvisibility=hidden -Wall -Wno-unused -fexceptions -rdynamic -fno-strict-aliasing -Wno-deprecated-declarations -std=gnu++11 -MD -MT libs/garmin/CMakeFiles/GARMINHOST.dir/jeeps/gpsproj.h.o -MF libs/garmin/CMakeFiles/GARMINHOST.dir/jeeps/gpsproj.h.o.d -o libs/garmin/CMakeFiles/GARMINHOST.dir/jeeps/gpsproj.h.o -c /wrkdirs/usr/ports/astro/opencpn/work/OpenCPN-5.2.4/libs/garmi
 n/jeeps/gpsproj.h
c++: warning: treating 'c-header' input as 'c++-header' when in C++ mode, this behavior is deprecated [-Wdeprecated]
c++: warning: argument unused during compilation: '-rdynamic' [-Wunused-command-line-argument]
[ 58% 428/734] /usr/bin/c++ -DHAVE_WEBVIEW -DNDEBUG -DUSE_WX_LOGGING -DWXUSINGDLL -D_FILE_OFFSET_BITS=64 -D_THREAD_SAFE -D__WXGTK__ -DocpnUSE_GL -DocpnUSE_SVG -DwxUSE_WEBVIEW=1 -I/wrkdirs/usr/ports/astro/opencpn/work/OpenCPN-5.2.4/libs/garmin/jeeps -isystem /usr/local/lib/wx/include/gtk3-unicode-3.0 -isystem /usr/local/include/wx-3.0 -O2 -pipe  -fstack-protector-strong -isystem /usr/local/include -fno-strict-aliasing   -isystem /usr/local/include -std=c++11 -pthread -O2 -pipe  -fstack-protector-strong -isystem /usr/local/include -fno-strict-aliasing   -isystem /usr/local/include -std=c++11    -DPREFIX=\"/usr/local\" -fvisibility=hidden -Wall -Wno-unused -fexceptions -rdynamic -fno-strict-aliasing -Wno-deprecated-declarations -std=gnu++11 -MD -MT libs/garmin/CMakeFiles/GARMINHOST.dir/jeeps/gpsread.h.o -MF libs/garmin/CMakeFiles/GARMINHOST.dir/jeeps/gpsread.h.o.d -o libs/garmin/CMakeFiles/GARMINHOST.dir/jeeps/gpsread.h.o -c /wrkdirs/usr/ports/astro/opencpn/work/OpenCPN-5.2.4/libs/garmi
 n/jeeps/gpsread.h
c++: warning: treating 'c-header' input as 'c++-header' when in C++ mode, this behavior is deprecated [-Wdeprecated]
c++: warning: argument unused during compilation: '-rdynamic' [-Wunused-command-line-argument]
[ 58% 429/734] /usr/bin/c++ -DHAVE_WEBVIEW -DNDEBUG -DUSE_WX_LOGGING -DWXUSINGDLL -D_FILE_OFFSET_BITS=64 -D_THREAD_SAFE -D__WXGTK__ -DocpnUSE_GL -DocpnUSE_SVG -DwxUSE_WEBVIEW=1 -I/wrkdirs/usr/ports/astro/opencpn/work/OpenCPN-5.2.4/libs/garmin/jeeps -isystem /usr/local/lib/wx/include/gtk3-unicode-3.0 -isystem /usr/local/include/wx-3.0 -O2 -pipe  -fstack-protector-strong -isystem /usr/local/include -fno-strict-aliasing   -isystem /usr/local/include -std=c++11 -pthread -O2 -pipe  -fstack-protector-strong -isystem /usr/local/include -fno-strict-aliasing   -isystem /usr/local/include -std=c++11    -DPREFIX=\"/usr/local\" -fvisibility=hidden -Wall -Wno-unused -fexceptions -rdynamic -fno-strict-aliasing -Wno-deprecated-declarations -std=gnu++11 -MD -MT libs/garmin/CMakeFiles/GARMINHOST.dir/jeeps/gpssend.h.o -MF libs/garmin/CMakeFiles/GARMINHOST.dir/jeeps/gpssend.h.o.d -o libs/garmin/CMakeFiles/GARMINHOST.dir/jeeps/gpssend.h.o -c /wrkdirs/usr/ports/astro/opencpn/work/OpenCPN-5.2.4/libs/garmi
 n/jeeps/gpssend.h
c++: warning: treating 'c-header' input as 'c++-header' when in C++ mode, this behavior is deprecated [-Wdeprecated]
c++: warning: argument unused during compilation: '-rdynamic' [-Wunused-command-line-argument]
[ 58% 430/734] /usr/bin/c++ -DHAVE_WEBVIEW -DNDEBUG -DUSE_WX_LOGGING -DWXUSINGDLL -D_FILE_OFFSET_BITS=64 -D_THREAD_SAFE -D__WXGTK__ -DocpnUSE_GL -DocpnUSE_SVG -DwxUSE_WEBVIEW=1 -I/wrkdirs/usr/ports/astro/opencpn/work/OpenCPN-5.2.4/libs/garmin/jeeps -isystem /usr/local/lib/wx/include/gtk3-unicode-3.0 -isystem /usr/local/include/wx-3.0 -O2 -pipe  -fstack-protector-strong -isystem /usr/local/include -fno-strict-aliasing   -isystem /usr/local/include -std=c++11 -pthread -O2 -pipe  -fstack-protector-strong -isystem /usr/local/include -fno-strict-aliasing   -isystem /usr/local/include -std=c++11    -DPREFIX=\"/usr/local\" -fvisibility=hidden -Wall -Wno-unused -fexceptions -rdynamic -fno-strict-aliasing -Wno-deprecated-declarations -std=gnu++11 -MD -MT libs/garmin/CMakeFiles/GARMINHOST.dir/jeeps/gpsusbcommon.h.o -MF libs/garmin/CMakeFiles/GARMINHOST.dir/jeeps/gpsusbcommon.h.o.d -o libs/garmin/CMakeFiles/GARMINHOST.dir/jeeps/gpsusbcommon.h.o -c /wrkdirs/usr/ports/astro/opencpn/work/OpenCPN-5
 .2.4/libs/garmin/jeeps/gpsusbcommon.h
c++: warning: treating 'c-header' input as 'c++-header' when in C++ mode, this behavior is deprecated [-Wdeprecated]
c++: warning: argument unused during compilation: '-rdynamic' [-Wunused-command-line-argument]
[ 58% 431/734] /usr/bin/c++ -DHAVE_WEBVIEW -DNDEBUG -DUSE_WX_LOGGING -DWXUSINGDLL -D_FILE_OFFSET_BITS=64 -D_THREAD_SAFE -D__WXGTK__ -DocpnUSE_GL -DocpnUSE_SVG -DwxUSE_WEBVIEW=1 -I/wrkdirs/usr/ports/astro/opencpn/work/OpenCPN-5.2.4/libs/garmin/jeeps -isystem /usr/local/lib/wx/include/gtk3-unicode-3.0 -isystem /usr/local/include/wx-3.0 -O2 -pipe  -fstack-protector-strong -isystem /usr/local/include -fno-strict-aliasing   -isystem /usr/local/include -std=c++11 -pthread -O2 -pipe  -fstack-protector-strong -isystem /usr/local/include -fno-strict-aliasing   -isystem /usr/local/include -std=c++11    -DPREFIX=\"/usr/local\" -fvisibility=hidden -Wall -Wno-unused -fexceptions -rdynamic -fno-strict-aliasing -Wno-deprecated-declarations -std=gnu++11 -MD -MT libs/garmin/CMakeFiles/GARMINHOST.dir/jeeps/gpsutil.h.o -MF libs/garmin/CMakeFiles/GARMINHOST.dir/jeeps/gpsutil.h.o.d -o libs/garmin/CMakeFiles/GARMINHOST.dir/jeeps/gpsutil.h.o -c /wrkdirs/usr/ports/astro/opencpn/work/OpenCPN-5.2.4/libs/garmi
 n/jeeps/gpsutil.h
c++: warning: treating 'c-header' input as 'c++-header' when in C++ mode, this behavior is deprecated [-Wdeprecated]
c++: warning: argument unused during compilation: '-rdynamic' [-Wunused-command-line-argument]
[ 58% 432/734] /usr/bin/c++ -DHAVE_WEBVIEW -DNDEBUG -DUSE_WX_LOGGING -DWXUSINGDLL -D_FILE_OFFSET_BITS=64 -D_THREAD_SAFE -D__WXGTK__ -DocpnUSE_GL -DocpnUSE_SVG -DwxUSE_WEBVIEW=1 -I/wrkdirs/usr/ports/astro/opencpn/work/OpenCPN-5.2.4/libs/garmin/jeeps -isystem /usr/local/lib/wx/include/gtk3-unicode-3.0 -isystem /usr/local/include/wx-3.0 -O2 -pipe  -fstack-protector-strong -isystem /usr/local/include -fno-strict-aliasing   -isystem /usr/local/include -std=c++11 -pthread -O2 -pipe  -fstack-protector-strong -isystem /usr/local/include -fno-strict-aliasing   -isystem /usr/local/include -std=c++11    -DPREFIX=\"/usr/local\" -fvisibility=hidden -Wall -Wno-unused -fexceptions -rdynamic -fno-strict-aliasing -Wno-deprecated-declarations -std=gnu++11 -MD -MT libs/garmin/CMakeFiles/GARMINHOST.dir/jeeps/garmin_wrapper_utils.h.o -MF libs/garmin/CMakeFiles/GARMINHOST.dir/jeeps/garmin_wrapper_utils.h.o.d -o libs/garmin/CMakeFiles/GARMINHOST.dir/jeeps/garmin_wrapper_utils.h.o -c /wrkdirs/usr/ports/astr
 o/opencpn/work/OpenCPN-5.2.4/libs/garmin/jeeps/garmin_wrapper_utils.h
c++: warning: treating 'c-header' input as 'c++-header' when in C++ mode, this behavior is deprecated [-Wdeprecated]
c++: warning: argument unused during compilation: '-rdynamic' [-Wunused-command-line-argument]
[ 58% 433/734] /usr/bin/c++ -DHAVE_WEBVIEW -DNDEBUG -DUSE_WX_LOGGING -DWXUSINGDLL -D_FILE_OFFSET_BITS=64 -D_THREAD_SAFE -D__WXGTK__ -DocpnUSE_GL -DocpnUSE_SVG -DwxUSE_WEBVIEW=1 -I/wrkdirs/usr/ports/astro/opencpn/work/OpenCPN-5.2.4/libs/garmin/jeeps -isystem /usr/local/lib/wx/include/gtk3-unicode-3.0 -isystem /usr/local/include/wx-3.0 -O2 -pipe  -fstack-protector-strong -isystem /usr/local/include -fno-strict-aliasing   -isystem /usr/local/include -std=c++11 -pthread -O2 -pipe  -fstack-protector-strong -isystem /usr/local/include -fno-strict-aliasing   -isystem /usr/local/include -std=c++11    -DPREFIX=\"/usr/local\" -fvisibility=hidden -Wall -Wno-unused -fexceptions -rdynamic -fno-strict-aliasing -Wno-deprecated-declarations -std=gnu++11 -MD -MT libs/garmin/CMakeFiles/GARMINHOST.dir/jeeps/garmin_wrapper_utils.c.o -MF libs/garmin/CMakeFiles/GARMINHOST.dir/jeeps/garmin_wrapper_utils.c.o.d -o libs/garmin/CMakeFiles/GARMINHOST.dir/jeeps/garmin_wrapper_utils.c.o -c /wrkdirs/usr/ports/astr
 o/opencpn/work/OpenCPN-5.2.4/libs/garmin/jeeps/garmin_wrapper_utils.c
c++: warning: treating 'c' input as 'c++' when in C++ mode, this behavior is deprecated [-Wdeprecated]
c++: warning: argument unused during compilation: '-rdynamic' [-Wunused-command-line-argument]
[ 58% 434/734] /usr/bin/c++ -DHAVE_WEBVIEW -DNDEBUG -DUSE_WX_LOGGING -DWXUSINGDLL -D_FILE_OFFSET_BITS=64 -D_THREAD_SAFE -D__WXGTK__ -DocpnUSE_GL -DocpnUSE_SVG -DwxUSE_WEBVIEW=1 -I/wrkdirs/usr/ports/astro/opencpn/work/OpenCPN-5.2.4/libs/garmin/jeeps -isystem /usr/local/lib/wx/include/gtk3-unicode-3.0 -isystem /usr/local/include/wx-3.0 -O2 -pipe  -fstack-protector-strong -isystem /usr/local/include -fno-strict-aliasing   -isystem /usr/local/include -std=c++11 -pthread -O2 -pipe  -fstack-protector-strong -isystem /usr/local/include -fno-strict-aliasing   -isystem /usr/local/include -std=c++11    -DPREFIX=\"/usr/local\" -fvisibility=hidden -Wall -Wno-unused -fexceptions -rdynamic -fno-strict-aliasing -Wno-deprecated-declarations -std=gnu++11 -MD -MT libs/garmin/CMakeFiles/GARMINHOST.dir/jeeps/gps_wx_logging.h.o -MF libs/garmin/CMakeFiles/GARMINHOST.dir/jeeps/gps_wx_logging.h.o.d -o libs/garmin/CMakeFiles/GARMINHOST.dir/jeeps/gps_wx_logging.h.o -c /wrkdirs/usr/ports/astro/opencpn/work/Ope
 nCPN-5.2.4/libs/garmin/jeeps/gps_wx_logging.h
c++: warning: treating 'c-header' input as 'c++-header' when in C++ mode, this behavior is deprecated [-Wdeprecated]
c++: warning: argument unused during compilation: '-rdynamic' [-Wunused-command-line-argument]
[ 59% 435/734] : && /usr/local/bin/cmake -E rm -f libs/garmin/libGARMINHOST.a && /usr/bin/ar qc libs/garmin/libGARMINHOST.a  libs/garmin/CMakeFiles/GARMINHOST.dir/jeeps/gpsapp.c.o libs/garmin/CMakeFiles/GARMINHOST.dir/jeeps/gpscom.c.o libs/garmin/CMakeFiles/GARMINHOST.dir/jeeps/gpsmath.c.o libs/garmin/CMakeFiles/GARMINHOST.dir/jeeps/gpsmem.c.o libs/garmin/CMakeFiles/GARMINHOST.dir/jeeps/gpsprot.c.o libs/garmin/CMakeFiles/GARMINHOST.dir/jeeps/gpsread.c.o libs/garmin/CMakeFiles/GARMINHOST.dir/jeeps/gpsdevice.c.o libs/garmin/CMakeFiles/GARMINHOST.dir/jeeps/gpsdevice_ser.c.o libs/garmin/CMakeFiles/GARMINHOST.dir/jeeps/gpsdevice_usb.c.o libs/garmin/CMakeFiles/GARMINHOST.dir/jeeps/gpsrqst.c.o libs/garmin/CMakeFiles/GARMINHOST.dir/jeeps/gpssend.c.o libs/garmin/CMakeFiles/GARMINHOST.dir/jeeps/gpsserial.c.o libs/garmin/CMakeFiles/GARMINHOST.dir/jeeps/gpsutil.c.o libs/garmin/CMakeFiles/GARMINHOST.dir/jeeps/gpsusbread.c.o libs/garmin/CMakeFiles/GARMINHOST.dir/jeeps/gpsusbsend.c.o libs/garmin/CM
 akeFiles/GARMINHOST.dir/jeeps/gpsusbcommon.c.o libs/garmin/CMakeFiles/GARMINHOST.dir/jeeps/garmin_gps.h.o libs/garmin/CMakeFiles/GARMINHOST.dir/jeeps/gpsapp.h.o libs/garmin/CMakeFiles/GARMINHOST.dir/jeeps/gpsdatum.h.o libs/garmin/CMakeFiles/GARMINHOST.dir/jeeps/gpsfmt.h.o libs/garmin/CMakeFiles/GARMINHOST.dir/jeeps/gpsmath.h.o libs/garmin/CMakeFiles/GARMINHOST.dir/jeeps/gpsport.h.o libs/garmin/CMakeFiles/GARMINHOST.dir/jeeps/gpsprot.h.o libs/garmin/CMakeFiles/GARMINHOST.dir/jeeps/gpsrqst.h.o libs/garmin/CMakeFiles/GARMINHOST.dir/jeeps/gpsserial.h.o libs/garmin/CMakeFiles/GARMINHOST.dir/jeeps/gpsusbint.h.o libs/garmin/CMakeFiles/GARMINHOST.dir/jeeps/gps_wx_logging.h.o libs/garmin/CMakeFiles/GARMINHOST.dir/jeeps/garminusb.h.o libs/garmin/CMakeFiles/GARMINHOST.dir/jeeps/gpscom.h.o libs/garmin/CMakeFiles/GARMINHOST.dir/jeeps/gpsdevice.h.o libs/garmin/CMakeFiles/GARMINHOST.dir/jeeps/gpsinput.h.o libs/garmin/CMakeFiles/GARMINHOST.dir/jeeps/gpsmem.h.o libs/garmin/CMakeFiles/GARMINHOST.dir/
 jeeps/gpsproj.h.o libs/garmin/CMakeFiles/GAR!
 MINHOST.dir/jeeps/gpsread.h.o libs/garmin/CMakeFiles/GARMINHOST.dir/jeeps/gpssend.h.o libs/garmin/CMakeFiles/GARMINHOST.dir/jeeps/gpsusbcommon.h.o libs/garmin/CMakeFiles/GARMINHOST.dir/jeeps/gpsutil.h.o libs/garmin/CMakeFiles/GARMINHOST.dir/jeeps/garmin_wrapper_utils.h.o libs/garmin/CMakeFiles/GARMINHOST.dir/jeeps/garmin_wrapper_utils.c.o && /usr/bin/ranlib libs/garmin/libGARMINHOST.a && :
[ 59% 436/734] /usr/bin/c++ -DHAVE_WEBVIEW -DNDEBUG -DWXUSINGDLL -D_FILE_OFFSET_BITS=64 -D_THREAD_SAFE -D__WXGTK__ -DocpnUSE_GL -DocpnUSE_SVG -DwxUSE_WEBVIEW=1 -I/wrkdirs/usr/ports/astro/opencpn/work/OpenCPN-5.2.4/libs/texcmp/squish -I/wrkdirs/usr/ports/astro/opencpn/work/OpenCPN-5.2.4/libs/texcmp/lz4 -isystem /usr/local/lib/wx/include/gtk3-unicode-3.0 -isystem /usr/local/include/wx-3.0 -O2 -pipe  -fstack-protector-strong -isystem /usr/local/include -fno-strict-aliasing   -isystem /usr/local/include -std=c++11 -pthread -pthread -O2 -pipe  -fstack-protector-strong -isystem /usr/local/include -fno-strict-aliasing   -isystem /usr/local/include -std=c++11    -DPREFIX=\"/usr/local\" -fvisibility=hidden -O3 -msse2 -DSQUISH_USE_SSE=2 -fPIC -Wall -Wno-unused -fexceptions -rdynamic -fno-strict-aliasing -Wno-deprecated-declarations -std=gnu++11 -MD -MT libs/texcmp/CMakeFiles/TEXCMP.dir/squish/alpha.cpp.o -MF libs/texcmp/CMakeFiles/TEXCMP.dir/squish/alpha.cpp.o.d -o libs/texcmp/CMakeFiles/TEXCM
 P.dir/squish/alpha.cpp.o -c /wrkdirs/usr/ports/astro/opencpn/work/OpenCPN-5.2.4/libs/texcmp/squish/alpha.cpp
c++: warning: argument unused during compilation: '-msse2' [-Wunused-command-line-argument]
c++: warning: argument unused during compilation: '-rdynamic' [-Wunused-command-line-argument]
[ 59% 437/734] /usr/bin/c++ -DHAVE_WEBVIEW -DNDEBUG -DWXUSINGDLL -D_FILE_OFFSET_BITS=64 -D_THREAD_SAFE -D__WXGTK__ -DocpnUSE_GL -DocpnUSE_SVG -DwxUSE_WEBVIEW=1 -I/wrkdirs/usr/ports/astro/opencpn/work/OpenCPN-5.2.4/libs/texcmp/squish -I/wrkdirs/usr/ports/astro/opencpn/work/OpenCPN-5.2.4/libs/texcmp/lz4 -isystem /usr/local/lib/wx/include/gtk3-unicode-3.0 -isystem /usr/local/include/wx-3.0 -O2 -pipe  -fstack-protector-strong -isystem /usr/local/include -fno-strict-aliasing   -isystem /usr/local/include -std=c++11 -pthread -pthread -O2 -pipe  -fstack-protector-strong -isystem /usr/local/include -fno-strict-aliasing   -isystem /usr/local/include -std=c++11    -DPREFIX=\"/usr/local\" -fvisibility=hidden -O3 -msse2 -DSQUISH_USE_SSE=2 -fPIC -Wall -Wno-unused -fexceptions -rdynamic -fno-strict-aliasing -Wno-deprecated-declarations -std=gnu++11 -MD -MT libs/texcmp/CMakeFiles/TEXCMP.dir/squish/clusterfit.cpp.o -MF libs/texcmp/CMakeFiles/TEXCMP.dir/squish/clusterfit.cpp.o.d -o libs/texcmp/CMakeF
 iles/TEXCMP.dir/squish/clusterfit.cpp.o -c /wrkdirs/usr/ports/astro/opencpn/work/OpenCPN-5.2.4/libs/texcmp/squish/clusterfit.cpp
FAILED: libs/texcmp/CMakeFiles/TEXCMP.dir/squish/clusterfit.cpp.o 
/usr/bin/c++ -DHAVE_WEBVIEW -DNDEBUG -DWXUSINGDLL -D_FILE_OFFSET_BITS=64 -D_THREAD_SAFE -D__WXGTK__ -DocpnUSE_GL -DocpnUSE_SVG -DwxUSE_WEBVIEW=1 -I/wrkdirs/usr/ports/astro/opencpn/work/OpenCPN-5.2.4/libs/texcmp/squish -I/wrkdirs/usr/ports/astro/opencpn/work/OpenCPN-5.2.4/libs/texcmp/lz4 -isystem /usr/local/lib/wx/include/gtk3-unicode-3.0 -isystem /usr/local/include/wx-3.0 -O2 -pipe  -fstack-protector-strong -isystem /usr/local/include -fno-strict-aliasing   -isystem /usr/local/include -std=c++11 -pthread -pthread -O2 -pipe  -fstack-protector-strong -isystem /usr/local/include -fno-strict-aliasing   -isystem /usr/local/include -std=c++11    -DPREFIX=\"/usr/local\" -fvisibility=hidden -O3 -msse2 -DSQUISH_USE_SSE=2 -fPIC -Wall -Wno-unused -fexceptions -rdynamic -fno-strict-aliasing -Wno-deprecated-declarations -std=gnu++11 -MD -MT libs/texcmp/CMakeFiles/TEXCMP.dir/squish/clusterfit.cpp.o -MF libs/texcmp/CMakeFiles/TEXCMP.dir/squish/clusterfit.cpp.o.d -o libs/texcmp/CMakeFiles/TEXCMP.dir
 /squish/clusterfit.cpp.o -c /wrkdirs/usr/ports/astro/opencpn/work/OpenCPN-5.2.4/libs/texcmp/squish/clusterfit.cpp
c++: warning: argument unused during compilation: '-msse2' [-Wunused-command-line-argument]
c++: warning: argument unused during compilation: '-rdynamic' [-Wunused-command-line-argument]
In file included from /wrkdirs/usr/ports/astro/opencpn/work/OpenCPN-5.2.4/libs/texcmp/squish/clusterfit.cpp:27:
In file included from /wrkdirs/usr/ports/astro/opencpn/work/OpenCPN-5.2.4/libs/texcmp/squish/clusterfit.h:32:
In file included from /wrkdirs/usr/ports/astro/opencpn/work/OpenCPN-5.2.4/libs/texcmp/squish/simd.h:34:
In file included from /wrkdirs/usr/ports/astro/opencpn/work/OpenCPN-5.2.4/libs/texcmp/squish/simd_sse.h:29:
In file included from /usr/lib/clang/11.0.1/include/xmmintrin.h:13:
/usr/lib/clang/11.0.1/include/mmintrin.h:33:5: error: use of undeclared identifier '__builtin_ia32_emms'; did you mean '__builtin_isless'?
    __builtin_ia32_emms();
    ^
/usr/include/c++/v1/math.h:649:12: note: '__builtin_isless' declared here
    return isless(__lcpp_x, __lcpp_y);
           ^
/usr/include/math.h:120:23: note: expanded from macro 'isless'
#define isless(x, y)            __builtin_isless((x), (y))
                                ^
In file included from /wrkdirs/usr/ports/astro/opencpn/work/OpenCPN-5.2.4/libs/texcmp/squish/clusterfit.cpp:27:
In file included from /wrkdirs/usr/ports/astro/opencpn/work/OpenCPN-5.2.4/libs/texcmp/squish/clusterfit.h:32:
In file included from /wrkdirs/usr/ports/astro/opencpn/work/OpenCPN-5.2.4/libs/texcmp/squish/simd.h:34:
In file included from /wrkdirs/usr/ports/astro/opencpn/work/OpenCPN-5.2.4/libs/texcmp/squish/simd_sse.h:29:
In file included from /usr/lib/clang/11.0.1/include/xmmintrin.h:13:
/usr/lib/clang/11.0.1/include/mmintrin.h:33:25: error: too few arguments to function call, expected 2, have 0
    __builtin_ia32_emms();
                        ^
/usr/lib/clang/11.0.1/include/mmintrin.h:50:19: error: use of undeclared identifier '__builtin_ia32_vec_init_v2si'
    return (__m64)__builtin_ia32_vec_init_v2si(__i, 0);
                  ^
/usr/lib/clang/11.0.1/include/mmintrin.h:67:12: error: use of undeclared identifier '__builtin_ia32_vec_ext_v2si'
    return __builtin_ia32_vec_ext_v2si((__v2si)__m, 0);
           ^
/usr/lib/clang/11.0.1/include/mmintrin.h:129:19: error: use of undeclared identifier '__builtin_ia32_packsswb'
    return (__m64)__builtin_ia32_packsswb((__v4hi)__m1, (__v4hi)__m2);
                  ^
/usr/lib/clang/11.0.1/include/mmintrin.h:159:19: error: use of undeclared identifier '__builtin_ia32_packssdw'
    return (__m64)__builtin_ia32_packssdw((__v2si)__m1, (__v2si)__m2);
                  ^
/usr/lib/clang/11.0.1/include/mmintrin.h:189:19: error: use of undeclared identifier '__builtin_ia32_packuswb'
    return (__m64)__builtin_ia32_packuswb((__v4hi)__m1, (__v4hi)__m2);
                  ^
/usr/lib/clang/11.0.1/include/mmintrin.h:216:19: error: use of undeclared identifier '__builtin_ia32_punpckhbw'
    return (__m64)__builtin_ia32_punpckhbw((__v8qi)__m1, (__v8qi)__m2);
                  ^
/usr/lib/clang/11.0.1/include/mmintrin.h:239:19: error: use of undeclared identifier '__builtin_ia32_punpckhwd'
    return (__m64)__builtin_ia32_punpckhwd((__v4hi)__m1, (__v4hi)__m2);
                  ^
/usr/lib/clang/11.0.1/include/mmintrin.h:260:19: error: use of undeclared identifier '__builtin_ia32_punpckhdq'
    return (__m64)__builtin_ia32_punpckhdq((__v2si)__m1, (__v2si)__m2);
                  ^
/usr/lib/clang/11.0.1/include/mmintrin.h:287:19: error: use of undeclared identifier '__builtin_ia32_punpcklbw'
    return (__m64)__builtin_ia32_punpcklbw((__v8qi)__m1, (__v8qi)__m2);
                  ^
/usr/lib/clang/11.0.1/include/mmintrin.h:310:19: error: use of undeclared identifier '__builtin_ia32_punpcklwd'
    return (__m64)__builtin_ia32_punpcklwd((__v4hi)__m1, (__v4hi)__m2);
                  ^
/usr/lib/clang/11.0.1/include/mmintrin.h:331:19: error: use of undeclared identifier '__builtin_ia32_punpckldq'
    return (__m64)__builtin_ia32_punpckldq((__v2si)__m1, (__v2si)__m2);
                  ^
/usr/lib/clang/11.0.1/include/mmintrin.h:352:19: error: use of undeclared identifier '__builtin_ia32_paddb'; did you mean '__builtin_arm_addg'?
    return (__m64)__builtin_ia32_paddb((__v8qi)__m1, (__v8qi)__m2);
                  ^
/usr/lib/clang/11.0.1/include/mmintrin.h:352:19: note: '__builtin_arm_addg' declared here
/usr/lib/clang/11.0.1/include/mmintrin.h:352:19: error: first argument of MTE builtin function must be a pointer ('__v8qi' (vector of 8 'char' values) invalid)
    return (__m64)__builtin_ia32_paddb((__v8qi)__m1, (__v8qi)__m2);
                  ^                    ~~~~~~~~~~~~
/usr/lib/clang/11.0.1/include/mmintrin.h:373:19: error: use of undeclared identifier '__builtin_ia32_paddw'; did you mean '__builtin_arm_addg'?
    return (__m64)__builtin_ia32_paddw((__v4hi)__m1, (__v4hi)__m2);
                  ^
/usr/lib/clang/11.0.1/include/mmintrin.h:352:19: note: '__builtin_arm_addg' declared here
    return (__m64)__builtin_ia32_paddb((__v8qi)__m1, (__v8qi)__m2);
                  ^
/usr/lib/clang/11.0.1/include/mmintrin.h:373:19: error: first argument of MTE builtin function must be a pointer ('__v4hi' (vector of 4 'short' values) invalid)
    return (__m64)__builtin_ia32_paddw((__v4hi)__m1, (__v4hi)__m2);
                  ^                    ~~~~~~~~~~~~
/usr/lib/clang/11.0.1/include/mmintrin.h:394:19: error: use of undeclared identifier '__builtin_ia32_paddd'; did you mean '__builtin_arm_addg'?
    return (__m64)__builtin_ia32_paddd((__v2si)__m1, (__v2si)__m2);
                  ^
/usr/lib/clang/11.0.1/include/mmintrin.h:352:19: note: '__builtin_arm_addg' declared here
    return (__m64)__builtin_ia32_paddb((__v8qi)__m1, (__v8qi)__m2);
                  ^
/usr/lib/clang/11.0.1/include/mmintrin.h:394:19: error: first argument of MTE builtin function must be a pointer ('__v2si' (vector of 2 'int' values) invalid)
    return (__m64)__builtin_ia32_paddd((__v2si)__m1, (__v2si)__m2);
                  ^                    ~~~~~~~~~~~~
fatal error: too many errors emitted, stopping now [-ferror-limit=]
20 errors generated.
[ 59% 437/734] /usr/bin/c++ -DHAVE_WEBVIEW -DNDEBUG -DWXUSINGDLL -D_FILE_OFFSET_BITS=64 -D_THREAD_SAFE -D__WXGTK__ -DocpnUSE_GL -DocpnUSE_SVG -DwxUSE_WEBVIEW=1 -I/wrkdirs/usr/ports/astro/opencpn/work/OpenCPN-5.2.4/libs/texcmp/squish -I/wrkdirs/usr/ports/astro/opencpn/work/OpenCPN-5.2.4/libs/texcmp/lz4 -isystem /usr/local/lib/wx/include/gtk3-unicode-3.0 -isystem /usr/local/include/wx-3.0 -O2 -pipe  -fstack-protector-strong -isystem /usr/local/include -fno-strict-aliasing   -isystem /usr/local/include -std=c++11 -pthread -pthread -O2 -pipe  -fstack-protector-strong -isystem /usr/local/include -fno-strict-aliasing   -isystem /usr/local/include -std=c++11    -DPREFIX=\"/usr/local\" -fvisibility=hidden -O3 -msse2 -DSQUISH_USE_SSE=2 -fPIC -Wall -Wno-unused -fexceptions -rdynamic -fno-strict-aliasing -Wno-deprecated-declarations -std=gnu++11 -MD -MT libs/texcmp/CMakeFiles/TEXCMP.dir/squish/colourblock.cpp.o -MF libs/texcmp/CMakeFiles/TEXCMP.dir/squish/colourblock.cpp.o.d -o libs/texcmp/CMak
 eFiles/TEXCMP.dir/squish/colourblock.cpp.o -c /wrkdirs/usr/ports/astro/opencpn/work/OpenCPN-5.2.4/libs/texcmp/squish/colourblock.cpp
c++: warning: argument unused during compilation: '-msse2' [-Wunused-command-line-argument]
c++: warning: argument unused during compilation: '-rdynamic' [-Wunused-command-line-argument]
ninja: build stopped: subcommand failed.
===> Compilation failed unexpectedly.
Try to set MAKE_JOBS_UNSAFE=yes and rebuild before reporting the failure to
the maintainer.
*** Error code 1

Stop.
make: stopped in /usr/ports/astro/opencpn
Received on Sun Aug 01 2021 - 18:12:16 UTC

Original text of this message