[package - 130arm64-quarterly][games/libretro-paralleln64] Failed for libretro-paralleln64-0.20210127_1 in build

From: <pkg-fallout_at_FreeBSD.org>
Date: Sun, 1 Aug 2021 14:43:35 GMT
You are receiving this mail as a port that you maintain
is failing to build on the FreeBSD package build server.
Please investigate the failure and submit a PR to fix
build.

Maintainer:     menelkir_at_itroll.org
Log URL:        http://ampere1.nyi.freebsd.org/data/130arm64-quarterly/e17f46c5dd6b/logs/libretro-paralleln64-0.20210127_1.log
Build URL:      http://ampere1.nyi.freebsd.org/build.html?mastername=130arm64-quarterly&build=e17f46c5dd6b
Log:

=>> Building games/libretro-paralleln64
build started at Sun Aug  1 14:42:48 UTC 2021
port directory: /usr/ports/games/libretro-paralleln64
package name: libretro-paralleln64-0.20210127_1
building for: FreeBSD 130arm64-quarterly-job-05 13.0-RELEASE-p3 FreeBSD 13.0-RELEASE-p3 arm64
maintained by: menelkir_at_itroll.org
Makefile ident: 
Poudriere version: 3.2.8-21-g883afb07
Host OSVERSION: 1400008
Jail OSVERSION: 1300139
Job Id: 05

---Begin Environment---
SHELL=/bin/csh
OSVERSION=1300139
UNAME_v=FreeBSD 13.0-RELEASE-p3
UNAME_r=13.0-RELEASE-p3
BLOCKSIZE=K
MAIL=/var/mail/root
MM_CHARSET=UTF-8
LANG=C.UTF-8
STATUS=1
HOME=/root
PATH=/sbin:/bin:/usr/sbin:/usr/bin:/usr/local/sbin:/usr/local/bin:/root/bin
LOCALBASE=/usr/local
USER=root
LIBEXECPREFIX=/usr/local/libexec/poudriere
POUDRIERE_VERSION=3.2.8-21-g883afb07
MASTERMNT=/usr/local/poudriere/data/.m/130arm64-quarterly/ref
POUDRIERE_BUILD_TYPE=bulk
PACKAGE_BUILDING=yes
SAVED_TERM=
PWD=/usr/local/poudriere/data/.m/130arm64-quarterly/ref/.p/pool
P_PORTS_FEATURES=FLAVORS SELECTED_OPTIONS
MASTERNAME=130arm64-quarterly
SCRIPTPREFIX=/usr/local/share/poudriere
OLDPWD=/usr/local/poudriere/data/.m/130arm64-quarterly/ref/.p
SCRIPTPATH=/usr/local/share/poudriere/bulk.sh
POUDRIEREPATH=/usr/local/bin/poudriere
---End Environment---

---Begin Poudriere Port Flags/Env---
PORT_FLAGS=
PKGENV=
FLAVOR=
DEPENDS_ARGS=
MAKE_ARGS=
---End Poudriere Port Flags/Env---

---Begin OPTIONS List---
---End OPTIONS List---

--MAINTAINER--
menelkir_at_itroll.org
--End MAINTAINER--

--CONFIGURE_ARGS--

--End CONFIGURE_ARGS--

--CONFIGURE_ENV--
MAKE=gmake XDG_DATA_HOME=/wrkdirs/usr/ports/games/libretro-paralleln64/work  XDG_CONFIG_HOME=/wrkdirs/usr/ports/games/libretro-paralleln64/work  HOME=/wrkdirs/usr/ports/games/libretro-paralleln64/work TMPDIR="/tmp" PATH=/wrkdirs/usr/ports/games/libretro-paralleln64/work/.bin:/sbin:/bin:/usr/sbin:/usr/bin:/usr/local/sbin:/usr/local/bin:/root/bin SHELL=/bin/sh CONFIG_SHELL=/bin/sh CMAKE_PREFIX_PATH="/usr/local"
--End CONFIGURE_ENV--

--MAKE_ENV--
XDG_DATA_HOME=/wrkdirs/usr/ports/games/libretro-paralleln64/work  XDG_CONFIG_HOME=/wrkdirs/usr/ports/games/libretro-paralleln64/work  HOME=/wrkdirs/usr/ports/games/libretro-paralleln64/work TMPDIR="/tmp" PATH=/wrkdirs/usr/ports/games/libretro-paralleln64/work/.bin:/sbin:/bin:/usr/sbin:/usr/bin:/usr/local/sbin:/usr/local/bin:/root/bin NO_PIE=yes MK_DEBUG_FILES=no MK_KERNEL_SYMBOLS=no SHELL=/bin/sh NO_LINT=YES PREFIX=/usr/local  LOCALBASE=/usr/local  CC="cc" CFLAGS="-O2 -pipe  -fstack-protector-strong -isystem /usr/local/include -fno-strict-aliasing "  CPP="cpp" CPPFLAGS="-isystem /usr/local/include"  LDFLAGS=" -fstack-protector-strong " LIBS="-L/usr/local/lib"  CXX="c++" CXXFLAGS="-O2 -pipe -fstack-protector-strong -isystem /usr/local/include -fno-strict-aliasing  -isystem /usr/local/include "  MANPREFIX="/usr/local" BSD_INSTALL_PROGRAM="install  -s -m 555"  BSD_INSTALL_LIB="install  -s -m 0644"  BSD_INSTALL_SCRIPT="install  -m 555"  BSD_INSTALL_DATA="install  -m 0644"  BSD_INSTALL_MA
 N="install  -m 444"
--End MAKE_ENV--

--PLIST_SUB--
OSREL=13.0 PREFIX=%D LOCALBASE=/usr/local  RESETPREFIX=/usr/local LIB32DIR=lib DOCSDIR="share/doc/libretro-paralleln64"  EXAMPLESDIR="share/examples/libretro-paralleln64"  DATADIR="share/libretro-paralleln64"  WWWDIR="www/libretro-paralleln64"  ETCDIR="etc/libretro-paralleln64"
--End PLIST_SUB--

--SUB_LIST--
PREFIX=/usr/local LOCALBASE=/usr/local  DATADIR=/usr/local/share/libretro-paralleln64 DOCSDIR=/usr/local/share/doc/libretro-paralleln64 EXAMPLESDIR=/usr/local/share/examples/libretro-paralleln64  WWWDIR=/usr/local/www/libretro-paralleln64 ETCDIR=/usr/local/etc/libretro-paralleln64
--End SUB_LIST--

---Begin make.conf---
USE_PACKAGE_DEPENDS=yes
BATCH=yes
WRKDIRPREFIX=/wrkdirs
PORTSDIR=/usr/ports
PACKAGES=/packages
DISTDIR=/distfiles
PACKAGE_BUILDING=yes
PACKAGE_BUILDING_FLAVORS=yes
#### /usr/local/etc/poudriere.d/make.conf ####
# XXX: We really need this but cannot use it while 'make checksum' does not
# try the next mirror on checksum failure.  It currently retries the same
# failed mirror and then fails rather then trying another.  It *does*
# try the next if the size is mismatched though.
#MASTER_SITE_FREEBSD=yes
# Build ALLOW_MAKE_JOBS_PACKAGES with 2 jobs
MAKE_JOBS_NUMBER=2
#### /usr/ports/Mk/Scripts/ports_env.sh ####
_CCVERSION_921dbbb2=FreeBSD clang version 11.0.1 (git_at_github.com:llvm/llvm-project.git llvmorg-11.0.1-0-g43ff75f2c3fe) Target: aarch64-unknown-freebsd13.0 Thread model: posix InstalledDir: /usr/bin
_ALTCCVERSION_921dbbb2=none
_CXXINTERNAL_acaad9ca=FreeBSD clang version 11.0.1 (git_at_github.com:llvm/llvm-project.git llvmorg-11.0.1-0-g43ff75f2c3fe) Target: aarch64-unknown-freebsd13.0 Thread model: posix InstalledDir: /usr/bin "/usr/bin/ld" "--eh-frame-hdr" "-dynamic-linker" "/libexec/ld-elf.so.1" "--enable-new-dtags" "-o" "a.out" "/usr/lib/crt1.o" "/usr/lib/crti.o" "/usr/lib/crtbegin.o" "-L/usr/lib" "/dev/null" "-lc++" "-lm" "-lgcc" "--as-needed" "-lgcc_s" "--no-as-needed" "-lc" "-lgcc" "--as-needed" "-lgcc_s" "--no-as-needed" "/usr/lib/crtend.o" "/usr/lib/crtn.o"
CC_OUTPUT_921dbbb2_58173849=yes
CC_OUTPUT_921dbbb2_9bdba57c=yes
CC_OUTPUT_921dbbb2_6a4fe7f5=yes
CC_OUTPUT_921dbbb2_6bcac02b=yes
CC_OUTPUT_921dbbb2_67d20829=yes
CC_OUTPUT_921dbbb2_bfa62e83=yes
CC_OUTPUT_921dbbb2_f0b4d593=yes
CC_OUTPUT_921dbbb2_308abb44=yes
CC_OUTPUT_921dbbb2_f00456e5=yes
CC_OUTPUT_921dbbb2_65ad290d=yes
CC_OUTPUT_921dbbb2_f2776b26=yes
CC_OUTPUT_921dbbb2_b2657cc3=yes
CC_OUTPUT_921dbbb2_380987f7=yes
CC_OUTPUT_921dbbb2_160933ec=yes
CC_OUTPUT_921dbbb2_fb62803b=yes
_OBJC_CCVERSION_921dbbb2=FreeBSD clang version 11.0.1 (git_at_github.com:llvm/llvm-project.git llvmorg-11.0.1-0-g43ff75f2c3fe) Target: aarch64-unknown-freebsd13.0 Thread model: posix InstalledDir: /usr/bin
_OBJC_ALTCCVERSION_921dbbb2=none
ARCH=aarch64
OPSYS=FreeBSD
_OSRELEASE=13.0-RELEASE-p3
OSREL=13.0
OSVERSION=1300139
PYTHONBASE=/usr/local
CONFIGURE_MAX_CMD_LEN=524288
HAVE_PORTS_ENV=1
#### Misc Poudriere ####
GID=0
UID=0
---End make.conf---
--Resource limits--
cpu time               (seconds, -t)  unlimited
file size           (512-blocks, -f)  unlimited
data seg size           (kbytes, -d)  1048576
stack size              (kbytes, -s)  1048576
core file size      (512-blocks, -c)  unlimited
max memory size         (kbytes, -m)  unlimited
locked memory           (kbytes, -l)  unlimited
max user processes              (-u)  89999
open files                      (-n)  1024
virtual mem size        (kbytes, -v)  unlimited
swap limit              (kbytes, -w)  unlimited
socket buffer size       (bytes, -b)  unlimited
pseudo-terminals                (-p)  unlimited
kqueues                         (-k)  unlimited
umtx shared locks               (-o)  unlimited
--End resource limits--
=======================<phase: check-sanity   >============================
===>  License BITSTREAM_VERA CC0-1.0 GFDL GPLv2 GPLv3 LGPL3 MIT ZLIB accepted by the user
===========================================================================
=======================<phase: pkg-depends    >============================
===>   libretro-paralleln64-0.20210127_1 depends on file: /usr/local/sbin/pkg - not found
===>   Installing existing package /packages/All/pkg-1.16.3.txz
[130arm64-quarterly-job-05] Installing pkg-1.16.3...
[130arm64-quarterly-job-05] Extracting pkg-1.16.3: .......... done
===>   libretro-paralleln64-0.20210127_1 depends on file: /usr/local/sbin/pkg - found
===>   Returning to build of libretro-paralleln64-0.20210127_1
===========================================================================
=======================<phase: fetch-depends  >============================
===========================================================================
=======================<phase: fetch          >============================
===>  License BITSTREAM_VERA CC0-1.0 GFDL GPLv2 GPLv3 LGPL3 MIT ZLIB accepted by the user
=> libretro-parallel-n64-0.20210127-6e26fbb_GH0.tar.gz doesn't seem to exist in /portdistfiles/.
=> Attempting to fetch https://codeload.github.com/libretro/parallel-n64/tar.gz/6e26fbb?dummy=/libretro-parallel-n64-0.20210127-6e26fbb_GH0.tar.gz
fetch: https://codeload.github.com/libretro/parallel-n64/tar.gz/6e26fbb?dummy=/libretro-parallel-n64-0.20210127-6e26fbb_GH0.tar.gz: size unknown
fetch: https://codeload.github.com/libretro/parallel-n64/tar.gz/6e26fbb?dummy=/libretro-parallel-n64-0.20210127-6e26fbb_GH0.tar.gz: size of remote file is not known
libretro-parallel-n64-0.20210127-6e26fbb_GH0.tar.gz        4926 kB 4584 kBps    01s
===> Fetching all distfiles required by libretro-paralleln64-0.20210127_1 for building
===========================================================================
=======================<phase: checksum       >============================
===>  License BITSTREAM_VERA CC0-1.0 GFDL GPLv2 GPLv3 LGPL3 MIT ZLIB accepted by the user
===> Fetching all distfiles required by libretro-paralleln64-0.20210127_1 for building
=> SHA256 Checksum OK for libretro-parallel-n64-0.20210127-6e26fbb_GH0.tar.gz.
===========================================================================
=======================<phase: extract-depends>============================
===========================================================================
=======================<phase: extract        >============================
===>  License BITSTREAM_VERA CC0-1.0 GFDL GPLv2 GPLv3 LGPL3 MIT ZLIB accepted by the user
===> Fetching all distfiles required by libretro-paralleln64-0.20210127_1 for building
===>  Extracting for libretro-paralleln64-0.20210127_1
=> SHA256 Checksum OK for libretro-parallel-n64-0.20210127-6e26fbb_GH0.tar.gz.
===========================================================================
=======================<phase: patch-depends  >============================
===========================================================================
=======================<phase: patch          >============================
===>  Patching for libretro-paralleln64-0.20210127_1
===========================================================================
=======================<phase: build-depends  >============================
===>   libretro-paralleln64-0.20210127_1 depends on package: gmake>=4.3 - not found
===>   Installing existing package /packages/All/gmake-4.3_2.txz
[130arm64-quarterly-job-05] Installing gmake-4.3_2...
[130arm64-quarterly-job-05] `-- Installing gettext-runtime-0.21...
[130arm64-quarterly-job-05] |   `-- Installing indexinfo-0.3.1...
[130arm64-quarterly-job-05] |   `-- Extracting indexinfo-0.3.1: .... done
[130arm64-quarterly-job-05] `-- Extracting gettext-runtime-0.21: .......... done
[130arm64-quarterly-job-05] Extracting gmake-4.3_2: .......... done
===>   libretro-paralleln64-0.20210127_1 depends on package: gmake>=4.3 - found
===>   Returning to build of libretro-paralleln64-0.20210127_1
===>   libretro-paralleln64-0.20210127_1 depends on package: xorgproto>=0 - not found
===>   Installing existing package /packages/All/xorgproto-2021.4.txz
[130arm64-quarterly-job-05] Installing xorgproto-2021.4...
[130arm64-quarterly-job-05] Extracting xorgproto-2021.4: .......... done
===>   libretro-paralleln64-0.20210127_1 depends on package: xorgproto>=0 - found
<snip>
         ^~~~~~~~~~~~~~~~~~~
./mupen64plus-core/src/r4300/hacktarux_dynarec/assemble.h:465:10: warning: cast to smaller integer type 'unsigned int' from 'unsigned int *' [-Wpointer-to-int-cast]
   put32((unsigned int)(m32));
         ^~~~~~~~~~~~~~~~~~~
./mupen64plus-core/src/r4300/hacktarux_dynarec/assemble.h:473:10: warning: cast to smaller integer type 'unsigned int' from 'unsigned int *' [-Wpointer-to-int-cast]
   put32((unsigned int)(m32));
         ^~~~~~~~~~~~~~~~~~~
./mupen64plus-core/src/r4300/hacktarux_dynarec/assemble.h:480:10: warning: cast to smaller integer type 'unsigned int' from 'unsigned int *' [-Wpointer-to-int-cast]
   put32((unsigned int)(m32));
         ^~~~~~~~~~~~~~~~~~~
./mupen64plus-core/src/r4300/hacktarux_dynarec/assemble.h:488:10: warning: cast to smaller integer type 'unsigned int' from 'unsigned int *' [-Wpointer-to-int-cast]
   put32((unsigned int)(m32));
         ^~~~~~~~~~~~~~~~~~~
./mupen64plus-core/src/r4300/hacktarux_dynarec/assemble.h:496:10: warning: cast to smaller integer type 'unsigned int' from 'unsigned int *' [-Wpointer-to-int-cast]
   put32((unsigned int)(m32));
         ^~~~~~~~~~~~~~~~~~~
./mupen64plus-core/src/r4300/hacktarux_dynarec/assemble.h:504:10: warning: cast to smaller integer type 'unsigned int' from 'unsigned char *' [-Wpointer-to-int-cast]
   put32((unsigned int)(m8));
         ^~~~~~~~~~~~~~~~~~
./mupen64plus-core/src/r4300/hacktarux_dynarec/assemble.h:512:10: warning: cast to smaller integer type 'unsigned int' from 'unsigned short *' [-Wpointer-to-int-cast]
   put32((unsigned int)(m16));
         ^~~~~~~~~~~~~~~~~~~
./mupen64plus-core/src/r4300/hacktarux_dynarec/assemble.h:520:10: warning: cast to smaller integer type 'unsigned int' from 'unsigned short *' [-Wpointer-to-int-cast]
   put32((unsigned int)(m16));
         ^~~~~~~~~~~~~~~~~~~
./mupen64plus-core/src/r4300/hacktarux_dynarec/assemble.h:527:10: warning: cast to smaller integer type 'unsigned int' from 'unsigned int *' [-Wpointer-to-int-cast]
   put32((unsigned int)(m32));
         ^~~~~~~~~~~~~~~~~~~
./mupen64plus-core/src/r4300/hacktarux_dynarec/assemble.h:534:10: warning: cast to smaller integer type 'unsigned int' from 'unsigned int *' [-Wpointer-to-int-cast]
   put32((unsigned int)(m32));
         ^~~~~~~~~~~~~~~~~~~
./mupen64plus-core/src/r4300/hacktarux_dynarec/assemble.h:541:10: warning: cast to smaller integer type 'unsigned int' from 'unsigned int *' [-Wpointer-to-int-cast]
   put32((unsigned int)(m32));
         ^~~~~~~~~~~~~~~~~~~
./mupen64plus-core/src/r4300/hacktarux_dynarec/assemble.h:547:10: warning: cast to smaller integer type 'unsigned int' from 'unsigned int *' [-Wpointer-to-int-cast]
   put32((unsigned int)(memoffs32));
         ^~~~~~~~~~~~~~~~~~~~~~~~~
./mupen64plus-core/src/r4300/hacktarux_dynarec/assemble.h:569:10: warning: cast to smaller integer type 'unsigned int' from 'unsigned int *' [-Wpointer-to-int-cast]
   put32((unsigned int)m32);
         ^~~~~~~~~~~~~~~~~
./mupen64plus-core/src/r4300/hacktarux_dynarec/assemble.h:590:10: warning: cast to smaller integer type 'unsigned int' from 'unsigned int *' [-Wpointer-to-int-cast]
   put32((unsigned int)(m32));
         ^~~~~~~~~~~~~~~~~~~
./mupen64plus-core/src/r4300/hacktarux_dynarec/assemble.h:691:10: warning: cast to smaller integer type 'unsigned int' from 'unsigned int *' [-Wpointer-to-int-cast]
   put32((unsigned int)(memoffs32));
         ^~~~~~~~~~~~~~~~~~~~~~~~~
In file included from mupen64plus-core/src/r4300/empty_dynarec.c:23:
In file included from mupen64plus-core/src/r4300/recomp.h:49:
mupen64plus-core/src/r4300/hacktarux_dynarec/assemble.h:406:10: warning: cast to smaller integer type 'unsigned int' from 'unsigned short *' [-Wpointer-to-int-cast]
   put32((unsigned int)(m16));
         ^~~~~~~~~~~~~~~~~~~
mupen64plus-core/src/r4300/hacktarux_dynarec/assemble.h:413:10: warning: cast to smaller integer type 'unsigned int' from 'unsigned char *' [-Wpointer-to-int-cast]
   put32((unsigned int)(m8));
         ^~~~~~~~~~~~~~~~~~
mupen64plus-core/src/r4300/hacktarux_dynarec/assemble.h:420:10: warning: cast to smaller integer type 'unsigned int' from 'unsigned int *' [-Wpointer-to-int-cast]
   put32((unsigned int)(m32));
         ^~~~~~~~~~~~~~~~~~~
mupen64plus-core/src/r4300/hacktarux_dynarec/assemble.h:427:10: warning: cast to smaller integer type 'unsigned int' from 'unsigned int *' [-Wpointer-to-int-cast]
   put32((unsigned int)(m32));
         ^~~~~~~~~~~~~~~~~~~
mupen64plus-core/src/r4300/hacktarux_dynarec/assemble.h:435:10: warning: cast to smaller integer type 'unsigned int' from 'unsigned short *' [-Wpointer-to-int-cast]
   put32((unsigned int)(m16));
         ^~~~~~~~~~~~~~~~~~~
mupen64plus-core/src/r4300/hacktarux_dynarec/assemble.h:443:10: warning: cast to smaller integer type 'unsigned int' from 'unsigned char *' [-Wpointer-to-int-cast]
   put32((unsigned int)(m8));
         ^~~~~~~~~~~~~~~~~~
mupen64plus-core/src/r4300/hacktarux_dynarec/assemble.h:450:10: warning: cast to smaller integer type 'unsigned int' from 'unsigned int *' [-Wpointer-to-int-cast]
   put32((unsigned int)(m32));
         ^~~~~~~~~~~~~~~~~~~
mupen64plus-core/src/r4300/hacktarux_dynarec/assemble.h:457:10: warning: cast to smaller integer type 'unsigned int' from 'unsigned int *' [-Wpointer-to-int-cast]
   put32((unsigned int)(m32));
         ^~~~~~~~~~~~~~~~~~~
mupen64plus-core/src/r4300/hacktarux_dynarec/assemble.h:465:10: warning: cast to smaller integer type 'unsigned int' from 'unsigned int *' [-Wpointer-to-int-cast]
   put32((unsigned int)(m32));
         ^~~~~~~~~~~~~~~~~~~
mupen64plus-core/src/r4300/hacktarux_dynarec/assemble.h:473:10: warning: cast to smaller integer type 'unsigned int' from 'unsigned int *' [-Wpointer-to-int-cast]
   put32((unsigned int)(m32));
         ^~~~~~~~~~~~~~~~~~~
mupen64plus-core/src/r4300/hacktarux_dynarec/assemble.h:480:10: warning: cast to smaller integer type 'unsigned int' from 'unsigned int *' [-Wpointer-to-int-cast]
   put32((unsigned int)(m32));
         ^~~~~~~~~~~~~~~~~~~
mupen64plus-core/src/r4300/hacktarux_dynarec/assemble.h:488:10: warning: cast to smaller integer type 'unsigned int' from 'unsigned int *' [-Wpointer-to-int-cast]
   put32((unsigned int)(m32));
         ^~~~~~~~~~~~~~~~~~~
mupen64plus-core/src/r4300/hacktarux_dynarec/assemble.h:496:10: warning: cast to smaller integer type 'unsigned int' from 'unsigned int *' [-Wpointer-to-int-cast]
   put32((unsigned int)(m32));
         ^~~~~~~~~~~~~~~~~~~
mupen64plus-core/src/r4300/hacktarux_dynarec/assemble.h:504:10: warning: cast to smaller integer type 'unsigned int' from 'unsigned char *' [-Wpointer-to-int-cast]
   put32((unsigned int)(m8));
         ^~~~~~~~~~~~~~~~~~
mupen64plus-core/src/r4300/hacktarux_dynarec/assemble.h:512:10: warning: cast to smaller integer type 'unsigned int' from 'unsigned short *' [-Wpointer-to-int-cast]
   put32((unsigned int)(m16));
         ^~~~~~~~~~~~~~~~~~~
mupen64plus-core/src/r4300/hacktarux_dynarec/assemble.h:520:10: warning: cast to smaller integer type 'unsigned int' from 'unsigned short *' [-Wpointer-to-int-cast]
   put32((unsigned int)(m16));
         ^~~~~~~~~~~~~~~~~~~
mupen64plus-core/src/r4300/hacktarux_dynarec/assemble.h:527:10: warning: cast to smaller integer type 'unsigned int' from 'unsigned int *' [-Wpointer-to-int-cast]
   put32((unsigned int)(m32));
         ^~~~~~~~~~~~~~~~~~~
mupen64plus-core/src/r4300/hacktarux_dynarec/assemble.h:534:10: warning: cast to smaller integer type 'unsigned int' from 'unsigned int *' [-Wpointer-to-int-cast]
   put32((unsigned int)(m32));
         ^~~~~~~~~~~~~~~~~~~
mupen64plus-core/src/r4300/hacktarux_dynarec/assemble.h:541:10: warning: cast to smaller integer type 'unsigned int' from 'unsigned int *' [-Wpointer-to-int-cast]
   put32((unsigned int)(m32));
         ^~~~~~~~~~~~~~~~~~~
mupen64plus-core/src/r4300/hacktarux_dynarec/assemble.h:547:10: warning: cast to smaller integer type 'unsigned int' from 'unsigned int *' [-Wpointer-to-int-cast]
   put32((unsigned int)(memoffs32));
         ^~~~~~~~~~~~~~~~~~~~~~~~~
mupen64plus-core/src/r4300/hacktarux_dynarec/assemble.h:569:10: warning: cast to smaller integer type 'unsigned int' from 'unsigned int *' [-Wpointer-to-int-cast]
   put32((unsigned int)m32);
         ^~~~~~~~~~~~~~~~~
mupen64plus-core/src/r4300/hacktarux_dynarec/assemble.h:590:10: warning: cast to smaller integer type 'unsigned int' from 'unsigned int *' [-Wpointer-to-int-cast]
   put32((unsigned int)(m32));
         ^~~~~~~~~~~~~~~~~~~
mupen64plus-core/src/r4300/hacktarux_dynarec/assemble.h:691:10: warning: cast to smaller integer type 'unsigned int' from 'unsigned int *' [-Wpointer-to-int-cast]
   put32((unsigned int)(memoffs32));
         ^~~~~~~~~~~~~~~~~~~~~~~~~
In file included from mupen64plus-core/src/r4300/new_dynarec/new_dynarec_64.c:63:
mupen64plus-core/src/r4300/new_dynarec/arm64/assem_arm64.h:141:8: error: unknown type name 'u_int'
extern u_int rounding_modes[4];
       ^
mupen64plus-core/src/r4300/new_dynarec/arm64/assem_arm64.h:142:8: error: unknown type name 'u_char'; did you mean 'char'?
extern u_char restore_candidate[512];
       ^~~~~~
       char
mupen64plus-core/src/r4300/new_dynarec/new_dynarec_64.c:93:3: error: unknown type name 'u_int'
  u_int wasconst;
  ^
mupen64plus-core/src/r4300/new_dynarec/new_dynarec_64.c:94:3: error: unknown type name 'u_int'
  u_int isconst;
  ^
mupen64plus-core/src/r4300/new_dynarec/new_dynarec_64.c:100:3: error: unknown type name 'u_int'
  u_int vaddr;
  ^
mupen64plus-core/src/r4300/new_dynarec/new_dynarec_64.c:101:3: error: unknown type name 'u_int'
  u_int reg32;
  ^
mupen64plus-core/src/r4300/new_dynarec/new_dynarec_64.c:107:1: error: unknown type name 'u_char'; did you mean 'char'?
u_char *out;
^~~~~~
char
mupen64plus-core/src/r4300/new_dynarec/new_dynarec_64.c:114:8: error: unknown type name 'u_int'
static u_int start;
       ^
mupen64plus-core/src/r4300/new_dynarec/new_dynarec_64.c:115:8: error: unknown type name 'u_int'
static u_int *source;
       ^
mupen64plus-core/src/r4300/new_dynarec/new_dynarec_64.c:116:8: error: unknown type name 'u_int'
static u_int pagelimit;
       ^
mupen64plus-core/src/r4300/new_dynarec/new_dynarec_64.c:118:8: error: unknown type name 'u_char'; did you mean 'char'?
static u_char itype[MAXBLOCK];
       ^~~~~~
       char
mupen64plus-core/src/r4300/new_dynarec/new_dynarec_64.c:119:8: error: unknown type name 'u_char'; did you mean 'char'?
static u_char opcode[MAXBLOCK];
       ^~~~~~
       char
mupen64plus-core/src/r4300/new_dynarec/new_dynarec_64.c:120:8: error: unknown type name 'u_char'; did you mean 'char'?
static u_char opcode2[MAXBLOCK];
       ^~~~~~
       char
mupen64plus-core/src/r4300/new_dynarec/new_dynarec_64.c:121:8: error: unknown type name 'u_char'; did you mean 'char'?
static u_char bt[MAXBLOCK];
       ^~~~~~
       char
mupen64plus-core/src/r4300/new_dynarec/new_dynarec_64.c:122:8: error: unknown type name 'u_char'; did you mean 'char'?
static u_char rs1[MAXBLOCK];
       ^~~~~~
       char
mupen64plus-core/src/r4300/new_dynarec/new_dynarec_64.c:123:8: error: unknown type name 'u_char'; did you mean 'char'?
static u_char rs2[MAXBLOCK];
       ^~~~~~
       char
mupen64plus-core/src/r4300/new_dynarec/new_dynarec_64.c:124:8: error: unknown type name 'u_char'; did you mean 'char'?
static u_char rt1[MAXBLOCK];
       ^~~~~~
       char
mupen64plus-core/src/r4300/new_dynarec/new_dynarec_64.c:125:8: error: unknown type name 'u_char'; did you mean 'char'?
static u_char rt2[MAXBLOCK];
       ^~~~~~
       char
mupen64plus-core/src/r4300/new_dynarec/new_dynarec_64.c:126:8: error: unknown type name 'u_char'; did you mean 'char'?
static u_char us1[MAXBLOCK];
       ^~~~~~
       char
fatal error: too many errors emitted, stopping now [-ferror-limit=]
23 warnings generated.
cc -isystem /usr/local/include -O2 -pipe  -fstack-protector-strong -isystem /usr/local/include -fno-strict-aliasing  -DHAVE_RICE -DHAVE_GLN64 -DHAVE_GLIDE64 -DHAVE_THR_AL -MMD -DINLINE="inline" -Ofast -DNDEBUG -D__LIBRETRO__ -DM64P_PLUGIN_API -DM64P_CORE_PROTOTYPES -D_ENDUSER_RELEASE -DSINC_LOWER_QUALITY -I./glide2gl/src/Glitch64/inc -I./mupen64plus-core/src -I./mupen64plus-core/src/api -I./include -I./mupen64plus-core/src/plugin/audio_libretro -I./libretro-common/include -I./libretro  -fPIC   -DENABLE_3POINT -DENABLE_TEXTURE_SAMPLING -DHAVE_OPENGL -DDYNAREC -DNEW_DYNAREC=4 -c libretro-common/glsm/glsm.c -o libretro-common/glsm/glsm.o
23 warnings and 20 errors generated.
gmake[1]: *** [Makefile:992: mupen64plus-core/src/r4300/new_dynarec/new_dynarec_64.o] Error 1
gmake[1]: *** Waiting for unfinished jobs....
gmake[1]: Leaving directory '/wrkdirs/usr/ports/games/libretro-paralleln64/work/parallel-n64-6e26fbb'
===> Compilation failed unexpectedly.
Try to set MAKE_JOBS_UNSAFE=yes and rebuild before reporting the failure to
the maintainer.
*** Error code 1

Stop.
make: stopped in /usr/ports/games/libretro-paralleln64
Received on Sun Aug 01 2021 - 14:43:35 UTC

Original text of this message