FreeBSD-main-amd64-test - Build #29597 - Still Unstable

From: <jenkins-admin_at_FreeBSD.org>
Date: Wed, 30 Sep 2026 21:58:16 UTC
FreeBSD-main-amd64-test - Build #29597 (5cc15fef2656b078982d453b8915379b47ff0e88) - Still Unstable

Build information: https://ci.FreeBSD.org/job/FreeBSD-main-amd64-test/29597/
Full change log: https://ci.FreeBSD.org/job/FreeBSD-main-amd64-test/29597/changes
Full build log: https://ci.FreeBSD.org/job/FreeBSD-main-amd64-test/29597/console

Status explanation:
"Unstable" - some tests are suspected being broken by the following changes
"Still Unstable" - the failing test cases have not been fixed by these
                   following changes and this is a notification to note that
                   these changes have not been fully tested by the CI system

Change summaries:
(Those commits are likely but not certainly responsible)

e6fbef451dd45159071a1b234cd13c66fbb654fa by olce:
cred: Fix a race in the FreeBSD-14-compatible setgroups(2)

e40d60838c9a0ebe5e5fb0e3cb00e7b08dd8c959 by olce:
cred: freebsd14_setgroups(): Remove a now-unnecessary local variable

872c36cb6f2de17278c559a300c2163d8b39b3c6 by christos:
cuse: Fix hang on readv(2) and writev(2) with multiple iovecs

2fd8d2eb7bb91148169471291dbcfa499579b1bc by christos:
cuse: Actually use cuse_modevent()

3b3e6473b13093c6900194b42e8a11f56c2ea7d8 by christos:
cuse: Create /dev/cuse with MAKEDEV_CHECKNAME

40431ec4da1d14032462ea6327ef695c2f58a3b1 by christos:
cuse: Improve server cleanup

e923a30ecf2a34cdf46afcfbffdbc30e822148d1 by christos:
cuse: Remove unnecessary semicolon in cuse_convert_error()

34b00da59b8f8c3fa877135beaefd3ad31841f41 by christos:
cuse: Retire unnecessary CUSE_VERSION

fad756fd200bf988861eb80146392661a887ab71 by christos:
cuse: Use make_dev_s() to create client devices

d38ef1aca969f9a79572958c06bc4a4e03f053c2 by christos:
cuse: Implement hot-unload

f96c4f45f791124192363c9aa2898b1d0e4cc6d0 by christos:
cuse: Assert the server refcount

b55b6e1d727bdc810b157047cb12e2e550333551 by christos:
cuse: Rename cuse_server_free() to cuse_server_dtor()

e9c3a9fad53034a16ec16662e7248be7c295ddf1 by olivier:
routing: restore opt_route.h in route.c, fib_algo teardown was compiled

7a57dcda272cfc8db28cca74e5ed40fe660d22f2 by br:
gicv5_acpi: fix non-SMP build

5cc15fef2656b078982d453b8915379b47ff0e88 by tijl:
hid: Increase HID_ITEM_MAXUSAGE to 32



The failed test cases:

8 tests failed.
FAILED:  sys.netpfil.pf.pfsync.bulk

Error Message:
state not found on synced host

FAILED:  sys.kern.ssl_sendfile.eagain_vs_eof

Error Message:
/usr/src/tests/sys/kern/ssl_sendfile.c:485: c.sbytes == -1 not met

FAILED:  sys.kern.ssl_sendfile.grow

Error Message:
Test case body timed out

FAILED:  sys.kern.ssl_sendfile.truncate

Error Message:
Test case body timed out

FAILED:  lib.libexecinfo.sigtramp_test.test_backtrace_sigtramp

Error Message:
/usr/src/lib/libexecinfo/tests/sigtramp_test.c:30: n > 1 not met

FAILED:  sys.net.if_lagg_test.witness

Error Message:
Lock-order reversals involving if_lagg.c detected

FAILED:  sys.netinet.udp_bindings.connect_bound_socket_from_2address_jail

Error Message:
/usr/src/tests/sys/netinet/udp_bindings.c:244: connect(s, (struct sockaddr *)&sin, sizeof(sin)) == 0 not met

FAILED:  sys.netlink.netlink_socket.overflow

Error Message:
/usr/src/tests/sys/netlink/netlink_socket.c:146: send(fd, &hdr, sizeof(hdr), 0) == sizeof(hdr) not met