FreeBSD-main-amd64-test - Build #29580 - Still Unstable
Date: Mon, 28 Sep 2026 23:35:08 UTC
FreeBSD-main-amd64-test - Build #29580 (2f49e40a684a4bffd8e368a6878384ec4f735ea8) - Still Unstable
Build information: https://ci.FreeBSD.org/job/FreeBSD-main-amd64-test/29580/
Full change log: https://ci.FreeBSD.org/job/FreeBSD-main-amd64-test/29580/changes
Full build log: https://ci.FreeBSD.org/job/FreeBSD-main-amd64-test/29580/console
Status explanation:
"Unstable" - some tests are suspected being broken by the following changes
"Still Unstable" - the failing test cases have not been fixed by these
following changes and this is a notification to note that
these changes have not been fully tested by the CI system
Change summaries:
(Those commits are likely but not certainly responsible)
7b8f3db50cc992a3676e7e5ac207024e073884d4 by mchoo:
libkvm: support little-endian powerpc64 minidumps
51b1272fca667ad4c57d94ca24600bf68f29ebd2 by mchoo:
libkvm: route powerpc64 minidumps to minidump backend
8970a9f2ef781ab4f7d3fa446f7c6ac5eda26cc0 by mchoo:
powerpc/radix: synchronize temporary kernel mappings
8d31b7856f774554ffd5bb382bd2b3f6534817a0 by mchoo:
ci: Remove Cirrus CI files
61f98a98250da7bd2c80c6d93d0032961d7f2fad by pouria:
nd6: Fix regeneration of temp addresses in detached state
4cb357c61c004f4cf27ca12e702b44a81f2752ab by mchoo:
arm: pad minidump page table
a38a698704b0289db3260617116a455fecdd54f6 by mchoo:
powerpc/radix: include page tables in minidumps
592ede65bd48f16e5c46a016e92b732ed90094d2 by mchoo:
libkvm: support powerpc64 radix minidumps
2f49e40a684a4bffd8e368a6878384ec4f735ea8 by dim:
llvm: add LoongArch target support, not enabled by default
The failed test cases:
8 tests failed.
FAILED: sys.netlink.test_rtnl_route.rtnl_nhgrp_expire
Error Message:
1 checks failed; see output for more details
FAILED: sys.kern.ssl_sendfile.eagain_vs_eof
Error Message:
/usr/src/tests/sys/kern/ssl_sendfile.c:485: c.sbytes == -1 not met
FAILED: lib.libexecinfo.sigtramp_test.test_backtrace_sigtramp
Error Message:
/usr/src/lib/libexecinfo/tests/sigtramp_test.c:30: n > 1 not met
FAILED: sys.kern.ssl_sendfile.truncate
Error Message:
Test case body timed out
FAILED: sys.kern.ssl_sendfile.grow
Error Message:
Test case body timed out
FAILED: sys.net.if_lagg_test.witness
Error Message:
Lock-order reversals involving if_lagg.c detected
FAILED: sys.netinet.udp_bindings.connect_bound_socket_from_2address_jail
Error Message:
/usr/src/tests/sys/netinet/udp_bindings.c:244: connect(s, (struct sockaddr *)&sin, sizeof(sin)) == 0 not met
FAILED: sys.netlink.netlink_socket.overflow
Error Message:
/usr/src/tests/sys/netlink/netlink_socket.c:146: send(fd, &hdr, sizeof(hdr), 0) == sizeof(hdr) not met