FreeBSD-main-amd64-test - Build #29577 - Still Unstable
Date: Mon, 28 Sep 2026 15:34:20 UTC
FreeBSD-main-amd64-test - Build #29577 (dcb84ddcfe89d358a66cffb45196e6b45b45502c) - Still Unstable
Build information: https://ci.FreeBSD.org/job/FreeBSD-main-amd64-test/29577/
Full change log: https://ci.FreeBSD.org/job/FreeBSD-main-amd64-test/29577/changes
Full build log: https://ci.FreeBSD.org/job/FreeBSD-main-amd64-test/29577/console
Status explanation:
"Unstable" - some tests are suspected being broken by the following changes
"Still Unstable" - the failing test cases have not been fixed by these
following changes and this is a notification to note that
these changes have not been fully tested by the CI system
Change summaries:
(Those commits are likely but not certainly responsible)
dcb84ddcfe89d358a66cffb45196e6b45b45502c by kgalazka:
ice(4): Fix link bringup on driver load
The failed test cases:
7 tests failed.
FAILED: sys.netpfil.pf.pfsync.bulk
Error Message:
state not found on synced host
FAILED: lib.libexecinfo.sigtramp_test.test_backtrace_sigtramp
Error Message:
/usr/src/lib/libexecinfo/tests/sigtramp_test.c:30: n > 1 not met
FAILED: sys.kern.ssl_sendfile.truncate
Error Message:
Test case body timed out
FAILED: sys.kern.ssl_sendfile.grow
Error Message:
Test case body timed out
FAILED: sys.net.if_lagg_test.witness
Error Message:
Lock-order reversals involving if_lagg.c detected
FAILED: sys.netinet.udp_bindings.connect_bound_socket_from_2address_jail
Error Message:
/usr/src/tests/sys/netinet/udp_bindings.c:244: connect(s, (struct sockaddr *)&sin, sizeof(sin)) == 0 not met
FAILED: sys.netlink.netlink_socket.overflow
Error Message:
/usr/src/tests/sys/netlink/netlink_socket.c:146: send(fd, &hdr, sizeof(hdr), 0) == sizeof(hdr) not met