FreeBSD-main-amd64-test - Build #29569 - Still Unstable
Date: Sun, 27 Sep 2026 07:32:44 UTC
FreeBSD-main-amd64-test - Build #29569 (ce0268cc1ef4b93cdc142b3711d6400f5de4cdc2) - Still Unstable
Build information: https://ci.FreeBSD.org/job/FreeBSD-main-amd64-test/29569/
Full change log: https://ci.FreeBSD.org/job/FreeBSD-main-amd64-test/29569/changes
Full build log: https://ci.FreeBSD.org/job/FreeBSD-main-amd64-test/29569/console
Status explanation:
"Unstable" - some tests are suspected being broken by the following changes
"Still Unstable" - the failing test cases have not been fixed by these
following changes and this is a notification to note that
these changes have not been fully tested by the CI system
Change summaries:
(Those commits are likely but not certainly responsible)
f29a09d977378fc8504bf284849fc0438ce29153 by alc:
vm_page: Replace PGA_EXECUTABLE with PGA_PMAP_PRIV1
ce0268cc1ef4b93cdc142b3711d6400f5de4cdc2 by alc:
arm64 pmap: Eliminate redundant icache synchronization
The failed test cases:
9 tests failed.
FAILED: sys.net.if_geneve.ether_ipv6_blind_options
Error Message:
atf-check failed; see the output of the test for details
FAILED: sys.netpfil.pf.syncookie.basic_v6
Error Message:
Failed to connect to syncookie protected echo daemon
FAILED: sys.kern.ssl_sendfile.eagain_vs_eof
Error Message:
/usr/src/tests/sys/kern/ssl_sendfile.c:485: c.sbytes == -1 not met
FAILED: lib.libexecinfo.sigtramp_test.test_backtrace_sigtramp
Error Message:
/usr/src/lib/libexecinfo/tests/sigtramp_test.c:30: n > 1 not met
FAILED: sys.kern.ssl_sendfile.truncate
Error Message:
Test case body timed out
FAILED: sys.kern.ssl_sendfile.grow
Error Message:
Test case body timed out
FAILED: sys.net.if_lagg_test.witness
Error Message:
Lock-order reversals involving if_lagg.c detected
FAILED: sys.netinet.udp_bindings.connect_bound_socket_from_2address_jail
Error Message:
/usr/src/tests/sys/netinet/udp_bindings.c:244: connect(s, (struct sockaddr *)&sin, sizeof(sin)) == 0 not met
FAILED: sys.netlink.netlink_socket.overflow
Error Message:
/usr/src/tests/sys/netlink/netlink_socket.c:146: send(fd, &hdr, sizeof(hdr), 0) == sizeof(hdr) not met