FreeBSD-main-amd64-test - Build #29561 - Still Unstable

From: <jenkins-admin_at_FreeBSD.org>
Date: Sat, 26 Sep 2026 10:17:05 UTC
FreeBSD-main-amd64-test - Build #29561 (4bfe52650c140694505dd136f24bb3649153124a) - Still Unstable

Build information: https://ci.FreeBSD.org/job/FreeBSD-main-amd64-test/29561/
Full change log: https://ci.FreeBSD.org/job/FreeBSD-main-amd64-test/29561/changes
Full build log: https://ci.FreeBSD.org/job/FreeBSD-main-amd64-test/29561/console

Status explanation:
"Unstable" - some tests are suspected being broken by the following changes
"Still Unstable" - the failing test cases have not been fixed by these
                   following changes and this is a notification to note that
                   these changes have not been fully tested by the CI system

Change summaries:
(Those commits are likely but not certainly responsible)

92dec9201bf9759fc760da49a175fc99f3277c6c by seuros:
nvme: share one handler between the interrupt coalescing sysctls

130739e33acc1b55f6da297fdebb693d9d8feea8 by seuros:
nvmf: factor out the pending request abort loop

8a860e8286f2e2f20e6eb5b63d9ee1f0a62e0371 by seuros:
nvme: collapse the per-counter qpair statistic sysctl handlers

4bfe52650c140694505dd136f24bb3649153124a by seuros:
nvme: share one routine between Delete I/O CQ and Delete I/O SQ



The failed test cases:

7 tests failed.
FAILED:  sys.kern.ssl_sendfile.eagain_vs_eof

Error Message:
/usr/src/tests/sys/kern/ssl_sendfile.c:485: c.sbytes == -1 not met

FAILED:  lib.libexecinfo.sigtramp_test.test_backtrace_sigtramp

Error Message:
/usr/src/lib/libexecinfo/tests/sigtramp_test.c:30: n > 1 not met

FAILED:  sys.kern.ssl_sendfile.truncate

Error Message:
Test case body timed out

FAILED:  sys.kern.ssl_sendfile.grow

Error Message:
Test case body timed out

FAILED:  sys.net.if_lagg_test.witness

Error Message:
Lock-order reversals involving if_lagg.c detected

FAILED:  sys.netinet.udp_bindings.connect_bound_socket_from_2address_jail

Error Message:
/usr/src/tests/sys/netinet/udp_bindings.c:244: connect(s, (struct sockaddr *)&sin, sizeof(sin)) == 0 not met

FAILED:  sys.netlink.netlink_socket.overflow

Error Message:
/usr/src/tests/sys/netlink/netlink_socket.c:146: send(fd, &hdr, sizeof(hdr), 0) == sizeof(hdr) not met