FreeBSD-main-amd64-test - Build #29558 - Still unstable
Date: Sat, 26 Sep 2026 02:04:30 UTC
FreeBSD-main-amd64-test - Build #29558 (cb035c19c3e76d547eb7d4bca1f1106b117c27a0) - Still unstable
Build information: https://ci.FreeBSD.org/job/FreeBSD-main-amd64-test/29558/
Full change log: https://ci.FreeBSD.org/job/FreeBSD-main-amd64-test/29558/changes
Full build log: https://ci.FreeBSD.org/job/FreeBSD-main-amd64-test/29558/console
Status explanation:
"Unstable" - some tests are suspected being broken by the following changes
"Still Unstable" - the failing test cases have not been fixed by these
following changes and this is a notification to note that
these changes have not been fully tested by the CI system
Change summaries:
(Those commits are likely but not certainly responsible)
219ce30638405481cf56ebc6921ac891ce9f9909 by kp:
pf: convert DIOCRINADEFINE to netlink
3c0846bd9c3dfbe82377f90ef8ef1ef26e746fb9 by kp:
pf tests: basic osfp test
75c0a83762047c6c95c4bdd6b07bad005dc1d99e by kp:
pf: convert DIOCOSFPFLUSH DIOCOSFPGET DIOCOSFPADD to netlink
5aac18d0faec96c768baf1a9de63a50de3796023 by fernape:
virtual_oss(8): Fix cuse.ko check
d80c01bfb26612bf036b8ed7f7bfd5cc04d949f3 by markj:
geom: Remove unused fields from struct bio
de6ee1fde8bbcc3dde643ae9f2122c8e2499fe29 by markj:
jail: Simplify refcount manipulation routines
79af745f4c29ab3df037fcf0a4b4fb1ea393825f by markj:
jail: Fix a race in prison_deref()
0aa055edc17267c6e971d29cabeffed0b1c59c32 by markj:
kasan: Fix the annotation for shadow map checks in atomic_load_*
4523cbbfef79eb63e287d9ebd88d9f3ebd885ba1 by markj:
imgact_aout: Remove a prototype for a non-existent function
cb035c19c3e76d547eb7d4bca1f1106b117c27a0 by markj:
ipfilter: fix inverted range check on the lookup iterator unit
The failed test cases:
9 tests failed.
FAILED: sys.netpfil.pf.syncookie.basic_v6
Error Message:
Failed to connect to syncookie protected echo daemon
FAILED: sys.netpfil.pf.pfsync.bulk
Error Message:
state not found on synced host
FAILED: sys.kern.ssl_sendfile.eagain_vs_eof
Error Message:
/usr/src/tests/sys/kern/ssl_sendfile.c:485: c.sbytes == -1 not met
FAILED: lib.libexecinfo.sigtramp_test.test_backtrace_sigtramp
Error Message:
/usr/src/lib/libexecinfo/tests/sigtramp_test.c:30: n > 1 not met
FAILED: sys.kern.ssl_sendfile.truncate
Error Message:
Test case body timed out
FAILED: sys.kern.ssl_sendfile.grow
Error Message:
Test case body timed out
FAILED: sys.net.if_lagg_test.witness
Error Message:
Lock-order reversals involving if_lagg.c detected
FAILED: sys.netinet.udp_bindings.connect_bound_socket_from_2address_jail
Error Message:
/usr/src/tests/sys/netinet/udp_bindings.c:244: connect(s, (struct sockaddr *)&sin, sizeof(sin)) == 0 not met
FAILED: sys.netlink.netlink_socket.overflow
Error Message:
/usr/src/tests/sys/netlink/netlink_socket.c:146: send(fd, &hdr, sizeof(hdr), 0) == sizeof(hdr) not met