FreeBSD-main-amd64-test - Build #29555 - Still Unstable

From: <jenkins-admin_at_FreeBSD.org>
Date: Fri, 25 Sep 2026 08:40:45 UTC
FreeBSD-main-amd64-test - Build #29555 (4993c1052f899b9a971815df5661ca241641ad8e) - Still Unstable

Build information: https://ci.FreeBSD.org/job/FreeBSD-main-amd64-test/29555/
Full change log: https://ci.FreeBSD.org/job/FreeBSD-main-amd64-test/29555/changes
Full build log: https://ci.FreeBSD.org/job/FreeBSD-main-amd64-test/29555/console

Status explanation:
"Unstable" - some tests are suspected being broken by the following changes
"Still Unstable" - the failing test cases have not been fixed by these
                   following changes and this is a notification to note that
                   these changes have not been fully tested by the CI system

Change summaries:
(Those commits are likely but not certainly responsible)

2c41f7d8a034ee64a0aaa69a1aa5cb07748a1a32 by seuros:
nvme: honor FLBAS Format Index Upper when selecting the LBA format

b99595c9c7f8b3cee9973ed0dd9c1599a575c5f9 by seuros:
nvme: derive CC.CSS from CAP.CSS instead of hardcoding the NVM set

d2cce990699909044645fa290517016aa2f58af7 by imp:
build/options: Remove old, obolsete GCC options

b9811d13572b93adff2da16508eef18872b24c85 by emaste:
cd9660: merge level 1 and 2 filename conversion

742e58ddc989563f90a1d636cb29793641784ca1 by markj:
vm_page: Fix the error path in vm_page_alloc_contig_domain()

884b961c74bdadb7d8c97a7763e3110e803c69be by emaste:
makefs: Make target filesystem inodes 64 bits

c14281f6bb462ca03383d92a0d88228e9426268e by olivier:
tests/sys/kern: skip unix_connectat fdescfs cases when fdescfs is

dd16a5f53b0b2e967d20d2900f18fc320997679b by markj:
lockf: Do not block in vfs_busy()

fc544d3b57f27f1422969fca0002cb2bff30ab17 by emaste:
makefs: Remove unused "mac68k" support

87962e08fa18797103c96c17fd8c88ada056e0c0 by kib:
g_vfs_close_unlocked(9): wrapper around g_vfs_close(9)

53edaad235c86e4426e97d63be48f0160bcc5267 by kib:
filesystems: use g_vfs_close_unlocked(9)

30ad8440b46838b050360ed87e6165a067f1cf8a by kib:
VFS: require locked vnode for fsync()

e40c72c823c6502906d4024933f0c119b5ca17cf by kib:
VFS: style

6429199a21136cad3c82b43618a6ca2958b90bbf by pkubaj:
llan: byte swap the receive queue entries

4993c1052f899b9a971815df5661ca241641ad8e by kbowling:
aq: Invalidate the descriptor cache after stopping all rings



The failed test cases:

8 tests failed.
FAILED:  sys.netpfil.pf.pfsync.bulk

Error Message:
state not found on synced host

FAILED:  sys.kern.ssl_sendfile.eagain_vs_eof

Error Message:
/usr/src/tests/sys/kern/ssl_sendfile.c:485: c.sbytes == -1 not met

FAILED:  lib.libexecinfo.sigtramp_test.test_backtrace_sigtramp

Error Message:
/usr/src/lib/libexecinfo/tests/sigtramp_test.c:30: n > 1 not met

FAILED:  sys.kern.ssl_sendfile.truncate

Error Message:
Test case body timed out

FAILED:  sys.kern.ssl_sendfile.grow

Error Message:
Test case body timed out

FAILED:  sys.net.if_lagg_test.witness

Error Message:
Lock-order reversals involving if_lagg.c detected

FAILED:  sys.netinet.udp_bindings.connect_bound_socket_from_2address_jail

Error Message:
/usr/src/tests/sys/netinet/udp_bindings.c:244: connect(s, (struct sockaddr *)&sin, sizeof(sin)) == 0 not met

FAILED:  sys.netlink.netlink_socket.overflow

Error Message:
/usr/src/tests/sys/netlink/netlink_socket.c:146: send(fd, &hdr, sizeof(hdr), 0) == sizeof(hdr) not met