FreeBSD-main-amd64-test - Build #29546 - Still Unstable
Date: Wed, 23 Sep 2026 21:03:14 UTC
FreeBSD-main-amd64-test - Build #29546 (044cae0404883d12f62f00d80896c6f81fb4c5ea) - Still Unstable
Build information: https://ci.FreeBSD.org/job/FreeBSD-main-amd64-test/29546/
Full change log: https://ci.FreeBSD.org/job/FreeBSD-main-amd64-test/29546/changes
Full build log: https://ci.FreeBSD.org/job/FreeBSD-main-amd64-test/29546/console
Status explanation:
"Unstable" - some tests are suspected being broken by the following changes
"Still Unstable" - the failing test cases have not been fixed by these
following changes and this is a notification to note that
these changes have not been fully tested by the CI system
Change summaries:
(Those commits are likely but not certainly responsible)
7399be2030f5e8619bf8d7b379d0b42d21ca8052 by des:
misc: Avoid use of Unicode closing single quote
3897678132e71df70dbb18bf8e2f19124beee5d7 by netchild:
vfs_register: prevent kernel crash
044cae0404883d12f62f00d80896c6f81fb4c5ea by netchild:
ipfw tests: cover layer-2 filtering of unmapped mbufs
The failed test cases:
9 tests failed.
FAILED: sys.kern.ssl_sendfile.eagain_vs_eof
Error Message:
/usr/src/tests/sys/kern/ssl_sendfile.c:485: c.sbytes == -1 not met
FAILED: sys.netpfil.pf.syncookie.basic_v6
Error Message:
Failed to connect to syncookie protected echo daemon
FAILED: libexec.atf.atf-sh.integration_test.require_progs
Error Message:
Test case body timed out
FAILED: lib.libexecinfo.sigtramp_test.test_backtrace_sigtramp
Error Message:
/usr/src/lib/libexecinfo/tests/sigtramp_test.c:30: n > 1 not met
FAILED: sys.kern.ssl_sendfile.truncate
Error Message:
Test case body timed out
FAILED: sys.kern.ssl_sendfile.grow
Error Message:
Test case body timed out
FAILED: sys.net.if_lagg_test.witness
Error Message:
Lock-order reversals involving if_lagg.c detected
FAILED: sys.netinet.udp_bindings.connect_bound_socket_from_2address_jail
Error Message:
/usr/src/tests/sys/netinet/udp_bindings.c:244: connect(s, (struct sockaddr *)&sin, sizeof(sin)) == 0 not met
FAILED: sys.netlink.netlink_socket.overflow
Error Message:
/usr/src/tests/sys/netlink/netlink_socket.c:146: send(fd, &hdr, sizeof(hdr), 0) == sizeof(hdr) not met