FreeBSD-main-amd64-gcc14_build - Build #4745 - Failure
- Go to: [ bottom of page ] [ top of archives ] [ this month ]
Date: Tue, 22 Sep 2026 07:23:21 UTC
FreeBSD-main-amd64-gcc14_build - Build #4745 (d90a75af95107782d18771c91b0bc8c74e6cc4f3) - Failure
Build information: https://ci.FreeBSD.org/job/FreeBSD-main-amd64-gcc14_build/4745/
Full change log: https://ci.FreeBSD.org/job/FreeBSD-main-amd64-gcc14_build/4745/changes
Full build log: https://ci.FreeBSD.org/job/FreeBSD-main-amd64-gcc14_build/4745/console
Status explanation:
"Failure" - the build is suspected being broken by the following changes
"Still Failing" - the build has not been fixed by the following changes and
this is a notification to note that these changes have
not been fully tested by the CI system
Change summaries:
(Those commits are likely but not certainly responsible)
No changes
The end of the build log:
[...truncated 92.00 MiB...]
--- .depend.h_protoent ---
--- all_subdir_tests ---
--- mini-me.o ---
--- all_subdir_lib ---
echo h_protoent.full: /tmp/obj/workspace/src/amd64.amd64/tmp/usr/lib/libc.a >> .depend.h_protoent
--- all_subdir_tests ---
/usr/local/bin/x86_64-unknown-freebsd15.0-gcc14 --sysroot=/tmp/obj/workspace/src/amd64.amd64/tmp -B/usr/local/x86_64-unknown-freebsd15.0/bin/ -O2 -pipe -fno-common -I/workspace/src/tests -g -MD -MF.depend.mini-me.mini-me.o -MTmini-me.o -std=gnu17 -Wno-format-zero-length -fstack-protector-strong -Wsystem-headers -Werror -Wall -Wno-format-y2k -W -Wno-unused-parameter -Wmissing-prototypes -Wpointer-arith -Wreturn-type -Wcast-qual -Wwrite-strings -Wswitch -Wshadow -Wunused-parameter -Wcast-align -Wchar-subscripts -Wnested-externs -Wold-style-definition -Wno-pointer-sign -Wdate-time -Wno-error=address -Wno-error=array-bounds -Wno-error=attributes -Wno-error=bool-compare -Wno-error=cast-align -Wno-error=clobbered -Wno-error=deprecated-declarations -Wno-error=enum-compare -Wno-error=extra -Wno-error=logical-not-parentheses -Wno-error=strict-aliasing -Wno-error=uninitialized -Wno-error=unused-function -Wno-error=unused-value -Wno-error=empty-body -Wno-error=maybe-uninitialized -Wno-error=nonnull-compare -Wno-error=shift-negative-value -Wno-error=tautological-compare -Wno-error=unused-const-variable -Wno-error=bool-operation -Wno-error=deprecated -Wno-error=expansion-to-defined -Wno-error=format-overflow -Wno-error=format-truncation -Wno-error=implicit-fallthrough -Wno-error=int-in-bool-context -Wno-error=memset-elt-size -Wno-error=noexcept-type -Wno-error=nonnull -Wno-error=pointer-compare -Wno-error=stringop-overflow -Wno-error=aggressive-loop-optimizations -Wno-error=cast-function-type -Wno-error=catch-value -Wno-error=multistatement-macros -Wno-error=restrict -Wno-error=sizeof-pointer-memaccess -Wno-error=stringop-truncation -Wno-return-type -c /workspace/src/tests/sys/capsicum/mini-me.c -o mini-me.o
--- all_subdir_lib ---
--- h_protoent.pieo ---
/usr/local/bin/x86_64-unknown-freebsd15.0-gcc14 --sysroot=/tmp/obj/workspace/src/amd64.amd64/tmp -B/usr/local/x86_64-unknown-freebsd15.0/bin/ -fpie -DPIC -O2 -pipe -fno-common -I/workspace/src/lib/libc/tests/net -fPIE -g -MD -MF.depend.h_protoent.h_protoent.pieo -MTh_protoent.pieo -std=gnu17 -Wno-format-zero-length -fstack-protector-strong -Wsystem-headers -Werror -Wall -Wno-format-y2k -Wno-uninitialized -Wno-pointer-sign -Wdate-time -Wno-error=address -Wno-error=array-bounds -Wno-error=attributes -Wno-error=bool-compare -Wno-error=cast-align -Wno-error=clobbered -Wno-error=deprecated-declarations -Wno-error=enum-compare -Wno-error=extra -Wno-error=logical-not-parentheses -Wno-error=strict-aliasing -Wno-error=uninitialized -Wno-error=unused-function -Wno-error=unused-value -Wno-error=empty-body -Wno-error=maybe-uninitialized -Wno-error=nonnull-compare -Wno-error=shift-negative-value -Wno-error=tautological-compare -Wno-error=unused-const-variable -Wno-error=bool-operation -Wno-error=deprecated -Wno-error=expansion-to-defined -Wno-error=format-overflow -Wno-error=format-truncation -Wno-error=implicit-fallthrough -Wno-error=int-in-bool-context -Wno-error=memset-elt-size -Wno-error=noexcept-type -Wno-error=nonnull -Wno-error=pointer-compare -Wno-error=stringop-overflow -Wno-error=aggressive-loop-optimizations -Wno-error=cast-function-type -Wno-error=catch-value -Wno-error=multistatement-macros -Wno-error=restrict -Wno-error=sizeof-pointer-memaccess -Wno-error=stringop-truncation -Wno-return-type -Wno-address-of-packed-member -c /workspace/src/contrib/netbsd-tests/lib/libc/net/h_protoent.c -o h_protoent.pieo
--- all_subdir_tests ---
--- mini-me.noexec ---
(cd /workspace/src/tests/sys/capsicum && DEPENDFILE=.depend.mini-me.noexec NO_SUBDIR=1 make -f /workspace/src/tests/sys/capsicum/Makefile _RECURSING_PROGS=t PROG=mini-me.noexec )
--- all_subdir_usr.bin ---
--- id.full ---
--- all_subdir_tests ---
--- .depend.mini-me.noexec ---
--- all_subdir_usr.bin ---
/usr/local/bin/x86_64-unknown-freebsd15.0-gcc14 --sysroot=/tmp/obj/workspace/src/amd64.amd64/tmp -B/usr/local/x86_64-unknown-freebsd15.0/bin/ -O2 -pipe -fno-common -DUSE_BSM_AUDIT -fPIE -g -std=gnu17 -Wno-format-zero-length -fstack-protector-strong -Wsystem-headers -Werror -Wall -Wno-format-y2k -W -Wno-unused-parameter -Wmissing-prototypes -Wpointer-arith -Wreturn-type -Wcast-qual -Wwrite-strings -Wswitch -Wshadow -Wunused-parameter -Wcast-align -Wchar-subscripts -Wnested-externs -Wold-style-definition -Wno-pointer-sign -Wdate-time -Wno-error=address -Wno-error=array-bounds -Wno-error=attributes -Wno-error=bool-compare -Wno-error=cast-align -Wno-error=clobbered -Wno-error=deprecated-declarations -Wno-error=enum-compare -Wno-error=extra -Wno-error=logical-not-parentheses -Wno-error=strict-aliasing -Wno-error=uninitialized -Wno-error=unused-function -Wno-error=unused-value -Wno-error=empty-body -Wno-error=maybe-uninitialized -Wno-error=nonnull-compare -Wno-error=shift-negative-value -Wno-error=tautological-compare -Wno-error=unused-const-variable -Wno-error=bool-operation -Wno-error=deprecated -Wno-error=expansion-to-defined -Wno-error=format-overflow -Wno-error=format-truncation -Wno-error=implicit-fallthrough -Wno-error=int-in-bool-context -Wno-error=memset-elt-size -Wno-error=noexcept-type -Wno-error=nonnull -Wno-error=pointer-compare -Wno-error=stringop-overflow -Wno-error=aggressive-loop-optimizations -Wno-error=cast-function-type -Wno-error=catch-value -Wno-error=multistatement-macros -Wno-error=restrict -Wno-error=sizeof-pointer-memaccess -Wno-error=stringop-truncation -Wno-return-type -Wl,-zrelro -pie -Wl,-znoexecstack -o id.full id.pieo
--- all_subdir_tests ---
echo mini-me.noexec.full: /tmp/obj/workspace/src/amd64.amd64/tmp/usr/lib/libc.a >> .depend.mini-me.noexec
--- mini-me.noexec.full ---
/usr/local/bin/x86_64-unknown-freebsd15.0-gcc14 --sysroot=/tmp/obj/workspace/src/amd64.amd64/tmp -B/usr/local/x86_64-unknown-freebsd15.0/bin/ -O2 -pipe -fno-common -I/workspace/src/tests -g -std=gnu17 -Wno-format-zero-length -fstack-protector-strong -Wsystem-headers -Werror -Wall -Wno-format-y2k -W -Wno-unused-parameter -Wmissing-prototypes -Wpointer-arith -Wreturn-type -Wcast-qual -Wwrite-strings -Wswitch -Wshadow -Wunused-parameter -Wcast-align -Wchar-subscripts -Wnested-externs -Wold-style-definition -Wno-pointer-sign -Wdate-time -Wno-error=address -Wno-error=array-bounds -Wno-error=attributes -Wno-error=bool-compare -Wno-error=cast-align -Wno-error=clobbered -Wno-error=deprecated-declarations -Wno-error=enum-compare -Wno-error=extra -Wno-error=logical-not-parentheses -Wno-error=strict-aliasing -Wno-error=uninitialized -Wno-error=unused-function -Wno-error=unused-value -Wno-error=empty-body -Wno-error=maybe-uninitialized -Wno-error=nonnull-compare -Wno-error=shift-negative-value -Wno-error=tautological-compare -Wno-error=unused-const-variable -Wno-error=bool-operation -Wno-error=deprecated -Wno-error=expansion-to-defined -Wno-error=format-overflow -Wno-error=format-truncation -Wno-error=implicit-fallthrough -Wno-error=int-in-bool-context -Wno-error=memset-elt-size -Wno-error=noexcept-type -Wno-error=nonnull -Wno-error=pointer-compare -Wno-error=stringop-overflow -Wno-error=aggressive-loop-optimizations -Wno-error=cast-function-type -Wno-error=catch-value -Wno-error=multistatement-macros -Wno-error=restrict -Wno-error=sizeof-pointer-memaccess -Wno-error=stringop-truncation -Wno-return-type -Wl,-zrelro -static -Wl,-znoexecstack -o mini-me.noexec.full mini-me.o
--- all_subdir_tests/sys/audit ---
--- all_subdir_tests/sys/capsicum ---
--- mini-me ---
--- all_subdir_tests/sys/audit ---
--- file-close.full ---
--- all_subdir_tests/sys/capsicum ---
--- mini-me.full ---
/usr/local/bin/x86_64-unknown-freebsd15.0-gcc14 --sysroot=/tmp/obj/workspace/src/amd64.amd64/tmp -B/usr/local/x86_64-unknown-freebsd15.0/bin/ -O2 -pipe -fno-common -I/workspace/src/tests -g -std=gnu17 -Wno-format-zero-length -fstack-protector-strong -Wsystem-headers -Werror -Wall -Wno-format-y2k -W -Wno-unused-parameter -Wmissing-prototypes -Wpointer-arith -Wreturn-type -Wcast-qual -Wwrite-strings -Wswitch -Wshadow -Wunused-parameter -Wcast-align -Wchar-subscripts -Wnested-externs -Wold-style-definition -Wno-pointer-sign -Wdate-time -Wno-error=address -Wno-error=array-bounds -Wno-error=attributes -Wno-error=bool-compare -Wno-error=cast-align -Wno-error=clobbered -Wno-error=deprecated-declarations -Wno-error=enum-compare -Wno-error=extra -Wno-error=logical-not-parentheses -Wno-error=strict-aliasing -Wno-error=uninitialized -Wno-error=unused-function -Wno-error=unused-value -Wno-error=empty-body -Wno-error=maybe-uninitialized -Wno-error=nonnull-compare -Wno-error=shift-negative-value -Wno-error=tautological-compare -Wno-error=unused-const-variable -Wno-error=bool-operation -Wno-error=deprecated -Wno-error=expansion-to-defined -Wno-error=format-overflow -Wno-error=format-truncation -Wno-error=implicit-fallthrough -Wno-error=int-in-bool-context -Wno-error=memset-elt-size -Wno-error=noexcept-type -Wno-error=nonnull -Wno-error=pointer-compare -Wno-error=stringop-overflow -Wno-error=aggressive-loop-optimizations -Wno-error=cast-function-type -Wno-error=catch-value -Wno-error=multistatement-macros -Wno-error=restrict -Wno-error=sizeof-pointer-memaccess -Wno-error=stringop-truncation -Wno-return-type -Wl,-zrelro -static -Wl,-znoexecstack -o mini-me.full mini-me.o
--- all_subdir_tests/sys/audit ---
/usr/local/bin/x86_64-unknown-freebsd15.0-gcc14 --sysroot=/tmp/obj/workspace/src/amd64.amd64/tmp -B/usr/local/x86_64-unknown-freebsd15.0/bin/ -O2 -pipe -fno-common -I/workspace/src/contrib/openbsm -g -std=gnu17 -Wno-format-zero-length -fstack-protector-strong -Wsystem-headers -Werror -Wall -Wno-format-y2k -W -Wno-unused-parameter -Wmissing-prototypes -Wpointer-arith -Wreturn-type -Wcast-qual -Wwrite-strings -Wswitch -Wshadow -Wunused-parameter -Wcast-align -Wchar-subscripts -Wnested-externs -Wold-style-definition -Wno-pointer-sign -Wdate-time -Wno-error=address -Wno-error=array-bounds -Wno-error=attributes -Wno-error=bool-compare -Wno-error=cast-align -Wno-error=clobbered -Wno-error=deprecated-declarations -Wno-error=enum-compare -Wno-error=extra -Wno-error=logical-not-parentheses -Wno-error=strict-aliasing -Wno-error=uninitialized -Wno-error=unused-function -Wno-error=unused-value -Wno-error=empty-body -Wno-error=maybe-uninitialized -Wno-error=nonnull-compare -Wno-error=shift-negative-value -Wno-error=tautological-compare -Wno-error=unused-const-variable -Wno-error=bool-operation -Wno-error=deprecated -Wno-error=expansion-to-defined -Wno-error=format-overflow -Wno-error=format-truncation -Wno-error=implicit-fallthrough -Wno-error=int-in-bool-context -Wno-error=memset-elt-size -Wno-error=noexcept-type -Wno-error=nonnull -Wno-error=pointer-compare -Wno-error=stringop-overflow -Wno-error=aggressive-loop-optimizations -Wno-error=cast-function-type -Wno-error=catch-value -Wno-error=multistatement-macros -Wno-error=restrict -Wno-error=sizeof-pointer-memaccess -Wno-error=stringop-truncation -Wno-return-type -lbsm -lutil -Wl,-zrelro -Wl,-znoexecstack -o file-close.full file-close.o utils.o /tmp/obj/workspace/src/amd64.amd64/tmp/usr/lib/libprivateauditd.a -lprivateatf-c
--- all_subdir_usr.bin ---
--- id.1.gz ---
gzip -cn /workspace/src/usr.bin/id/id.1 > id.1.gz
--- groups.1.gz ---
gzip -cn /workspace/src/usr.bin/id/groups.1 > groups.1.gz
--- whoami.1.gz ---
gzip -cn /workspace/src/usr.bin/id/whoami.1 > whoami.1.gz
--- id.debug ---
/usr/local/x86_64-unknown-freebsd15.0/bin/objcopy --only-keep-debug id.full id.debug
--- id ---
/usr/local/x86_64-unknown-freebsd15.0/bin/objcopy --strip-debug --add-gnu-debuglink=id.debug id.full id
--- all_subdir_usr.bin/ident ---
===> usr.bin/ident (all)
--- all_subdir_tests ---
--- file-close.debug ---
/usr/local/x86_64-unknown-freebsd15.0/bin/objcopy --only-keep-debug file-close.full file-close.debug
--- all_subdir_lib ---
--- all_subdir_tests ---
--- file-close ---
--- all_subdir_lib ---
--- h_protoent.full ---
--- all_subdir_tests ---
/usr/local/x86_64-unknown-freebsd15.0/bin/objcopy --strip-debug --add-gnu-debuglink=file-close.debug file-close.full file-close
--- all_subdir_lib ---
/usr/local/bin/x86_64-unknown-freebsd15.0-gcc14 --sysroot=/tmp/obj/workspace/src/amd64.amd64/tmp -B/usr/local/x86_64-unknown-freebsd15.0/bin/ -O2 -pipe -fno-common -I/workspace/src/lib/libc/tests/net -fPIE -g -std=gnu17 -Wno-format-zero-length -fstack-protector-strong -Wsystem-headers -Werror -Wall -Wno-format-y2k -Wno-uninitialized -Wno-pointer-sign -Wdate-time -Wno-error=address -Wno-error=array-bounds -Wno-error=attributes -Wno-error=bool-compare -Wno-error=cast-align -Wno-error=clobbered -Wno-error=deprecated-declarations -Wno-error=enum-compare -Wno-error=extra -Wno-error=logical-not-parentheses -Wno-error=strict-aliasing -Wno-error=uninitialized -Wno-error=unused-function -Wno-error=unused-value -Wno-error=empty-body -Wno-error=maybe-uninitialized -Wno-error=nonnull-compare -Wno-error=shift-negative-value -Wno-error=tautological-compare -Wno-error=unused-const-variable -Wno-error=bool-operation -Wno-error=deprecated -Wno-error=expansion-to-defined -Wno-error=format-overflow -Wno-error=format-truncation -Wno-error=implicit-fallthrough -Wno-error=int-in-bool-context -Wno-error=memset-elt-size -Wno-error=noexcept-type -Wno-error=nonnull -Wno-error=pointer-compare -Wno-error=stringop-overflow -Wno-error=aggressive-loop-optimizations -Wno-error=cast-function-type -Wno-error=catch-value -Wno-error=multistatement-macros -Wno-error=restrict -Wno-error=sizeof-pointer-memaccess -Wno-error=stringop-truncation -Wno-return-type -Wno-address-of-packed-member -Wl,-zrelro -pie -Wl,-znoexecstack -o h_protoent.full h_protoent.pieo
--- all_subdir_tests ---
--- file-write ---
(cd /workspace/src/tests/sys/audit && DEPENDFILE=.depend.file-write NO_SUBDIR=1 make -f /workspace/src/tests/sys/audit/Makefile _RECURSING_PROGS=t PROG=file-write )
--- all_subdir_usr.bin ---
--- .depend ---
echo ident.full: /tmp/obj/workspace/src/amd64.amd64/tmp/usr/lib/libc.a >> .depend
--- ident.pieo ---
/usr/local/bin/x86_64-unknown-freebsd15.0-gcc14 --sysroot=/tmp/obj/workspace/src/amd64.amd64/tmp -B/usr/local/x86_64-unknown-freebsd15.0/bin/ -fpie -DPIC -O2 -pipe -fno-common -DWITH_CASPER -fPIE -g -MD -MF.depend.ident.pieo -MTident.pieo -std=gnu17 -Wno-format-zero-length -fstack-protector-strong -Wsystem-headers -Werror -Wall -Wno-format-y2k -W -Wno-unused-parameter -Wmissing-prototypes -Wpointer-arith -Wreturn-type -Wcast-qual -Wwrite-strings -Wswitch -Wshadow -Wunused-parameter -Wcast-align -Wchar-subscripts -Wnested-externs -Wold-style-definition -Wno-pointer-sign -Wdate-time -Wno-error=address -Wno-error=array-bounds -Wno-error=attributes -Wno-error=bool-compare -Wno-error=cast-align -Wno-error=clobbered -Wno-error=deprecated-declarations -Wno-error=enum-compare -Wno-error=extra -Wno-error=logical-not-parentheses -Wno-error=strict-aliasing -Wno-error=uninitialized -Wno-error=unused-function -Wno-error=unused-value -Wno-error=empty-body -Wno-error=maybe-uninitialized -Wno-error=nonnull-compare -Wno-error=shift-negative-value -Wno-error=tautological-compare -Wno-error=unused-const-variable -Wno-error=bool-operation -Wno-error=deprecated -Wno-error=expansion-to-defined -Wno-error=format-overflow -Wno-error=format-truncation -Wno-error=implicit-fallthrough -Wno-error=int-in-bool-context -Wno-error=memset-elt-size -Wno-error=noexcept-type -Wno-error=nonnull -Wno-error=pointer-compare -Wno-error=stringop-overflow -Wno-error=aggressive-loop-optimizations -Wno-error=cast-function-type -Wno-error=catch-value -Wno-error=multistatement-macros -Wno-error=restrict -Wno-error=sizeof-pointer-memaccess -Wno-error=stringop-truncation -Wno-return-type -c /workspace/src/usr.bin/ident/ident.c -o ident.pieo
--- all_subdir_tests ---
--- .depend.file-write ---
echo file-write.full: /tmp/obj/workspace/src/amd64.amd64/tmp/usr/lib/libc.a /tmp/obj/workspace/src/amd64.amd64/tmp/usr/lib/libprivateatf-c.a >> .depend.file-write
--- file-write.o ---
/usr/local/bin/x86_64-unknown-freebsd15.0-gcc14 --sysroot=/tmp/obj/workspace/src/amd64.amd64/tmp -B/usr/local/x86_64-unknown-freebsd15.0/bin/ -O2 -pipe -fno-common -I/workspace/src/contrib/openbsm -g -MD -MF.depend.file-write.file-write.o -MTfile-write.o -std=gnu17 -Wno-format-zero-length -fstack-protector-strong -Wsystem-headers -Werror -Wall -Wno-format-y2k -W -Wno-unused-parameter -Wmissing-prototypes -Wpointer-arith -Wreturn-type -Wcast-qual -Wwrite-strings -Wswitch -Wshadow -Wunused-parameter -Wcast-align -Wchar-subscripts -Wnested-externs -Wold-style-definition -Wno-pointer-sign -Wdate-time -Wno-error=address -Wno-error=array-bounds -Wno-error=attributes -Wno-error=bool-compare -Wno-error=cast-align -Wno-error=clobbered -Wno-error=deprecated-declarations -Wno-error=enum-compare -Wno-error=extra -Wno-error=logical-not-parentheses -Wno-error=strict-aliasing -Wno-error=uninitialized -Wno-error=unused-function -Wno-error=unused-value -Wno-error=empty-body -Wno-error=maybe-uninitialized -Wno-error=nonnull-compare -Wno-error=shift-negative-value -Wno-error=tautological-compare -Wno-error=unused-const-variable -Wno-error=bool-operation -Wno-error=deprecated -Wno-error=expansion-to-defined -Wno-error=format-overflow -Wno-error=format-truncation -Wno-error=implicit-fallthrough -Wno-error=int-in-bool-context -Wno-error=memset-elt-size -Wno-error=noexcept-type -Wno-error=nonnull -Wno-error=pointer-compare -Wno-error=stringop-overflow -Wno-error=aggressive-loop-optimizations -Wno-error=cast-function-type -Wno-error=catch-value -Wno-error=multistatement-macros -Wno-error=restrict -Wno-error=sizeof-pointer-memaccess -Wno-error=stringop-truncation -Wno-return-type -c /workspace/src/tests/sys/audit/file-write.c -o file-write.o
--- all_subdir_lib ---
--- h_protoent.debug ---
/usr/local/x86_64-unknown-freebsd15.0/bin/objcopy --only-keep-debug h_protoent.full h_protoent.debug
--- h_protoent ---
/usr/local/x86_64-unknown-freebsd15.0/bin/objcopy --strip-debug --add-gnu-debuglink=h_protoent.debug h_protoent.full h_protoent
--- h_servent ---
(cd /workspace/src/lib/libc/tests/net && DEPENDFILE=.depend.h_servent NO_SUBDIR=1 make -f /workspace/src/lib/libc/tests/net/Makefile _RECURSING_PROGS=t PROG=h_servent )
--- .depend.h_servent ---
echo h_servent.full: /tmp/obj/workspace/src/amd64.amd64/tmp/usr/lib/libc.a >> .depend.h_servent
--- h_servent.pieo ---
/usr/local/bin/x86_64-unknown-freebsd15.0-gcc14 --sysroot=/tmp/obj/workspace/src/amd64.amd64/tmp -B/usr/local/x86_64-unknown-freebsd15.0/bin/ -fpie -DPIC -O2 -pipe -fno-common -I/workspace/src/lib/libc/tests/net -fPIE -g -MD -MF.depend.h_servent.h_servent.pieo -MTh_servent.pieo -std=gnu17 -Wno-format-zero-length -fstack-protector-strong -Wsystem-headers -Werror -Wall -Wno-format-y2k -Wno-uninitialized -Wno-pointer-sign -Wdate-time -Wno-error=address -Wno-error=array-bounds -Wno-error=attributes -Wno-error=bool-compare -Wno-error=cast-align -Wno-error=clobbered -Wno-error=deprecated-declarations -Wno-error=enum-compare -Wno-error=extra -Wno-error=logical-not-parentheses -Wno-error=strict-aliasing -Wno-error=uninitialized -Wno-error=unused-function -Wno-error=unused-value -Wno-error=empty-body -Wno-error=maybe-uninitialized -Wno-error=nonnull-compare -Wno-error=shift-negative-value -Wno-error=tautological-compare -Wno-error=unused-const-variable -Wno-error=bool-operation -Wno-error=deprecated -Wno-error=expansion-to-defined -Wno-error=format-overflow -Wno-error=format-truncation -Wno-error=implicit-fallthrough -Wno-error=int-in-bool-context -Wno-error=memset-elt-size -Wno-error=noexcept-type -Wno-error=nonnull -Wno-error=pointer-compare -Wno-error=stringop-overflow -Wno-error=aggressive-loop-optimizations -Wno-error=cast-function-type -Wno-error=catch-value -Wno-error=multistatement-macros -Wno-error=restrict -Wno-error=sizeof-pointer-memaccess -Wno-error=stringop-truncation -Wno-return-type -Wno-address-of-packed-member -c /workspace/src/contrib/netbsd-tests/lib/libc/net/h_servent.c -o h_servent.pieo
--- all_subdir_tests ---
--- all_subdir_tests/sys/capsicum ---
--- mini-me.noexec ---
/usr/local/bin/x86_64-unknown-freebsd15.0-ld: /tmp/obj/workspace/src/amd64.amd64/tmp/usr/lib/crt1.o: in function `_start':
/workspace/src/lib/csu/amd64/crt1_s.S:66:(.text+0x17): undefined reference to `main'
--- all_subdir_lib ---
--- all_subdir_lib/libc/tests/gen ---
--- fnmatch_test.full ---
/usr/local/bin/x86_64-unknown-freebsd15.0-gcc14 --sysroot=/tmp/obj/workspace/src/amd64.amd64/tmp -B/usr/local/x86_64-unknown-freebsd15.0/bin/ -O2 -pipe -fno-common -DTEST_LONG_DOUBLE -D__HAVE_LONG_DOUBLE -I/workspace/src/lib/libc/tests/gen -I/workspace/src/lib/libnetbsd -I/workspace/src/contrib/netbsd-tests -fPIE -g -std=gnu17 -Wno-format-zero-length -fstack-protector-strong -Wsystem-headers -Werror -Wall -Wno-format-y2k -Wno-uninitialized -Wno-pointer-sign -Wdate-time -Wno-error=address -Wno-error=array-bounds -Wno-error=attributes -Wno-error=bool-compare -Wno-error=cast-align -Wno-error=clobbered -Wno-error=deprecated-declarations -Wno-error=enum-compare -Wno-error=extra -Wno-error=logical-not-parentheses -Wno-error=strict-aliasing -Wno-error=uninitialized -Wno-error=unused-function -Wno-error=unused-value -Wno-error=empty-body -Wno-error=maybe-uninitialized -Wno-error=nonnull-compare -Wno-error=shift-negative-value -Wno-error=tautological-compare -Wno-error=unused-const-variable -Wno-error=bool-operation -Wno-error=deprecated -Wno-error=expansion-to-defined -Wno-error=format-overflow -Wno-error=format-truncation -Wno-error=implicit-fallthrough -Wno-error=int-in-bool-context -Wno-error=memset-elt-size -Wno-error=noexcept-type -Wno-error=nonnull -Wno-error=pointer-compare -Wno-error=stringop-overflow -Wno-error=aggressive-loop-optimizations -Wno-error=cast-function-type -Wno-error=catch-value -Wno-error=multistatement-macros -Wno-error=restrict -Wno-error=sizeof-pointer-memaccess -Wno-error=stringop-truncation -Wno-return-type -Wno-address-of-packed-member -L/tmp/obj/workspace/src/amd64.amd64/lib/libnetbsd -Wl,-zrelro -pie -Wl,-znoexecstack -o fnmatch_test.full t_fnmatch.pieo -lprivateatf-c -L/tmp/obj/workspace/src/amd64.amd64/lib/libnetbsd -lnetbsd_pie
--- all_subdir_usr.sbin ---
--- verify.pieo ---
/usr/local/bin/x86_64-unknown-freebsd15.0-gcc14 --sysroot=/tmp/obj/workspace/src/amd64.amd64/tmp -B/usr/local/x86_64-unknown-freebsd15.0/bin/ -fpie -DPIC -O2 -pipe -fno-common -I/workspace/src/contrib/mknod -I/workspace/src/lib/libnetbsd -fPIE -g -MD -MF.depend.verify.pieo -MTverify.pieo -std=gnu17 -Wno-format-zero-length -fstack-protector-strong -Wsystem-headers -Werror -Wall -Wno-format-y2k -W -Wno-unused-parameter -Wmissing-prototypes -Wpointer-arith -Wreturn-type -Wcast-qual -Wwrite-strings -Wswitch -Wshadow -Wunused-parameter -Wcast-align -Wchar-subscripts -Wnested-externs -Wold-style-definition -Wno-pointer-sign -Wdate-time -Wno-error=address -Wno-error=array-bounds -Wno-error=attributes -Wno-error=bool-compare -Wno-error=cast-align -Wno-error=clobbered -Wno-error=deprecated-declarations -Wno-error=enum-compare -Wno-error=extra -Wno-error=logical-not-parentheses -Wno-error=strict-aliasing -Wno-error=uninitialized -Wno-error=unused-function -Wno-error=unused-value -Wno-error=empty-body -Wno-error=maybe-uninitialized -Wno-error=nonnull-compare -Wno-error=shift-negative-value -Wno-error=tautological-compare -Wno-error=unused-const-variable -Wno-error=bool-operation -Wno-error=deprecated -Wno-error=expansion-to-defined -Wno-error=format-overflow -Wno-error=format-truncation -Wno-error=implicit-fallthrough -Wno-error=int-in-bool-context -Wno-error=memset-elt-size -Wno-error=noexcept-type -Wno-error=nonnull -Wno-error=pointer-compare -Wno-error=stringop-overflow -Wno-error=aggressive-loop-optimizations -Wno-error=cast-function-type -Wno-error=catch-value -Wno-error=multistatement-macros -Wno-error=restrict -Wno-error=sizeof-pointer-memaccess -Wno-error=stringop-truncation -Wno-return-type -c /workspace/src/contrib/mtree/verify.c -o verify.pieo
--- all_subdir_lib ---
--- fnmatch_test.debug ---
/usr/local/x86_64-unknown-freebsd15.0/bin/objcopy --only-keep-debug fnmatch_test.full fnmatch_test.debug
--- fnmatch_test ---
--- all_subdir_tests ---
--- all_subdir_tests/sys/audit ---
--- file-write.full ---
--- all_subdir_lib ---
/usr/local/x86_64-unknown-freebsd15.0/bin/objcopy --strip-debug --add-gnu-debuglink=fnmatch_test.debug fnmatch_test.full fnmatch_test
--- all_subdir_tests ---
/usr/local/bin/x86_64-unknown-freebsd15.0-gcc14 --sysroot=/tmp/obj/workspace/src/amd64.amd64/tmp -B/usr/local/x86_64-unknown-freebsd15.0/bin/ -O2 -pipe -fno-common -I/workspace/src/contrib/openbsm -g -std=gnu17 -Wno-format-zero-length -fstack-protector-strong -Wsystem-headers -Werror -Wall -Wno-format-y2k -W -Wno-unused-parameter -Wmissing-prototypes -Wpointer-arith -Wreturn-type -Wcast-qual -Wwrite-strings -Wswitch -Wshadow -Wunused-parameter -Wcast-align -Wchar-subscripts -Wnested-externs -Wold-style-definition -Wno-pointer-sign -Wdate-time -Wno-error=address -Wno-error=array-bounds -Wno-error=attributes -Wno-error=bool-compare -Wno-error=cast-align -Wno-error=clobbered -Wno-error=deprecated-declarations -Wno-error=enum-compare -Wno-error=extra -Wno-error=logical-not-parentheses -Wno-error=strict-aliasing -Wno-error=uninitialized -Wno-error=unused-function -Wno-error=unused-value -Wno-error=empty-body -Wno-error=maybe-uninitialized -Wno-error=nonnull-compare -Wno-error=shift-negative-value -Wno-error=tautological-compare -Wno-error=unused-const-variable -Wno-error=bool-operation -Wno-error=deprecated -Wno-error=expansion-to-defined -Wno-error=format-overflow -Wno-error=format-truncation -Wno-error=implicit-fallthrough -Wno-error=int-in-bool-context -Wno-error=memset-elt-size -Wno-error=noexcept-type -Wno-error=nonnull -Wno-error=pointer-compare -Wno-error=stringop-overflow -Wno-error=aggressive-loop-optimizations -Wno-error=cast-function-type -Wno-error=catch-value -Wno-error=multistatement-macros -Wno-error=restrict -Wno-error=sizeof-pointer-memaccess -Wno-error=stringop-truncation -Wno-return-type -lbsm -lutil -Wl,-zrelro -Wl,-znoexecstack -o file-write.full file-write.o utils.o /tmp/obj/workspace/src/amd64.amd64/tmp/usr/lib/libprivateauditd.a -lprivateatf-c
--- all_subdir_lib ---
--- ftok_test ---
(cd /workspace/src/lib/libc/tests/gen && DEPENDFILE=.depend.ftok_test NO_SUBDIR=1 make -f /workspace/src/lib/libc/tests/gen/Makefile _RECURSING_PROGS=t PROG=ftok_test )
--- all_subdir_lib/libc/tests/net ---
--- h_servent.full ---
/usr/local/bin/x86_64-unknown-freebsd15.0-gcc14 --sysroot=/tmp/obj/workspace/src/amd64.amd64/tmp -B/usr/local/x86_64-unknown-freebsd15.0/bin/ -O2 -pipe -fno-common -I/workspace/src/lib/libc/tests/net -fPIE -g -std=gnu17 -Wno-format-zero-length -fstack-protector-strong -Wsystem-headers -Werror -Wall -Wno-format-y2k -Wno-uninitialized -Wno-pointer-sign -Wdate-time -Wno-error=address -Wno-error=array-bounds -Wno-error=attributes -Wno-error=bool-compare -Wno-error=cast-align -Wno-error=clobbered -Wno-error=deprecated-declarations -Wno-error=enum-compare -Wno-error=extra -Wno-error=logical-not-parentheses -Wno-error=strict-aliasing -Wno-error=uninitialized -Wno-error=unused-function -Wno-error=unused-value -Wno-error=empty-body -Wno-error=maybe-uninitialized -Wno-error=nonnull-compare -Wno-error=shift-negative-value -Wno-error=tautological-compare -Wno-error=unused-const-variable -Wno-error=bool-operation -Wno-error=deprecated -Wno-error=expansion-to-defined -Wno-error=format-overflow -Wno-error=format-truncation -Wno-error=implicit-fallthrough -Wno-error=int-in-bool-context -Wno-error=memset-elt-size -Wno-error=noexcept-type -Wno-error=nonnull -Wno-error=pointer-compare -Wno-error=stringop-overflow -Wno-error=aggressive-loop-optimizations -Wno-error=cast-function-type -Wno-error=catch-value -Wno-error=multistatement-macros -Wno-error=restrict -Wno-error=sizeof-pointer-memaccess -Wno-error=stringop-truncation -Wno-return-type -Wno-address-of-packed-member -Wl,-zrelro -pie -Wl,-znoexecstack -o h_servent.full h_servent.pieo
--- all_subdir_tests ---
--- all_subdir_tests/sys/capsicum ---
collect2: error: ld returned 1 exit status
*** [mini-me.noexec.full] Error code 1
make[6]: stopped making "all" in /workspace/src/tests/sys/capsicum
make[6]: 1 error
make[6]: stopped making "all" in /workspace/src/tests/sys/capsicum
make[5]: stopped making "all" in /workspace/src/tests/sys/capsicum
--- all_subdir_lib ---
--- all_subdir_lib/libc/tests/gen ---
make[6]: stopped making "all" in /workspace/src/lib/libc/tests/gen
make[5]: stopped making "all" in /workspace/src/lib/libc/tests
--- all_subdir_tests ---
--- all_subdir_tests/sys/audit ---
make[5]: stopped making "all" in /workspace/src/tests/sys/audit
make[4]: stopped making "all" in /workspace/src/tests/sys
--- all_subdir_tests/sys/capsicum ---
--- mini-me ---
make[5]: stopped making "all" in /workspace/src/tests/sys/capsicum
make[4]: stopped making "all" in /workspace/src/tests/sys
make[3]: stopped making "all" in /workspace/src/tests
make[2]: stopped making "all" in /workspace/src
--- all_subdir_lib ---
--- all_subdir_lib/libc/tests/net ---
make[6]: stopped making "all" in /workspace/src/lib/libc/tests/net
make[5]: stopped making "all" in /workspace/src/lib/libc/tests
make[4]: stopped making "all" in /workspace/src/lib/libc
make[3]: stopped making "all" in /workspace/src/lib
--- all_subdir_usr.bin ---
make[3]: stopped making "all" in /workspace/src/usr.bin
make[2]: stopped making "all" in /workspace/src
--- all_subdir_lib ---
--- all_subdir_lib/msun ---
make[5]: stopped making "all" in /workspace/src/lib/msun/tests
make[4]: stopped making "all" in /workspace/src/lib/msun
make[3]: stopped making "all" in /workspace/src/lib
make[2]: stopped making "all" in /workspace/src
--- all_subdir_usr.sbin ---
make[3]: stopped making "all" in /workspace/src/usr.sbin
make[2]: stopped making "all" in /workspace/src
--- all_subdir_sbin ---
make[3]: stopped making "all" in /workspace/src/sbin
make[2]: stopped making "all" in /workspace/src
--- all_subdir_rescue ---
--- ifconfig_make ---
/workspace/src/sbin/ifconfig/ifgeneve.c: In function 'geneve_status_nl':
/workspace/src/sbin/ifconfig/ifgeneve.c:366:17: warning: 'mc' may be used uninitialized [-Wmaybe-uninitialized]
366 | printf("\n\t\t%s: %s%s%s:%u", mc ? "group" : "remote", ipv6 ? "[" : "",
| ^~~~~~~~~~~~~~~~~~~~~~~~~~~~~~~~~~~~~~~~~~~~~~~~~~~~~~~~~~~~~~~~~~~~~~~
367 | dst, ipv6 ? "]" : "", geneve_data.ifla_local_port);
| ~~~~~~~~~~~~~~~~~~~~~~~~~~~~~~~~~~~~~~~~~~~~~~~~~~
/workspace/src/sbin/ifconfig/ifgeneve.c:292:13: note: 'mc' was declared here
292 | int mc;
| ^~
make[5]: stopped making "objs" in /tmp/obj/workspace/src/amd64.amd64/rescue/rescue
*** [objs] Error code 2
make[4]: stopped making "all" in /workspace/src/rescue/rescue
make[4]: 1 error
make[4]: stopped making "all" in /workspace/src/rescue/rescue
make[3]: stopped making "all" in /workspace/src/rescue
make[2]: stopped making "all" in /workspace/src
--- all_subdir_stand ---
--- lvm.o ---
make[3]: stopped making "all" in /workspace/src/stand
make[2]: stopped making "all" in /workspace/src
--- all_subdir_cddl ---
make[6]: stopped making "all" in /workspace/src/cddl/usr.sbin/zfsd/tests
make[5]: stopped making "all" in /workspace/src/cddl/usr.sbin/zfsd
make[4]: stopped making "all" in /workspace/src/cddl/usr.sbin
make[3]: stopped making "all" in /workspace/src/cddl
make[2]: stopped making "all" in /workspace/src
144.30 real 1178.69 user 113.21 sys
make[1]: stopped making "buildworld" in /workspace/src
make: stopped making "buildworld" in /workspace/src
Build step 'Execute shell' marked build as failure
[PostBuildScript] - [INFO] Executing post build scripts.
[FreeBSD-main-amd64-gcc14_build] $ /bin/sh -xe /tmp/jenkins14820028010072860451.sh
+ sh freebsd-ci/scripts/jail/clean.sh
clean jail FreeBSD-main-amd64-gcc14_build
Checking for post-build
Performing post-build step
Checking if email needs to be generated
Email was triggered for: Failure - Any
Sending email for trigger: Failure - Any
Sending mail from default account using System Admin e-mail address