FreeBSD-stable-15-amd64-test - Build #1113 - Still Unstable

From: <jenkins-admin_at_FreeBSD.org>
Date: Mon, 21 Sep 2026 16:53:03 UTC
FreeBSD-stable-15-amd64-test - Build #1113 (a43fff2a01316fe77a8abac2b2b034e4b2deccd0) - Still Unstable

Build information: https://ci.FreeBSD.org/job/FreeBSD-stable-15-amd64-test/1113/
Full change log: https://ci.FreeBSD.org/job/FreeBSD-stable-15-amd64-test/1113/changes
Full build log: https://ci.FreeBSD.org/job/FreeBSD-stable-15-amd64-test/1113/console

Status explanation:
"Unstable" - some tests are suspected being broken by the following changes
"Still Unstable" - the failing test cases have not been fixed by these
                   following changes and this is a notification to note that
                   these changes have not been fully tested by the CI system

Change summaries:
(Those commits are likely but not certainly responsible)

a43fff2a01316fe77a8abac2b2b034e4b2deccd0 by kevans:
stand: remove unused variables



The failed test cases:

3 tests failed.
FAILED:  sys.kern.timerfd.timerfd__periodic_timer_performance

Error Message:
Test case body timed out

FAILED:  sys.netpfil.pf.return.py.TestReturn::test_udp

Error Message:
/usr/tests/sys/netpfil/pf/return.py:38: Exception

FAILED:  sys.netpfil.pf.pfsync.bulk

Error Message:
state not found on synced host