FreeBSD-main-amd64-test - Build #29535 - Still Unstable

From: <jenkins-admin_at_FreeBSD.org>
Date: Mon, 21 Sep 2026 04:54:29 UTC
FreeBSD-main-amd64-test - Build #29535 (a6deeaa2fb3b28a61ae56a85f2275f67fcf23262) - Still Unstable

Build information: https://ci.FreeBSD.org/job/FreeBSD-main-amd64-test/29535/
Full change log: https://ci.FreeBSD.org/job/FreeBSD-main-amd64-test/29535/changes
Full build log: https://ci.FreeBSD.org/job/FreeBSD-main-amd64-test/29535/console

Status explanation:
"Unstable" - some tests are suspected being broken by the following changes
"Still Unstable" - the failing test cases have not been fixed by these
                   following changes and this is a notification to note that
                   these changes have not been fully tested by the CI system

Change summaries:
(Those commits are likely but not certainly responsible)

a6deeaa2fb3b28a61ae56a85f2275f67fcf23262 by markj:
dtrace/arm64: Fix copyout and copyoutstr



The failed test cases:

7 tests failed.
FAILED:  sys.kern.ssl_sendfile.eagain_vs_eof

Error Message:
/usr/src/tests/sys/kern/ssl_sendfile.c:485: c.sbytes == -1 not met

FAILED:  sys.kern.ssl_sendfile.truncate

Error Message:
Test case body timed out

FAILED:  sys.kern.ssl_sendfile.grow

Error Message:
Test case body timed out

FAILED:  sys.net.if_wg.wg_basic_crossaf

Error Message:
atf-check failed; see the output of the test for details

FAILED:  sys.net.if_lagg_test.witness

Error Message:
Lock-order reversals involving if_lagg.c detected

FAILED:  sys.netinet.udp_bindings.connect_bound_socket_from_2address_jail

Error Message:
/usr/src/tests/sys/netinet/udp_bindings.c:244: connect(s, (struct sockaddr *)&sin, sizeof(sin)) == 0 not met

FAILED:  sys.netlink.netlink_socket.overflow

Error Message:
/usr/src/tests/sys/netlink/netlink_socket.c:146: send(fd, &hdr, sizeof(hdr), 0) == sizeof(hdr) not met