FreeBSD-main-amd64-test - Build #29531 - Still Unstable
Date: Sun, 20 Sep 2026 10:48:21 UTC
FreeBSD-main-amd64-test - Build #29531 (aca53fc2a6879f45dcbe1a60f91f14a5f6d48448) - Still Unstable
Build information: https://ci.FreeBSD.org/job/FreeBSD-main-amd64-test/29531/
Full change log: https://ci.FreeBSD.org/job/FreeBSD-main-amd64-test/29531/changes
Full build log: https://ci.FreeBSD.org/job/FreeBSD-main-amd64-test/29531/console
Status explanation:
"Unstable" - some tests are suspected being broken by the following changes
"Still Unstable" - the failing test cases have not been fixed by these
following changes and this is a notification to note that
these changes have not been fully tested by the CI system
Change summaries:
(Those commits are likely but not certainly responsible)
6a473ab490ea37ef4e08656e31466329305c3690 by delphij:
Vendor import of less v710.
7f7e9584cb9dbff7f74faf5589c9154d2c6eef3f by delphij:
Add release notes entry for less v710.
ed4d2671efbd8fa97c0e027e6945340a02d4725f by adrian:
acpidump: Add decoding of the MSDM table
28cad382a2bb5fc398bd11f8e7b3637ad6c03334 by cperciva:
ec2-desktop: Fix shell expansion in ec2_setpass
eca31490322f181a415c14c6bf03e656e81fb4aa by cperciva:
ec2-desktop: Don't enable firstboot_pkgs
aca53fc2a6879f45dcbe1a60f91f14a5f6d48448 by dim:
Fix statement with no effect in linuxkpi's xarray.h
The failed test cases:
8 tests failed.
FAILED: sys.kern.ssl_sendfile.eagain_vs_eof
Error Message:
/usr/src/tests/sys/kern/ssl_sendfile.c:485: c.sbytes == -1 not met
FAILED: sys.kern.ssl_sendfile.truncate
Error Message:
Test case body timed out
FAILED: sys.kern.ssl_sendfile.grow
Error Message:
Test case body timed out
FAILED: sys.net.if_wg.wg_basic_crossaf
Error Message:
atf-check failed; see the output of the test for details
FAILED: sys.netpfil.pf.pfsync.bulk
Error Message:
state not found on synced host
FAILED: sys.net.if_lagg_test.witness
Error Message:
Lock-order reversals involving if_lagg.c detected
FAILED: sys.netinet.udp_bindings.connect_bound_socket_from_2address_jail
Error Message:
/usr/src/tests/sys/netinet/udp_bindings.c:244: connect(s, (struct sockaddr *)&sin, sizeof(sin)) == 0 not met
FAILED: sys.netlink.netlink_socket.overflow
Error Message:
/usr/src/tests/sys/netlink/netlink_socket.c:146: send(fd, &hdr, sizeof(hdr), 0) == sizeof(hdr) not met