FreeBSD-main-amd64-test - Build #29517 - Still Unstable

From: <jenkins-admin_at_FreeBSD.org>
Date: Thu, 17 Sep 2026 21:15:30 UTC
FreeBSD-main-amd64-test - Build #29517 (43347e8c55f808f1e9faca2f118d4eab4bcd0228) - Still Unstable

Build information: https://ci.FreeBSD.org/job/FreeBSD-main-amd64-test/29517/
Full change log: https://ci.FreeBSD.org/job/FreeBSD-main-amd64-test/29517/changes
Full build log: https://ci.FreeBSD.org/job/FreeBSD-main-amd64-test/29517/console

Status explanation:
"Unstable" - some tests are suspected being broken by the following changes
"Still Unstable" - the failing test cases have not been fixed by these
                   following changes and this is a notification to note that
                   these changes have not been fully tested by the CI system

Change summaries:
(Those commits are likely but not certainly responsible)

9f24c7d5422285d2a89c50253c54aa1502f26dd7 by andrew:
dev: acpica: Add PCI device methods for aarch64

9556306213e1230fc3bef2598129f91e344bd49d by andrew:
arm64: Add ACPI support to GICv5 driver

67242cc4284e44936068945d9960c8f1fef136c1 by andrew:
arm64/vmm: vtimer: Read CNTPCT_EL0 through a dedicated macro

43347e8c55f808f1e9faca2f118d4eab4bcd0228 by andrew:
arm64: Fix definition of CCSIDR_EL1_op0



The failed test cases:

4 tests failed.
FAILED:  sys.netpfil.pf.pfsync.bulk

Error Message:
state not found on synced host

FAILED:  sys.net.if_lagg_test.witness

Error Message:
Lock-order reversals involving if_lagg.c detected

FAILED:  sys.netinet.udp_bindings.connect_bound_socket_from_2address_jail

Error Message:
/usr/src/tests/sys/netinet/udp_bindings.c:244: connect(s, (struct sockaddr *)&sin, sizeof(sin)) == 0 not met

FAILED:  sys.netlink.netlink_socket.overflow

Error Message:
/usr/src/tests/sys/netlink/netlink_socket.c:146: send(fd, &hdr, sizeof(hdr), 0) == sizeof(hdr) not met