FreeBSD-main-amd64-test - Build #29515 - Still Unstable

From: <jenkins-admin_at_FreeBSD.org>
Date: Thu, 17 Sep 2026 16:24:02 UTC
FreeBSD-main-amd64-test - Build #29515 (1d4a00d455617e150da5a7c3076579a7e612d33d) - Still Unstable

Build information: https://ci.FreeBSD.org/job/FreeBSD-main-amd64-test/29515/
Full change log: https://ci.FreeBSD.org/job/FreeBSD-main-amd64-test/29515/changes
Full build log: https://ci.FreeBSD.org/job/FreeBSD-main-amd64-test/29515/console

Status explanation:
"Unstable" - some tests are suspected being broken by the following changes
"Still Unstable" - the failing test cases have not been fixed by these
                   following changes and this is a notification to note that
                   these changes have not been fully tested by the CI system

Change summaries:
(Those commits are likely but not certainly responsible)

8b05d84be9e288d201e8631750ae180b07311ba7 by wulf:
LinuxKPI: implement __UNIQUE_ID() macro

52d1a0c62be1b4bd8e78ee57c86288246d948046 by wulf:
LinuxKPI: Add PCI_EXP_TYPE_UPSTREAM and PCI_VENDOR_ID_AMD defines

a8c60dd5eb8f158c9488db5aa92aafd38d756348 by kbowling:
ice: Make VF queue transitions idempotent

d38e0889d20eed3885a020993b72dc9855148ba3 by kbowling:
ice: Report VF queue enable failures as hardware errors

1d4a00d455617e150da5a7c3076579a7e612d33d by pkubaj:
powerpc/pmap: Use dcbz to zero pages in the radix pmap



The failed test cases:

3 tests failed.
FAILED:  sys.net.if_lagg_test.witness

Error Message:
Lock-order reversals involving if_lagg.c detected

FAILED:  sys.netinet.udp_bindings.connect_bound_socket_from_2address_jail

Error Message:
/usr/src/tests/sys/netinet/udp_bindings.c:244: connect(s, (struct sockaddr *)&sin, sizeof(sin)) == 0 not met

FAILED:  sys.netlink.netlink_socket.overflow

Error Message:
/usr/src/tests/sys/netlink/netlink_socket.c:146: send(fd, &hdr, sizeof(hdr), 0) == sizeof(hdr) not met