FreeBSD-main-amd64-test - Build #29513 - Still Unstable

From: <jenkins-admin_at_FreeBSD.org>
Date: Thu, 17 Sep 2026 11:31:05 UTC
FreeBSD-main-amd64-test - Build #29513 (fc809d6a6191ef4e881119ec00ea752d1ed6cc37) - Still Unstable

Build information: https://ci.FreeBSD.org/job/FreeBSD-main-amd64-test/29513/
Full change log: https://ci.FreeBSD.org/job/FreeBSD-main-amd64-test/29513/changes
Full build log: https://ci.FreeBSD.org/job/FreeBSD-main-amd64-test/29513/console

Status explanation:
"Unstable" - some tests are suspected being broken by the following changes
"Still Unstable" - the failing test cases have not been fixed by these
                   following changes and this is a notification to note that
                   these changes have not been fully tested by the CI system

Change summaries:
(Those commits are likely but not certainly responsible)

f5dc44c045c6f03a0f1bb2e81b0172e0781faec4 by kbowling:
ixgbe: Apply DMAC changes through an if-up reset request

5abfd8fe4d1adb74863231f27a9958cf176e3ded by kbowling:
ixgbe: Defer flow control programming while admission is closed

444168adbe5217ea9b73773e42c60bf75fb7a6fd by kbowling:
ixl: Tie statistics baselines to hardware resource epochs

6a903d9837645a9dbf990b699f50c67ad984c043 by kbowling:
ixgbe: Report hardware initialization failures to iflib

b263545980f44c0318afcc26188046ad7e559ceb by kbowling:
axgbe: Propagate hardware and PHY initialization failures

3f6c1e731376ffaf8612e7e196119acabbf357e4 by kbowling:
mgb: Propagate DMA setup errors and use the requested channel

9a1756f831a77ee8292821c9efd38c2125bff88c by kbowling:
enetc: Correct transmit queue timeout detection

fc809d6a6191ef4e881119ec00ea752d1ed6cc37 by kbowling:
ice: Quiesce queues after partial initialization



The failed test cases:

5 tests failed.
FAILED:  sys.netinet6.ndp.ndp_prefix_lifetime

Error Message:
atf-check failed; see the output of the test for details

FAILED:  sys.netpfil.pf.pfsync.bulk

Error Message:
state not found on synced host

FAILED:  sys.net.if_lagg_test.witness

Error Message:
Lock-order reversals involving if_lagg.c detected

FAILED:  sys.netinet.udp_bindings.connect_bound_socket_from_2address_jail

Error Message:
/usr/src/tests/sys/netinet/udp_bindings.c:244: connect(s, (struct sockaddr *)&sin, sizeof(sin)) == 0 not met

FAILED:  sys.netlink.netlink_socket.overflow

Error Message:
/usr/src/tests/sys/netlink/netlink_socket.c:146: send(fd, &hdr, sizeof(hdr), 0) == sizeof(hdr) not met