FreeBSD-main-amd64-test - Build #29501 - Still Unstable

From: <jenkins-admin_at_FreeBSD.org>
Date: Wed, 16 Sep 2026 02:47:09 UTC
FreeBSD-main-amd64-test - Build #29501 (6ac71529b285049a4939d7d17b3564c5f4f0519e) - Still Unstable

Build information: https://ci.FreeBSD.org/job/FreeBSD-main-amd64-test/29501/
Full change log: https://ci.FreeBSD.org/job/FreeBSD-main-amd64-test/29501/changes
Full build log: https://ci.FreeBSD.org/job/FreeBSD-main-amd64-test/29501/console

Status explanation:
"Unstable" - some tests are suspected being broken by the following changes
"Still Unstable" - the failing test cases have not been fixed by these
                   following changes and this is a notification to note that
                   these changes have not been fully tested by the CI system

Change summaries:
(Those commits are likely but not certainly responsible)

8e5e2c391059eaa0280a32b951e3ab1fac278364 by seuros:
intel: add hfsts debug-probe driver for Intel ME/HECI firmware status

6ac71529b285049a4939d7d17b3564c5f4f0519e by seuros:
video(4): add extended controls and remaining V4L2 compat symbols



The failed test cases:

7 tests failed.
FAILED:  sys.netlink.test_rtnl_route.rtnl_nhgrp_expire

Error Message:
1 checks failed; see output for more details

FAILED:  sys.netpfil.common.dummynet.pf_pls_gilbert

Error Message:
atf-check failed; see the output of the test for details

FAILED:  sys.netpfil.pf.pfsync.bulk

Error Message:
state not found on synced host

FAILED:  usr.sbin.sysrc.sysrc_test.A_flag

Error Message:
atf-check failed; see the output of the test for details

FAILED:  sys.net.if_lagg_test.witness

Error Message:
Lock-order reversals involving if_lagg.c detected

FAILED:  sys.netinet.udp_bindings.connect_bound_socket_from_2address_jail

Error Message:
/usr/src/tests/sys/netinet/udp_bindings.c:244: connect(s, (struct sockaddr *)&sin, sizeof(sin)) == 0 not met

FAILED:  sys.netlink.netlink_socket.overflow

Error Message:
/usr/src/tests/sys/netlink/netlink_socket.c:146: send(fd, &hdr, sizeof(hdr), 0) == sizeof(hdr) not met