FreeBSD-main-amd64-test - Build #29497 - Still Unstable
Date: Tue, 15 Sep 2026 16:29:06 UTC
FreeBSD-main-amd64-test - Build #29497 (694923501f56a5d4519f548ee06db603f9486bc7) - Still Unstable
Build information: https://ci.FreeBSD.org/job/FreeBSD-main-amd64-test/29497/
Full change log: https://ci.FreeBSD.org/job/FreeBSD-main-amd64-test/29497/changes
Full build log: https://ci.FreeBSD.org/job/FreeBSD-main-amd64-test/29497/console
Status explanation:
"Unstable" - some tests are suspected being broken by the following changes
"Still Unstable" - the failing test cases have not been fixed by these
following changes and this is a notification to note that
these changes have not been fully tested by the CI system
Change summaries:
(Those commits are likely but not certainly responsible)
694923501f56a5d4519f548ee06db603f9486bc7 by christos:
snd_uaudio: Read the UAC2 sample rate back after setting it
The failed test cases:
4 tests failed.
FAILED: usr.sbin.sysrc.sysrc_test.A_flag
Error Message:
atf-check failed; see the output of the test for details
FAILED: sys.net.if_lagg_test.witness
Error Message:
Lock-order reversals involving if_lagg.c detected
FAILED: sys.netinet.udp_bindings.connect_bound_socket_from_2address_jail
Error Message:
/usr/src/tests/sys/netinet/udp_bindings.c:244: connect(s, (struct sockaddr *)&sin, sizeof(sin)) == 0 not met
FAILED: sys.netlink.netlink_socket.overflow
Error Message:
/usr/src/tests/sys/netlink/netlink_socket.c:146: send(fd, &hdr, sizeof(hdr), 0) == sizeof(hdr) not met