FreeBSD-stable-14-amd64-test - Build #2146 - Still Unstable
Date: Mon, 14 Sep 2026 17:46:40 UTC
FreeBSD-stable-14-amd64-test - Build #2146 (354069b6141a6b01d538765e66e948b842d4b432) - Still Unstable
Build information: https://ci.FreeBSD.org/job/FreeBSD-stable-14-amd64-test/2146/
Full change log: https://ci.FreeBSD.org/job/FreeBSD-stable-14-amd64-test/2146/changes
Full build log: https://ci.FreeBSD.org/job/FreeBSD-stable-14-amd64-test/2146/console
Status explanation:
"Unstable" - some tests are suspected being broken by the following changes
"Still Unstable" - the failing test cases have not been fixed by these
following changes and this is a notification to note that
these changes have not been fully tested by the CI system
Change summaries:
(Those commits are likely but not certainly responsible)
c9213ef4667dac484113ef95f4bed7c39acd8203 by siva:
tests/fusefs: fix the build with gcc 16
63d78df8d304b7ab3333b10736cf8f9410bea9fa by siva:
ipfilter: remove unused variable
cf48fcc8c9be44e6407e24b26f05881d0606aea5 by siva:
cxgb(4): remove unused variable
8aa43e6a637694ab1bcced006d13fe70fc0c9fd9 by siva:
iflib: remove unused variables
83623954e4c86914439eee546dfcc84b4e2acecc by siva:
fsck_msdosfs: remove unused variable
655adcb2ff8e1326e5b8932f6b3a1e5f03ed8ad3 by siva:
tests/kqueue: remove unused variable
d6c48b05c0d0de49a06dce6954d4190bd41cac38 by siva:
sbin/ifconfig: remove unused static function parameter
09f68ad046a6b812f8580787c6be81c9ead409fe by siva:
camcontrol: remove unused variable
f006552b18e0abe50428fa2d88b5d046f8e02bb3 by siva:
libctf: remove unused variable
6f7e47dff44d9eeb1e24472b38baa48e90d3faad by siva:
sctp: remove unused variable
73d67bc5545b7cf8c4ba6a0cd49430e5f97bbb05 by siva:
lib/googletest: also use -O0 for internal tests with GCC
354069b6141a6b01d538765e66e948b842d4b432 by siva:
dtrace/tests: compile D sources at runtime on test target
The failed test cases:
97 tests failed.
FAILED: sbin.ping.ping_test.inject_opts
Error Message:
atf-check failed; see the output of the test for details
FAILED: sbin.ping.ping_test.inject_pip
Error Message:
atf-check failed; see the output of the test for details
FAILED: sbin.ping.ping_test.inject_reply
Error Message:
atf-check failed; see the output of the test for details
FAILED: sys.net.if_bridge_test.span
Error Message:
atf-check failed; see the output of the test for details
FAILED: sys.net.if_bridge_test.stp_validation
Error Message:
atf-check failed; see the output of the test for details
FAILED: sys.netinet.divert.ipdivert_ip_input_local_success
Error Message:
atf-check failed; see the output of the test for details
FAILED: sys.netinet.divert.ipdivert_ip_output_remote_success
Error Message:
atf-check failed; see the output of the test for details
FAILED: sys.netinet.forward.fwd_ip_icmp_gw_fast_success
Error Message:
atf-check failed; see the output of the test for details
FAILED: sys.netinet.forward.fwd_ip_icmp_gw_slow_success
Error Message:
atf-check failed; see the output of the test for details
FAILED: sys.netinet.forward.fwd_ip_icmp_iface_fast_success
Error Message:
atf-check failed; see the output of the test for details
FAILED: sys.netinet.forward.fwd_ip_icmp_iface_slow_success
Error Message:
atf-check failed; see the output of the test for details
FAILED: sys.netinet.redirect.valid_redirect
Error Message:
atf-check failed; see the output of the test for details
FAILED: sys.netinet6.divert.ipdivert_ip6_output_remote_success
Error Message:
atf-check failed; see the output of the test for details
FAILED: sys.netinet6.exthdr.exthdr
Error Message:
atf-check failed; see the output of the test for details
FAILED: sys.netinet6.forward6.fwd_ip6_gu_icmp_gw_gu_fast_success
Error Message:
atf-check failed; see the output of the test for details
FAILED: sys.netinet6.forward6.fwd_ip6_gu_icmp_gw_gu_slow_success
Error Message:
atf-check failed; see the output of the test for details
FAILED: sys.netinet6.forward6.fwd_ip6_gu_icmp_gw_ll_fast_success
Error Message:
atf-check failed; see the output of the test for details
FAILED: sys.netinet6.forward6.fwd_ip6_gu_icmp_gw_ll_slow_success
Error Message:
atf-check failed; see the output of the test for details
FAILED: sys.netinet6.forward6.fwd_ip6_gu_icmp_iface_fast_success
Error Message:
atf-check failed; see the output of the test for details
FAILED: sys.netinet6.forward6.fwd_ip6_gu_icmp_iface_slow_success
Error Message:
atf-check failed; see the output of the test for details
FAILED: sys.netinet6.frag6.frag6_02.frag6_02
Error Message:
atf-check failed; see the output of the test for details
FAILED: sys.netinet6.frag6.frag6_03.frag6_03
Error Message:
atf-check failed; see the output of the test for details
FAILED: sys.netinet6.frag6.frag6_04.frag6_04
Error Message:
atf-check failed; see the output of the test for details
FAILED: sys.netinet6.frag6.frag6_05.frag6_05_0
Error Message:
atf-check failed; see the output of the test for details
FAILED: sys.netinet6.frag6.frag6_05.frag6_05_1
Error Message:
atf-check failed; see the output of the test for details
FAILED: sys.netinet6.frag6.frag6_06.frag6_06_0
Error Message:
atf-check failed; see the output of the test for details
FAILED: sys.netinet6.frag6.frag6_07.frag6_07
Error Message:
atf-check failed; see the output of the test for details
FAILED: sys.netinet6.frag6.frag6_08.frag6_08
Error Message:
atf-check failed; see the output of the test for details
FAILED: sys.netinet6.frag6.frag6_09.frag6_09
Error Message:
atf-check failed; see the output of the test for details
FAILED: sys.netinet6.frag6.frag6_10.frag6_10
Error Message:
atf-check failed; see the output of the test for details
FAILED: sys.netinet6.frag6.frag6_11.frag6_11
Error Message:
atf-check failed; see the output of the test for details
FAILED: sys.netinet6.frag6.frag6_12.frag6_12
Error Message:
atf-check failed; see the output of the test for details
FAILED: sys.netinet6.frag6.frag6_13.frag6_13
Error Message:
atf-check failed; see the output of the test for details
FAILED: sys.netinet6.frag6.frag6_14.frag6_14
Error Message:
atf-check failed; see the output of the test for details
FAILED: sys.netinet6.frag6.frag6_15.frag6_15
Error Message:
atf-check failed; see the output of the test for details
FAILED: sys.netinet6.frag6.frag6_16.frag6_16
Error Message:
atf-check failed; see the output of the test for details
FAILED: sys.netinet6.frag6.frag6_17.frag6_17
Error Message:
atf-check failed; see the output of the test for details
FAILED: sys.netinet6.frag6.frag6_18.frag6_18
Error Message:
atf-check failed; see the output of the test for details
FAILED: sys.netinet6.frag6.frag6_19.frag6_19
Error Message:
atf-check failed; see the output of the test for details
FAILED: sys.netinet6.frag6.frag6_20.frag6_20
Error Message:
atf-check failed; see the output of the test for details
FAILED: sys.netinet6.mld.mldraw01
Error Message:
atf-check failed; see the output of the test for details
FAILED: sys.netinet6.scapyi386.scapyi386
Error Message:
atf-check failed; see the output of the test for details
FAILED: sys.netpfil.common.forward.ipf_v4
Error Message:
atf-check failed; see the output of the test for details
FAILED: sys.netpfil.common.forward.ipfw_v4
Error Message:
atf-check failed; see the output of the test for details
FAILED: sys.netpfil.common.forward.pf_v4
Error Message:
atf-check failed; see the output of the test for details
FAILED: sys.netpfil.common.tos.ipfw_tos
Error Message:
atf-check failed; see the output of the test for details
FAILED: sys.netpfil.common.tos.pf_tos
Error Message:
atf-check failed; see the output of the test for details
FAILED: sys.netpfil.pf.dup.dup_to
Error Message:
atf-check failed; see the output of the test for details
FAILED: sys.netpfil.pf.ether.bridge_to
Error Message:
atf-check failed; see the output of the test for details
FAILED: sys.netpfil.pf.forward.v4
Error Message:
atf-check failed; see the output of the test for details
FAILED: sys.netpfil.pf.forward.v6
Error Message:
atf-check failed; see the output of the test for details
FAILED: sys.netpfil.pf.fragmentation_compat.overindex
Error Message:
atf-check failed; see the output of the test for details
FAILED: sys.netpfil.pf.fragmentation_compat.overlimit
Error Message:
atf-check failed; see the output of the test for details
FAILED: sys.netpfil.pf.fragmentation_compat.overreplace
Error Message:
atf-check failed; see the output of the test for details
FAILED: sys.netpfil.pf.fragmentation_no_reassembly.compat_override_v4
Error Message:
atf-check failed; see the output of the test for details
FAILED: sys.netpfil.pf.fragmentation_no_reassembly.match_fragment_v4
Error Message:
atf-check failed; see the output of the test for details
FAILED: sys.netpfil.pf.fragmentation_no_reassembly.match_full_v4
Error Message:
atf-check failed; see the output of the test for details
FAILED: sys.netpfil.pf.fragmentation_pass.adjhole
Error Message:
atf-check failed; see the output of the test for details
FAILED: sys.netpfil.pf.fragmentation_pass.no_df
Error Message:
atf-check failed; see the output of the test for details
FAILED: sys.netpfil.pf.fragmentation_pass.overhole
Error Message:
atf-check failed; see the output of the test for details
FAILED: sys.netpfil.pf.fragmentation_pass.overindex
Error Message:
atf-check failed; see the output of the test for details
FAILED: sys.netpfil.pf.fragmentation_pass.overlimit
Error Message:
atf-check failed; see the output of the test for details
FAILED: sys.netpfil.pf.fragmentation_pass.overreplace
Error Message:
atf-check failed; see the output of the test for details
FAILED: sys.netpfil.pf.fragmentation_pass.reassemble_slowpath
Error Message:
atf-check failed; see the output of the test for details
FAILED: sys.netpfil.pf.icmp.cve_2019_5598
Error Message:
atf-check failed; see the output of the test for details
FAILED: sys.netpfil.pf.icmp6.zero_id
Error Message:
atf-check failed; see the output of the test for details
FAILED: sys.netpfil.pf.killstate.gateway
Error Message:
atf-check failed; see the output of the test for details
FAILED: sys.netpfil.pf.killstate.id
Error Message:
atf-check failed; see the output of the test for details
FAILED: sys.netpfil.pf.killstate.interface
Error Message:
atf-check failed; see the output of the test for details
FAILED: sys.netpfil.pf.killstate.label
Error Message:
atf-check failed; see the output of the test for details
FAILED: sys.netpfil.pf.killstate.multilabel
Error Message:
atf-check failed; see the output of the test for details
FAILED: sys.netpfil.pf.killstate.v4
Error Message:
atf-check failed; see the output of the test for details
FAILED: sys.netpfil.pf.killstate.v6
Error Message:
atf-check failed; see the output of the test for details
FAILED: sys.netpfil.pf.modulate.modulate_v4
Error Message:
atf-check failed; see the output of the test for details
FAILED: sys.netpfil.pf.modulate.modulate_v6
Error Message:
atf-check failed; see the output of the test for details
FAILED: sys.netpfil.pf.pass_block.urpf
Error Message:
atf-check failed; see the output of the test for details
FAILED: sys.netpfil.pf.pfsync.defer
Error Message:
atf-check failed; see the output of the test for details
FAILED: sys.netpfil.pf.pfsync.route_to
Error Message:
atf-check failed; see the output of the test for details
FAILED: sys.netpfil.pf.route_to.icmp_nat
Error Message:
atf-check failed; see the output of the test for details
FAILED: sys.netpfil.pf.rtable.forward_v4
Error Message:
atf-check failed; see the output of the test for details
FAILED: sys.netpfil.pf.rtable.forward_v6
Error Message:
atf-check failed; see the output of the test for details
FAILED: sys.netpfil.pf.scrub_compat.max_mss_v4
Error Message:
atf-check failed; see the output of the test for details
FAILED: sys.netpfil.pf.scrub_compat.max_mss_v6
Error Message:
atf-check failed; see the output of the test for details
FAILED: sys.netpfil.pf.scrub_compat.min_ttl_v4
Error Message:
atf-check failed; see the output of the test for details
FAILED: sys.netpfil.pf.scrub_compat.min_ttl_v6
Error Message:
atf-check failed; see the output of the test for details
FAILED: sys.netpfil.pf.scrub_compat.no_scrub_v4
Error Message:
atf-check failed; see the output of the test for details
FAILED: sys.netpfil.pf.scrub_compat.no_scrub_v6
Error Message:
atf-check failed; see the output of the test for details
FAILED: sys.netpfil.pf.scrub_compat.set_tos_v4
Error Message:
atf-check failed; see the output of the test for details
FAILED: sys.netpfil.pf.scrub_compat.set_tos_v6
Error Message:
atf-check failed; see the output of the test for details
FAILED: sys.netpfil.pf.scrub_pass.max_mss_v4
Error Message:
atf-check failed; see the output of the test for details
FAILED: sys.netpfil.pf.scrub_pass.max_mss_v6
Error Message:
atf-check failed; see the output of the test for details
FAILED: sys.netpfil.pf.scrub_pass.min_ttl_v4
Error Message:
atf-check failed; see the output of the test for details
FAILED: sys.netpfil.pf.scrub_pass.min_ttl_v6
Error Message:
atf-check failed; see the output of the test for details
FAILED: sys.netpfil.pf.scrub_pass.set_tos_v4
Error Message:
atf-check failed; see the output of the test for details
FAILED: sys.netpfil.pf.scrub_pass.set_tos_v6
Error Message:
atf-check failed; see the output of the test for details
FAILED: sys.netpfil.pf.set_tos.v4
Error Message:
atf-check failed; see the output of the test for details
FAILED: sys.netpfil.pf.tcp.rst
Error Message:
atf-check failed; see the output of the test for details