FreeBSD-main-amd64-test - Build #29489 - Still Unstable

From: <jenkins-admin_at_FreeBSD.org>
Date: Mon, 14 Sep 2026 16:35:52 UTC
FreeBSD-main-amd64-test - Build #29489 (2f10ffc003be396f3fc23cd2888023896560252b) - Still Unstable

Build information: https://ci.FreeBSD.org/job/FreeBSD-main-amd64-test/29489/
Full change log: https://ci.FreeBSD.org/job/FreeBSD-main-amd64-test/29489/changes
Full build log: https://ci.FreeBSD.org/job/FreeBSD-main-amd64-test/29489/console

Status explanation:
"Unstable" - some tests are suspected being broken by the following changes
"Still Unstable" - the failing test cases have not been fixed by these
                   following changes and this is a notification to note that
                   these changes have not been fully tested by the CI system

Change summaries:
(Those commits are likely but not certainly responsible)

276156545f16ae43e399fb33db224b65b3b649d7 by noreply:
CI: boot linux-stable instead of linux-virt on the Alpine runner

db3e38d129d618f1b0156cdca49cd9b4d96aa181 by noreply:
ZTS: fix mmp_set_hostid on Alpine Linux (musl libc)

2aadd730721e0169d2ecf67fe1e886e41f669ebf by noreply:
zstream_selftest_queue: fix alignas(type) build failure under C99

1b714355796ddc60b4f5283de2a7759eaa9ee2b6 by noreply:
Keep a grown vdev from adopting an older pool's labels

bd474db2fd2d24ebb32c2523a0bc1608a16cf1f6 by noreply:
ZTS: replace uncompress with gunzip in history tests

8aa9d7795ad38801b2ec29ee29f493beabecf00e by noreply:
ZTS: fix CDDL boilerplate in zpool_expand_007_pos.ksh

904d4327f4ab410724040bbb26911ab96da36324 by noreply:
dmu_objset_open_impl: unregister prop callbacks on error

998eca97924169bd6720b179dec7276ac5d300df by noreply:
CI: Add tzdata, libcap-utils, and ksh93's stable branch to Alpine

c8713f8f9c0d13affb9a2d0f7040adaac2be6f14 by behlendorf1:
ZTS: give mmp_reset_interval headroom above the suspend window

8373e97e4061daa6d790ae0b8ab5eaf7c6e979b0 by behlendorf1:
ZTS: resume a suspended pool in mmp_reset_interval cleanup

c878ee45219298030986247ea9799f8e75486204 by noreply:
zstream: track and limit memory use

6d4ff3b4f3a9d1a7dc3948e02569765aadcee0ab by noreply:
Pool split leaks DTL spacemap objects

3e328a0e73ca4bb74c57876e3b0879a320cb8cb1 by noreply:
ZTS: fix zinject argument order in mmp_write_uberblocks

e456404152cb2fb81f96958d0caf31b35ec5a277 by noreply:
zdb: add detailed diagnostics for MOS leaks and spacemap refs

b0fff48dc10459b781f18c905399a24db3dae529 by noreply:
arc: harness buf_hdr's anon state invariant checks

0498c554dc31e0110d87d333c0060e3696e9aa51 by noreply:
vdev_disk_open: fix ENOENT retry & cleanup error handling

75c6fb77b56d7afdbbc7b84ed30cc90390a68f88 by noreply:
ZTS: procfs_list_stale_read: accept Alpine's EIO error message

85d9a28b9fbbeb47ef56f154f9f8f54fdf871a84 by noreply:
ZTS: fix user_namespace_001 on Alpine Linux (BusyBox)

58d73c90dcdd77cdd07fc0b53d12d1b7339d2fe7 by noreply:
ZTS: exec_001_pos: copy the exec test binary under its own name

0daa27fea9cc2374a71a4912448bc9def2273535 by noreply:
ZTS: Do not run rm -rf / when $TESTPOOL is empty

013d73a9bfcbcffbbc3010a912fe3d6c501a9634 by noreply:
docs: fix typo independantly -> independently

a1261384a1df328dfebf8a832ecf3ef4872f0254 by noreply:
zstream: self-tuning queues

8dd73c716e13e29f99c361fa0d1ecfcc0a25f30b by noreply:
CI: force GRUB onto serial console for headless VM

6860d1c2f7db1d2817c514435cf6fcfae8bcf8a2 by noreply:
DDT: Use proper size when calling kmem_free on ddt_prune_entry_t

2455d6503033f3bf7cdda83858d99838bc53d868 by behlendorf1:
unit: make unit_eq() etc type-aware

bf96cd19617bd97c9cc7307c88c319c604dac212 by behlendorf1:
unit: add null/notnull helpers

b1fac4b7c60d4d1aa3d7739fe64b38e58a64832a by behlendorf1:
unit: add nvpair test suite

b824f3116dc7aae8a9e8fc85d3bf951a77e77d10 by noreply:
zstd: declare __asan_*_memory_region() for user space builds

b46561aa7e7e51d92071d30e01e8ff8396b7636e by noreply:
ztest: Add random seed support

b62a1fa7534f39d3ffa6bf1717b3d51e6c7bce80 by behlendorf1:
Undo checkpoint accounting on vdev_free()

e124aaa207d2b12042b648241222ab981a250472 by behlendorf1:
Speed up pool rewind and allow it to tolerate minor damage

01a2d01b3f927230f0b11ba7ffd201c5c7d8c475 by noreply:
linux: fix write cache detection on 6.11+ kernels

5280a08f6b3268c8c0c42320c90cdf18d6d46363 by noreply:
Write uberblocks only to vdevs used by the txg

c47591d5da9da8ce6ac46e3a0be340b53c065581 by noreply:
arc: apply arc_min tunables set before arc_init() has run

604d1b39b2280a4f38002ebc48da5911b2a85cc7 by noreply:
unit/btree: test the negative cases

8eb65b0ea563945280217d14fae82ea59580b774 by noreply:
Linux: drop cached pages in zfs_rezget()

cd578e51854d6c91089f8a35b543260f72936110 by noreply:
dnode: fix heap-use-after-free in dnode_rele_and_unlock()

9179d437c4fe508428353fe4ec4c5cdf683dc4ec by noreply:
ZTS: fix mkbusy kill/pgrep race in zfs_destroy_001_pos, _005_neg

e86fdc7cce5e675b570019e51aeb4023a9cd378f by behlendorf1:
ZTS: fix and re-enable zpool_import_missing_003_pos

77ab5dcecaf6eecc20cac2ea5481025288d8ae5a by behlendorf1:
ZTS: make raidz expansion pause wait actually wait

06d334b9e5b69a3336133a2aa02f69483264e2d9 by behlendorf1:
ZTS: drop stale expected-failure masks

51fe1fb84279454422355fcd5e3d12b63ee2ce7d by behlendorf1:
dmu_send: a meta-dnode range does not start where an object does

c25f4476b3f34987497e613a90e767963423e0ba by behlendorf1:
ZTS: cover a meta-dnode range colliding with a redaction entry

4d7cafb683d331a7e1d734ec5d9d31e73537ec05 by behlendorf1:
Defer destruction of a snapshot that a mount is holding open

47d09bf414a61a648d0797f5753c2728771d79f8 by behlendorf1:
Don't fail a release because a deferred snapshot is still busy

b19fa7c97d6ae6691cceb6033e71083762505bb0 by noreply:
log_spacemap: make zfs_log_sm_blksz tunable

43bb1614d50fee71b8ada14ca7b3a0d968a26263 by noreply:
Linux: avoid prefaulting under the ZFS range lock

8486ea36f462a2eef3fd111217cf3ad1dfb99f84 by noreply:
ZTS: bound ctime_001_pos by the time that actually elapsed

b0da5c4cee9e13ba3b73adb062fd95784126f6c7 by behlendorf1:
dsl_crypt: validate every key change-key will rewrap

489ea6491f786ee94e00a399a682bbce59ce6448 by behlendorf1:
ZTS: cover change-key on a dataset whose key does not match its root

8e5bb1d4be95a55f62f307d1d9c32b72e854acaf by noreply:
Wait for the initialize and trim threads to exit

166078670d7082e8ebbd7e6db100f8c6fc163184 by behlendorf1:
Increasing ZTS timeout as some PRs exceed the limit

aa26ca67b1b7663ad4d08cdddfbe3352b688b6c4 by noreply:
Do not complete a device removal that hit IO errors

f7b10b66be2cb8b708ce31bcc88ae2173194db1e by behlendorf1:
Revert "Linux: avoid prefaulting under the ZFS range lock"

fd639b075a79fe8c5a4ec6af092a9cc434611425 by noreply:
zcp: support bookmarks in zfs.sync.destroy

7b119debe21e246ddc9b78ffa6d0afcbc460f795 by noreply:
ZTS: let the zvol settle before alloc_class_016_pos destroys the pool

588012797f7b43b68276b2fd89933f2af6fb1792 by noreply:
ZTS: wait for the zhack pids mmp_concurrent_import started

ba524e0d7c8f90e631230947ed4721209de5ad67 by noreply:
zpool: things get messy with 0 columns

fe952576a87a5ee4295d4e67c9849c4abea32488 by behlendorf1:
zhack: add mos scan/reclaim for leaked MOS objects

e74cde0b9eb7fc77342a027714d255222c005789 by behlendorf1:
zhack: add mos leak subcommand for local repro

154290cf7baa0f7ea61e692ae7bf8cd9123205a0 by behlendorf1:
zfs-tests: add zhack mos leak/reclaim coverage

33ae06bb617f586d43eb0a443cd69dad2f15467d by noreply:
ZIO: Batch vdev children completions

39764eb06bd079b31cf830c8582870753aebcafb by noreply:
Fix double free when cloning a block with a pending free

69ef525a4857bd4347cf34907a64ea9fbbd9de75 by noreply:
dsl_deadlist_space_range: use correct tree when summing up space

cc22ee2f0262862abfd51350eda60ac25d9316d6 by behlendorf1:
ztest: sleep while waiting for the fishing thread to seed

0a25e5c7bf15d365a875d738105494364122c22a by behlendorf1:
ztest: print the fishing seed with %016llx

e4538b5775d9b5f037841038d9caeddecdfb03f2 by noreply:
ZTS: tighten the device_access tests

9e06573c4f2b808f968f8bb5d3ef10113953596c by noreply:
CI: update the FreeBSD STABLE CI runner to 14.5-STABLE

0ee8ea01bc16620bac8563ae5b3ad02098297641 by noreply:
FreeBSD: use sys/abi_compat.h for time32_t

1ebc6f54896639f98a98b4d8b9feb39975cb6195 by noreply:
zdb: do not adopt an unreferenced spa when the pool fails to open

92a3904afc93c3a70584f13db8f26816dc79328d by noreply:
Wait for the txg that finished a scan to sync

09e7e735a95452f2c50099983dd97fc09c7ef73c by noreply:
ZTS: fill the ARC before l2arc_multidev_scaling_pos measures it

e08bc2973aa5fcab8d2f3a145f9d6dd034f87527 by noreply:
Skip interior dnode slots when receiving DRR_FREEOBJECTS

0e2c0f97764d161fd41d567029549e1c9e1b6bd5 by noreply:
ZTS: judge mmap_sync by a concurrent fsync, not by a fixed bound

ba464dfc41be2593924c1b00ee05b724da351f12 by noreply:
ZTS: do not leave a suspended pool behind in the mmp tests

cb333be8652eae664412d50df176f24ecefc2808 by noreply:
ZTS: resolve two possible divide by zero errors in tests

6a320c9c72fa0dce1036c4915677158d7dddcf23 by noreply:
Linux: Wire RWF_DONTCACHE and POSIX_FADV_NOREUSE

7853c27eb4ac83d288a2bd30795fd336175ac85e by noreply:
ZIO: Batch lightweight ZIOs

75bd31c2839fcc2a0e1f699ceadb9bbd7a8f8eec by noreply:
L2ARC: do not feed a device while its rebuild is pending

1a8e5149167cb7813bf6d7e83c6185c563cb48f2 by noreply:
Fix self-deadlock when cloning a range within the same file

1c8a75f7d3f0aa81ea3560540e706a8fc3808a8f by noreply:
ZTS: Fix device_access_import cleanup

8fe28f4ca4a00e5e849172111416472dc63f9bf2 by noreply:
zdb.8: document the -Z flag

db07a5e0a8b9d8835a62fd175039225d200ae394 by noreply:
dbuf: account dirty data for embedded writes

ab994acddb655fe80e9609a96979e3086f88903a by noreply:
dmu: remove dmu_prealloc()

d966f3dd8c2e4eb04e52227b7a87f5828924f89c by behlendorf1:
Linux 7.3: bvec_iter.bi_bvec_done is now bi_offset

315bc75afc18f548df3b738b69bfaad7cff094ad by behlendorf1:
Linux: use cpu_feature_enabled() instead of static_cpu_has()

6e2fa4bc87c35086ce36a4022cfa2b4212518eab by behlendorf1:
Linux 7.3: inode_operations.create dropped flag arg

cd3699d308e1b37dcdd0d5a9a8c3624deb5fc3e9 by behlendorf1:
Linux 7.3: make host filesystem available to kernel threads

0833cfd64b697d1a6fb4ded4554d7dbbc4484f57 by noreply:
Decline Direct I/O reads on a file handle after a benign verify failure

4e015d8d41cdb3e24e5ed676d75bb5a2325549f1 by noreply:
ZTS: inject latency into initialize online/offline test

61fbdf1a204c9974ac1a70232d85396a6e58407c by noreply:
zfs: spa_sync_upgrades() should only take lock when needed

56e8d234b61b99885a1831ceda68a999c92dec44 by noreply:
Stop the TRIM and initialize threads when a vdev goes offline

bf71aaf205866296c290d709c52f5bceae6596eb by noreply:
spl: Honour forced Linux slab cache selection

99831de4eb25e89215fea37f70c9c6a136105566 by noreply:
zdb: Allow filtering on zvol objects

02b5baf13cbfdf9abd33b939a082b448951d9174 by noreply:
ZTS: Add import_relax_metadata_damaged exception



The failed test cases:

154 tests failed.
FAILED:  sys.netpfil.pf.syncookie.basic_v6

Error Message:
Failed to connect to syncookie protected echo daemon

FAILED:  sys.net.if_lagg_test.witness

Error Message:
Lock-order reversals involving if_lagg.c detected

FAILED:  sys.netinet.udp_bindings.connect_bound_socket_from_2address_jail

Error Message:
/usr/src/tests/sys/netinet/udp_bindings.c:244: connect(s, (struct sockaddr *)&sin, sizeof(sin)) == 0 not met

FAILED:  sbin.ping.ping_test.inject_opts

Error Message:
atf-check failed; see the output of the test for details

FAILED:  sbin.ping.ping_test.inject_pip

Error Message:
atf-check failed; see the output of the test for details

FAILED:  sbin.ping.ping_test.inject_reply

Error Message:
atf-check failed; see the output of the test for details

FAILED:  sys.net.if_bridge_test.span

Error Message:
atf-check failed; see the output of the test for details

FAILED:  sys.net.if_bridge_test.stp_validation

Error Message:
atf-check failed; see the output of the test for details

FAILED:  sys.netinet.divert.ipdivert_ip_input_local_success

Error Message:
atf-check failed; see the output of the test for details

FAILED:  sys.netinet.divert.ipdivert_ip_output_remote_success

Error Message:
atf-check failed; see the output of the test for details

FAILED:  sys.netinet.forward.fwd_ip_icmp_gw_fast_success

Error Message:
atf-check failed; see the output of the test for details

FAILED:  sys.netinet.forward.fwd_ip_icmp_gw_slow_success

Error Message:
atf-check failed; see the output of the test for details

FAILED:  sys.netinet.forward.fwd_ip_icmp_iface_fast_success

Error Message:
atf-check failed; see the output of the test for details

FAILED:  sys.netinet.forward.fwd_ip_icmp_iface_slow_success

Error Message:
atf-check failed; see the output of the test for details

FAILED:  sys.netinet.redirect.valid_redirect

Error Message:
atf-check failed; see the output of the test for details

FAILED:  sys.netinet6.divert.ipdivert_ip6_output_remote_success

Error Message:
atf-check failed; see the output of the test for details

FAILED:  sys.netinet6.exthdr.exthdr

Error Message:
atf-check failed; see the output of the test for details

FAILED:  sys.netinet6.forward6.fwd_ip6_gu_icmp_gw_gu_fast_success

Error Message:
atf-check failed; see the output of the test for details

FAILED:  sys.netinet6.forward6.fwd_ip6_gu_icmp_gw_gu_slow_success

Error Message:
atf-check failed; see the output of the test for details

FAILED:  sys.netinet6.forward6.fwd_ip6_gu_icmp_gw_ll_fast_success

Error Message:
atf-check failed; see the output of the test for details

FAILED:  sys.netinet6.forward6.fwd_ip6_gu_icmp_gw_ll_slow_success

Error Message:
atf-check failed; see the output of the test for details

FAILED:  sys.netinet6.forward6.fwd_ip6_gu_icmp_iface_fast_success

Error Message:
atf-check failed; see the output of the test for details

FAILED:  sys.netinet6.forward6.fwd_ip6_gu_icmp_iface_slow_success

Error Message:
atf-check failed; see the output of the test for details

FAILED:  sys.netinet6.frag6.frag6_02.frag6_02

Error Message:
atf-check failed; see the output of the test for details

FAILED:  sys.netinet6.frag6.frag6_03.frag6_03

Error Message:
atf-check failed; see the output of the test for details

FAILED:  sys.netinet6.frag6.frag6_04.frag6_04

Error Message:
atf-check failed; see the output of the test for details

FAILED:  sys.netinet6.frag6.frag6_05.frag6_05_0

Error Message:
atf-check failed; see the output of the test for details

FAILED:  sys.netinet6.frag6.frag6_05.frag6_05_1

Error Message:
atf-check failed; see the output of the test for details

FAILED:  sys.netinet6.frag6.frag6_06.frag6_06_0

Error Message:
atf-check failed; see the output of the test for details

FAILED:  sys.netinet6.frag6.frag6_07.frag6_07

Error Message:
atf-check failed; see the output of the test for details

FAILED:  sys.netinet6.frag6.frag6_08.frag6_08

Error Message:
atf-check failed; see the output of the test for details

FAILED:  sys.netinet6.frag6.frag6_09.frag6_09

Error Message:
atf-check failed; see the output of the test for details

FAILED:  sys.netinet6.frag6.frag6_10.frag6_10

Error Message:
atf-check failed; see the output of the test for details

FAILED:  sys.netinet6.frag6.frag6_11.frag6_11

Error Message:
atf-check failed; see the output of the test for details

FAILED:  sys.netinet6.frag6.frag6_12.frag6_12

Error Message:
atf-check failed; see the output of the test for details

FAILED:  sys.netinet6.frag6.frag6_13.frag6_13

Error Message:
atf-check failed; see the output of the test for details

FAILED:  sys.netinet6.frag6.frag6_14.frag6_14

Error Message:
atf-check failed; see the output of the test for details

FAILED:  sys.netinet6.frag6.frag6_15.frag6_15

Error Message:
atf-check failed; see the output of the test for details

FAILED:  sys.netinet6.frag6.frag6_16.frag6_16

Error Message:
atf-check failed; see the output of the test for details

FAILED:  sys.netinet6.frag6.frag6_17.frag6_17

Error Message:
atf-check failed; see the output of the test for details

FAILED:  sys.netinet6.frag6.frag6_18.frag6_18

Error Message:
atf-check failed; see the output of the test for details

FAILED:  sys.netinet6.frag6.frag6_19.frag6_19

Error Message:
atf-check failed; see the output of the test for details

FAILED:  sys.netinet6.frag6.frag6_20.frag6_20

Error Message:
atf-check failed; see the output of the test for details

FAILED:  sys.netinet6.mld.mldraw01

Error Message:
atf-check failed; see the output of the test for details

FAILED:  sys.netinet6.redirect.valid_redirect

Error Message:
atf-check failed; see the output of the test for details

FAILED:  sys.netinet6.scapyi386.scapyi386

Error Message:
atf-check failed; see the output of the test for details

FAILED:  sys.netpfil.common.forward.ipf_v4

Error Message:
atf-check failed; see the output of the test for details

FAILED:  sys.netpfil.common.forward.ipfw_v4

Error Message:
atf-check failed; see the output of the test for details

FAILED:  sys.netpfil.common.forward.pf_v4

Error Message:
atf-check failed; see the output of the test for details

FAILED:  sys.netpfil.common.tos.ipfw_tos

Error Message:
atf-check failed; see the output of the test for details

FAILED:  sys.netpfil.common.tos.pf_tos

Error Message:
atf-check failed; see the output of the test for details

FAILED:  sys.netpfil.ipfw.ipv6-flow-id.ipv6fl

Error Message:
atf-check failed; see the output of the test for details

FAILED:  sys.netpfil.pf.dup.dup_to

Error Message:
atf-check failed; see the output of the test for details

FAILED:  sys.netpfil.pf.ether.bridge_to

Error Message:
atf-check failed; see the output of the test for details

FAILED:  sys.netpfil.pf.forward.v4

Error Message:
atf-check failed; see the output of the test for details

FAILED:  sys.netpfil.pf.forward.v6

Error Message:
atf-check failed; see the output of the test for details

FAILED:  sys.netpfil.pf.fragmentation_compat.overindex

Error Message:
atf-check failed; see the output of the test for details

FAILED:  sys.netpfil.pf.fragmentation_compat.overlimit

Error Message:
atf-check failed; see the output of the test for details

FAILED:  sys.netpfil.pf.fragmentation_compat.overreplace

Error Message:
atf-check failed; see the output of the test for details

FAILED:  sys.netpfil.pf.fragmentation_no_reassembly.compat_override_v4

Error Message:
atf-check failed; see the output of the test for details

FAILED:  sys.netpfil.pf.fragmentation_no_reassembly.match_fragment_v4

Error Message:
atf-check failed; see the output of the test for details

FAILED:  sys.netpfil.pf.fragmentation_no_reassembly.match_full_v4

Error Message:
atf-check failed; see the output of the test for details

FAILED:  sys.netpfil.pf.fragmentation_pass.adjhole

Error Message:
atf-check failed; see the output of the test for details

FAILED:  sys.netpfil.pf.fragmentation_pass.dummynet_fragmented

Error Message:
atf-check failed; see the output of the test for details

FAILED:  sys.netpfil.pf.fragmentation_pass.no_df

Error Message:
atf-check failed; see the output of the test for details

FAILED:  sys.netpfil.pf.fragmentation_pass.overhole

Error Message:
atf-check failed; see the output of the test for details

FAILED:  sys.netpfil.pf.fragmentation_pass.overindex

Error Message:
atf-check failed; see the output of the test for details

FAILED:  sys.netpfil.pf.fragmentation_pass.overlimit

Error Message:
atf-check failed; see the output of the test for details

FAILED:  sys.netpfil.pf.fragmentation_pass.overreplace

Error Message:
atf-check failed; see the output of the test for details

FAILED:  sys.netpfil.pf.fragmentation_pass.reassemble_slowpath

Error Message:
atf-check failed; see the output of the test for details

FAILED:  sys.netpfil.pf.icmp.cve_2019_5598

Error Message:
atf-check failed; see the output of the test for details

FAILED:  sys.netpfil.pf.icmp6.zero_id

Error Message:
atf-check failed; see the output of the test for details

FAILED:  sys.netpfil.pf.killstate.gateway

Error Message:
atf-check failed; see the output of the test for details

FAILED:  sys.netpfil.pf.killstate.id

Error Message:
atf-check failed; see the output of the test for details

FAILED:  sys.netpfil.pf.killstate.interface

Error Message:
atf-check failed; see the output of the test for details

FAILED:  sys.netpfil.pf.killstate.key

Error Message:
atf-check failed; see the output of the test for details

FAILED:  sys.netpfil.pf.killstate.label

Error Message:
atf-check failed; see the output of the test for details

FAILED:  sys.netpfil.pf.killstate.multilabel

Error Message:
atf-check failed; see the output of the test for details

FAILED:  sys.netpfil.pf.killstate.nat

Error Message:
atf-check failed; see the output of the test for details

FAILED:  sys.netpfil.pf.killstate.src_dst

Error Message:
atf-check failed; see the output of the test for details

FAILED:  sys.netpfil.pf.killstate.v4

Error Message:
atf-check failed; see the output of the test for details

FAILED:  sys.netpfil.pf.killstate.v6

Error Message:
atf-check failed; see the output of the test for details

FAILED:  sys.netpfil.pf.match.allow_opts

Error Message:
atf-check failed; see the output of the test for details

FAILED:  sys.netpfil.pf.max_states.max_states

Error Message:
atf-check failed; see the output of the test for details

FAILED:  sys.netpfil.pf.modulate.modulate_v4

Error Message:
atf-check failed; see the output of the test for details

FAILED:  sys.netpfil.pf.modulate.modulate_v6

Error Message:
atf-check failed; see the output of the test for details

FAILED:  sys.netpfil.pf.nat.binat_compat

Error Message:
atf-check failed; see the output of the test for details

FAILED:  sys.netpfil.pf.nat.binat_match

Error Message:
atf-check failed; see the output of the test for details

FAILED:  sys.netpfil.pf.nat.empty_pool

Error Message:
atf-check failed; see the output of the test for details

FAILED:  sys.netpfil.pf.nat.nat_match

Error Message:
atf-check failed; see the output of the test for details

FAILED:  sys.netpfil.pf.nat.nat_pass_in

Error Message:
atf-check failed; see the output of the test for details

FAILED:  sys.netpfil.pf.nat.nat_pass_out

Error Message:
atf-check failed; see the output of the test for details

FAILED:  sys.netpfil.pf.pass_block.urpf

Error Message:
atf-check failed; see the output of the test for details

FAILED:  sys.netpfil.pf.pflow.nat

Error Message:
atf-check failed; see the output of the test for details

FAILED:  sys.netpfil.pf.pflow.rule

Error Message:
atf-check failed; see the output of the test for details

FAILED:  sys.netpfil.pf.pflow.state_defaults

Error Message:
atf-check failed; see the output of the test for details

FAILED:  sys.netpfil.pf.pflow.v6

Error Message:
atf-check failed; see the output of the test for details

FAILED:  sys.netpfil.pf.pfsync.af_to_in_floating

Error Message:
atf-check failed; see the output of the test for details

FAILED:  sys.netpfil.pf.pfsync.af_to_in_if_bound

Error Message:
atf-check failed; see the output of the test for details

FAILED:  sys.netpfil.pf.pfsync.af_to_out_if_bound

Error Message:
atf-check failed; see the output of the test for details

... and 54 other failed tests.