FreeBSD-main-amd64-test - Build #29487 - Still Unstable
Date: Mon, 14 Sep 2026 07:15:02 UTC
FreeBSD-main-amd64-test - Build #29487 (7a039603a49db09fa574b4365ba36c92b7658868) - Still Unstable
Build information: https://ci.FreeBSD.org/job/FreeBSD-main-amd64-test/29487/
Full change log: https://ci.FreeBSD.org/job/FreeBSD-main-amd64-test/29487/changes
Full build log: https://ci.FreeBSD.org/job/FreeBSD-main-amd64-test/29487/console
Status explanation:
"Unstable" - some tests are suspected being broken by the following changes
"Still Unstable" - the failing test cases have not been fixed by these
following changes and this is a notification to note that
these changes have not been fully tested by the CI system
Change summaries:
(Those commits are likely but not certainly responsible)
1bf7d54e416cad3c89eed0e781a85d15e6864920 by ziaee:
vmx.4: Canonicalize device number
7ec06b4d9726188c7315cf1b2d5b69fec4a385b4 by ziaee:
u3g.4: Canonicalize SYNOPSIS, fix stray hyphen
ca87782318d2e14bb07acfacd11c0be63a5e64a6 by ziaee:
uark.4: Canonicalize SYNOPSIS + tag SPDX
2f2938d2654e3c41641c9fce4c8b08b38acfdcc6 by ziaee:
uart.4: Conicalize sections a bit better
2c92e4c931e7f12f1dc9b82036b26295c1f4d37e by ziaee:
uath.4: Canonicalize SYNOPSIS
2b67a5b5273e0af7c9dbf9f92b2b8c7b1940f9c3 by ziaee:
uath.4: Canonicalize FIRMWARE -> FILES
01e9a8bc8a124d3e19280d82b1ce16bd69237627 by ziaee:
ubsa.4: Canonicalize SYNOPSIS + tag SPDX
372b94623ca48d7ceae02175b5ffd635e62c2c58 by ziaee:
ubser.4: Canonicalize SYNOPSIS + tag SPDX
28bbe93c5bb5e6fb34bf680341faa9c869417320 by ziaee:
ubtbcmfw.4: Canonicalize SYNOPSIS + tag SPDX
08ab66b3f69391e753c6f5449105d61ce81cd0ed by ziaee:
ucom.4: Canonicalize SYNOPSIS + tag SPDX
c64f6133ff083feb1c9451e12af5b7de0c2d6a41 by ziaee:
ucycom.4: Canonicalize SYNOPSIS
6fe1d51aedb086e49bb338ed87861abdcce416f2 by ziaee:
udav.4: Canonicalize SYNOPSIS + "Fast" Ethernet
bba2aebcebc1d46b15e1b6d86c041186dc8d49f0 by ziaee:
udbp.4: Canonicalize SYNOPSIS, structure, SPDX
7b70103a6303b53ea8130cfbb89a3eb2e476e2e5 by ziaee:
udl.4: Canonicalize SYNOPSIS
dc867c353c8b423131f7f6a7f687c86713bf0666 by ziaee:
tslog.4: Canonicalize SYNOPSIS
f49dc19881d853b26dd675127f579f923dc87de2 by ziaee:
tpm.4: Canonicalize SYNOPSIS and HARDWARE
a6b40d746b4b727b308f2437b41f8032b921a8e5 by wulf:
LinuxKPI: Add dma_length field to struct scatterlist
9b26803758e91413e7ca842188f307711995ee5f by delphij:
Vendor import of xz 5.8.4 (trimmed)
a22eb754c4bb7e3adffdaa9b2c3ddf24eda89a9c by kbowling:
tpm_tis: Quiesce interrupts before registering a handler
416611f05cc4fc431a6f9f40fcc40171e846e8fe by seuros:
nvme: reject namespaces formatted with metadata
dd9e49a10bc14f7d876426d7d85fed0d1fe9699d by seuros:
intel/intelpmc: Add Intel PMC Core driver
9a46a1439c46045ecb33684d8fbdb1a841ccb425 by seuros:
acpi_cpu: only report unmapped processor objects enabled in the MADT
77535f91f623ec5bda9d45de878165cb6b3cdba1 by rmacklem:
nfscl: Yet more fixes for the NFS over RDMA client glue
8f478e4ac62c7a4a2313d89dc59310aa74cf3f9b by ngie:
apple_bce.4: add a basic manpage describing the driver
7a039603a49db09fa574b4365ba36c92b7658868 by ngie:
asmc.4: clean up/modernize manpage
The failed test cases:
153 tests failed.
FAILED: sys.net.if_lagg_test.witness
Error Message:
Lock-order reversals involving if_lagg.c detected
FAILED: sys.netinet.udp_bindings.connect_bound_socket_from_2address_jail
Error Message:
/usr/src/tests/sys/netinet/udp_bindings.c:244: connect(s, (struct sockaddr *)&sin, sizeof(sin)) == 0 not met
FAILED: sbin.ping.ping_test.inject_opts
Error Message:
atf-check failed; see the output of the test for details
FAILED: sbin.ping.ping_test.inject_pip
Error Message:
atf-check failed; see the output of the test for details
FAILED: sbin.ping.ping_test.inject_reply
Error Message:
atf-check failed; see the output of the test for details
FAILED: sys.net.if_bridge_test.span
Error Message:
atf-check failed; see the output of the test for details
FAILED: sys.net.if_bridge_test.stp_validation
Error Message:
atf-check failed; see the output of the test for details
FAILED: sys.netinet.divert.ipdivert_ip_input_local_success
Error Message:
atf-check failed; see the output of the test for details
FAILED: sys.netinet.divert.ipdivert_ip_output_remote_success
Error Message:
atf-check failed; see the output of the test for details
FAILED: sys.netinet.forward.fwd_ip_icmp_gw_fast_success
Error Message:
atf-check failed; see the output of the test for details
FAILED: sys.netinet.forward.fwd_ip_icmp_gw_slow_success
Error Message:
atf-check failed; see the output of the test for details
FAILED: sys.netinet.forward.fwd_ip_icmp_iface_fast_success
Error Message:
atf-check failed; see the output of the test for details
FAILED: sys.netinet.forward.fwd_ip_icmp_iface_slow_success
Error Message:
atf-check failed; see the output of the test for details
FAILED: sys.netinet.redirect.valid_redirect
Error Message:
atf-check failed; see the output of the test for details
FAILED: sys.netinet6.divert.ipdivert_ip6_output_remote_success
Error Message:
atf-check failed; see the output of the test for details
FAILED: sys.netinet6.exthdr.exthdr
Error Message:
atf-check failed; see the output of the test for details
FAILED: sys.netinet6.forward6.fwd_ip6_gu_icmp_gw_gu_fast_success
Error Message:
atf-check failed; see the output of the test for details
FAILED: sys.netinet6.forward6.fwd_ip6_gu_icmp_gw_gu_slow_success
Error Message:
atf-check failed; see the output of the test for details
FAILED: sys.netinet6.forward6.fwd_ip6_gu_icmp_gw_ll_fast_success
Error Message:
atf-check failed; see the output of the test for details
FAILED: sys.netinet6.forward6.fwd_ip6_gu_icmp_gw_ll_slow_success
Error Message:
atf-check failed; see the output of the test for details
FAILED: sys.netinet6.forward6.fwd_ip6_gu_icmp_iface_fast_success
Error Message:
atf-check failed; see the output of the test for details
FAILED: sys.netinet6.forward6.fwd_ip6_gu_icmp_iface_slow_success
Error Message:
atf-check failed; see the output of the test for details
FAILED: sys.netinet6.frag6.frag6_02.frag6_02
Error Message:
atf-check failed; see the output of the test for details
FAILED: sys.netinet6.frag6.frag6_03.frag6_03
Error Message:
atf-check failed; see the output of the test for details
FAILED: sys.netinet6.frag6.frag6_04.frag6_04
Error Message:
atf-check failed; see the output of the test for details
FAILED: sys.netinet6.frag6.frag6_05.frag6_05_0
Error Message:
atf-check failed; see the output of the test for details
FAILED: sys.netinet6.frag6.frag6_05.frag6_05_1
Error Message:
atf-check failed; see the output of the test for details
FAILED: sys.netinet6.frag6.frag6_06.frag6_06_0
Error Message:
atf-check failed; see the output of the test for details
FAILED: sys.netinet6.frag6.frag6_07.frag6_07
Error Message:
atf-check failed; see the output of the test for details
FAILED: sys.netinet6.frag6.frag6_08.frag6_08
Error Message:
atf-check failed; see the output of the test for details
FAILED: sys.netinet6.frag6.frag6_09.frag6_09
Error Message:
atf-check failed; see the output of the test for details
FAILED: sys.netinet6.frag6.frag6_10.frag6_10
Error Message:
atf-check failed; see the output of the test for details
FAILED: sys.netinet6.frag6.frag6_11.frag6_11
Error Message:
atf-check failed; see the output of the test for details
FAILED: sys.netinet6.frag6.frag6_12.frag6_12
Error Message:
atf-check failed; see the output of the test for details
FAILED: sys.netinet6.frag6.frag6_13.frag6_13
Error Message:
atf-check failed; see the output of the test for details
FAILED: sys.netinet6.frag6.frag6_14.frag6_14
Error Message:
atf-check failed; see the output of the test for details
FAILED: sys.netinet6.frag6.frag6_15.frag6_15
Error Message:
atf-check failed; see the output of the test for details
FAILED: sys.netinet6.frag6.frag6_16.frag6_16
Error Message:
atf-check failed; see the output of the test for details
FAILED: sys.netinet6.frag6.frag6_17.frag6_17
Error Message:
atf-check failed; see the output of the test for details
FAILED: sys.netinet6.frag6.frag6_18.frag6_18
Error Message:
atf-check failed; see the output of the test for details
FAILED: sys.netinet6.frag6.frag6_19.frag6_19
Error Message:
atf-check failed; see the output of the test for details
FAILED: sys.netinet6.frag6.frag6_20.frag6_20
Error Message:
atf-check failed; see the output of the test for details
FAILED: sys.netinet6.mld.mldraw01
Error Message:
atf-check failed; see the output of the test for details
FAILED: sys.netinet6.redirect.valid_redirect
Error Message:
atf-check failed; see the output of the test for details
FAILED: sys.netinet6.scapyi386.scapyi386
Error Message:
atf-check failed; see the output of the test for details
FAILED: sys.netpfil.common.forward.ipf_v4
Error Message:
atf-check failed; see the output of the test for details
FAILED: sys.netpfil.common.forward.ipfw_v4
Error Message:
atf-check failed; see the output of the test for details
FAILED: sys.netpfil.common.forward.pf_v4
Error Message:
atf-check failed; see the output of the test for details
FAILED: sys.netpfil.common.tos.ipfw_tos
Error Message:
atf-check failed; see the output of the test for details
FAILED: sys.netpfil.common.tos.pf_tos
Error Message:
atf-check failed; see the output of the test for details
FAILED: sys.netpfil.ipfw.ipv6-flow-id.ipv6fl
Error Message:
atf-check failed; see the output of the test for details
FAILED: sys.netpfil.pf.dup.dup_to
Error Message:
atf-check failed; see the output of the test for details
FAILED: sys.netpfil.pf.ether.bridge_to
Error Message:
atf-check failed; see the output of the test for details
FAILED: sys.netpfil.pf.forward.v4
Error Message:
atf-check failed; see the output of the test for details
FAILED: sys.netpfil.pf.forward.v6
Error Message:
atf-check failed; see the output of the test for details
FAILED: sys.netpfil.pf.fragmentation_compat.overindex
Error Message:
atf-check failed; see the output of the test for details
FAILED: sys.netpfil.pf.fragmentation_compat.overlimit
Error Message:
atf-check failed; see the output of the test for details
FAILED: sys.netpfil.pf.fragmentation_compat.overreplace
Error Message:
atf-check failed; see the output of the test for details
FAILED: sys.netpfil.pf.fragmentation_no_reassembly.compat_override_v4
Error Message:
atf-check failed; see the output of the test for details
FAILED: sys.netpfil.pf.fragmentation_no_reassembly.match_fragment_v4
Error Message:
atf-check failed; see the output of the test for details
FAILED: sys.netpfil.pf.fragmentation_no_reassembly.match_full_v4
Error Message:
atf-check failed; see the output of the test for details
FAILED: sys.netpfil.pf.fragmentation_pass.adjhole
Error Message:
atf-check failed; see the output of the test for details
FAILED: sys.netpfil.pf.fragmentation_pass.dummynet_fragmented
Error Message:
atf-check failed; see the output of the test for details
FAILED: sys.netpfil.pf.fragmentation_pass.no_df
Error Message:
atf-check failed; see the output of the test for details
FAILED: sys.netpfil.pf.fragmentation_pass.overhole
Error Message:
atf-check failed; see the output of the test for details
FAILED: sys.netpfil.pf.fragmentation_pass.overindex
Error Message:
atf-check failed; see the output of the test for details
FAILED: sys.netpfil.pf.fragmentation_pass.overlimit
Error Message:
atf-check failed; see the output of the test for details
FAILED: sys.netpfil.pf.fragmentation_pass.overreplace
Error Message:
atf-check failed; see the output of the test for details
FAILED: sys.netpfil.pf.fragmentation_pass.reassemble_slowpath
Error Message:
atf-check failed; see the output of the test for details
FAILED: sys.netpfil.pf.icmp.cve_2019_5598
Error Message:
atf-check failed; see the output of the test for details
FAILED: sys.netpfil.pf.icmp6.zero_id
Error Message:
atf-check failed; see the output of the test for details
FAILED: sys.netpfil.pf.killstate.gateway
Error Message:
atf-check failed; see the output of the test for details
FAILED: sys.netpfil.pf.killstate.id
Error Message:
atf-check failed; see the output of the test for details
FAILED: sys.netpfil.pf.killstate.interface
Error Message:
atf-check failed; see the output of the test for details
FAILED: sys.netpfil.pf.killstate.key
Error Message:
atf-check failed; see the output of the test for details
FAILED: sys.netpfil.pf.killstate.label
Error Message:
atf-check failed; see the output of the test for details
FAILED: sys.netpfil.pf.killstate.multilabel
Error Message:
atf-check failed; see the output of the test for details
FAILED: sys.netpfil.pf.killstate.nat
Error Message:
atf-check failed; see the output of the test for details
FAILED: sys.netpfil.pf.killstate.src_dst
Error Message:
atf-check failed; see the output of the test for details
FAILED: sys.netpfil.pf.killstate.v4
Error Message:
atf-check failed; see the output of the test for details
FAILED: sys.netpfil.pf.killstate.v6
Error Message:
atf-check failed; see the output of the test for details
FAILED: sys.netpfil.pf.match.allow_opts
Error Message:
atf-check failed; see the output of the test for details
FAILED: sys.netpfil.pf.max_states.max_states
Error Message:
atf-check failed; see the output of the test for details
FAILED: sys.netpfil.pf.modulate.modulate_v4
Error Message:
atf-check failed; see the output of the test for details
FAILED: sys.netpfil.pf.modulate.modulate_v6
Error Message:
atf-check failed; see the output of the test for details
FAILED: sys.netpfil.pf.nat.binat_compat
Error Message:
atf-check failed; see the output of the test for details
FAILED: sys.netpfil.pf.nat.binat_match
Error Message:
atf-check failed; see the output of the test for details
FAILED: sys.netpfil.pf.nat.empty_pool
Error Message:
atf-check failed; see the output of the test for details
FAILED: sys.netpfil.pf.nat.nat_match
Error Message:
atf-check failed; see the output of the test for details
FAILED: sys.netpfil.pf.nat.nat_pass_in
Error Message:
atf-check failed; see the output of the test for details
FAILED: sys.netpfil.pf.nat.nat_pass_out
Error Message:
atf-check failed; see the output of the test for details
FAILED: sys.netpfil.pf.pass_block.urpf
Error Message:
atf-check failed; see the output of the test for details
FAILED: sys.netpfil.pf.pflow.nat
Error Message:
atf-check failed; see the output of the test for details
FAILED: sys.netpfil.pf.pflow.rule
Error Message:
atf-check failed; see the output of the test for details
FAILED: sys.netpfil.pf.pflow.state_defaults
Error Message:
atf-check failed; see the output of the test for details
FAILED: sys.netpfil.pf.pflow.v6
Error Message:
atf-check failed; see the output of the test for details
FAILED: sys.netpfil.pf.pfsync.af_to_in_floating
Error Message:
atf-check failed; see the output of the test for details
FAILED: sys.netpfil.pf.pfsync.af_to_in_if_bound
Error Message:
atf-check failed; see the output of the test for details
FAILED: sys.netpfil.pf.pfsync.af_to_out_if_bound
Error Message:
atf-check failed; see the output of the test for details
FAILED: sys.netpfil.pf.pfsync.defer
Error Message:
atf-check failed; see the output of the test for details
... and 53 other failed tests.