FreeBSD-main-amd64-test - Build #29474 - Still Unstable

From: <jenkins-admin_at_FreeBSD.org>
Date: Sun, 13 Sep 2026 01:07:14 UTC
FreeBSD-main-amd64-test - Build #29474 (243bdaff75853606ce477807e87e4fbcc1decfb1) - Still Unstable

Build information: https://ci.FreeBSD.org/job/FreeBSD-main-amd64-test/29474/
Full change log: https://ci.FreeBSD.org/job/FreeBSD-main-amd64-test/29474/changes
Full build log: https://ci.FreeBSD.org/job/FreeBSD-main-amd64-test/29474/console

Status explanation:
"Unstable" - some tests are suspected being broken by the following changes
"Still Unstable" - the failing test cases have not been fixed by these
                   following changes and this is a notification to note that
                   these changes have not been fully tested by the CI system

Change summaries:
(Those commits are likely but not certainly responsible)

b485d70d4eb233dc0c6a7efbc6c1f42ebc353c50 by pouria:
dhclient(8): Fix dhcpack comment

79e2a46a6afda1b762c75cb308a474c9ed0cda4c by imp:
nvmecontrol: Fix APST transition encoding

baa78c87eb074fa8d9ee5625a6440d35f617e67f by imp:
nvmecontrol: Minor correctness issues

f9517d23746115dfdd7da6d6919e20fe55882e4d by imp:
mpsutil: Better naming form the discovery_status function

bbee544312e730e438c57e4d5777bd0687ea6b77 by imp:
loader.efi: Fix memory leak in efihttp_dev_close

577ea37d6d5cf4ab9fb556f7ec21276db683e600 by imp:
loader.efi: Expose efi_devpath_get_mac to get mac

197df29edb39782464276701f8fd9891793d4979 by imp:
loader.efi: Only try to download md if we're netbooting

6413a870fa0721ac509e38f24d5dd5204c603288 by imp:
loader: Move some support things around, maybe lame?

772c658c66e365f02433a4f57d6a14a8120861eb by imp:
loader: Use %u to print unsigned value

06488d2a121af7a454083670b429d9ec42e77c99 by imp:
linux: LINUX_PR_SET_THP_DISABLE all non-zero values are disable

243bdaff75853606ce477807e87e4fbcc1decfb1 by siva:
lib/googletest: also use -O0 for internal tests with GCC



The failed test cases:

154 tests failed.
FAILED:  sys.netpfil.pf.syncookie.basic_v6

Error Message:
Failed to connect to syncookie protected echo daemon

FAILED:  sys.net.if_lagg_test.witness

Error Message:
Lock-order reversals involving if_lagg.c detected

FAILED:  sys.netinet.udp_bindings.connect_bound_socket_from_2address_jail

Error Message:
/usr/src/tests/sys/netinet/udp_bindings.c:244: connect(s, (struct sockaddr *)&sin, sizeof(sin)) == 0 not met

FAILED:  sbin.ping.ping_test.inject_opts

Error Message:
atf-check failed; see the output of the test for details

FAILED:  sbin.ping.ping_test.inject_pip

Error Message:
atf-check failed; see the output of the test for details

FAILED:  sbin.ping.ping_test.inject_reply

Error Message:
atf-check failed; see the output of the test for details

FAILED:  sys.net.if_bridge_test.span

Error Message:
atf-check failed; see the output of the test for details

FAILED:  sys.net.if_bridge_test.stp_validation

Error Message:
atf-check failed; see the output of the test for details

FAILED:  sys.netinet.divert.ipdivert_ip_input_local_success

Error Message:
atf-check failed; see the output of the test for details

FAILED:  sys.netinet.divert.ipdivert_ip_output_remote_success

Error Message:
atf-check failed; see the output of the test for details

FAILED:  sys.netinet.forward.fwd_ip_icmp_gw_fast_success

Error Message:
atf-check failed; see the output of the test for details

FAILED:  sys.netinet.forward.fwd_ip_icmp_gw_slow_success

Error Message:
atf-check failed; see the output of the test for details

FAILED:  sys.netinet.forward.fwd_ip_icmp_iface_fast_success

Error Message:
atf-check failed; see the output of the test for details

FAILED:  sys.netinet.forward.fwd_ip_icmp_iface_slow_success

Error Message:
atf-check failed; see the output of the test for details

FAILED:  sys.netinet.redirect.valid_redirect

Error Message:
atf-check failed; see the output of the test for details

FAILED:  sys.netinet6.divert.ipdivert_ip6_output_remote_success

Error Message:
atf-check failed; see the output of the test for details

FAILED:  sys.netinet6.exthdr.exthdr

Error Message:
atf-check failed; see the output of the test for details

FAILED:  sys.netinet6.forward6.fwd_ip6_gu_icmp_gw_gu_fast_success

Error Message:
atf-check failed; see the output of the test for details

FAILED:  sys.netinet6.forward6.fwd_ip6_gu_icmp_gw_gu_slow_success

Error Message:
atf-check failed; see the output of the test for details

FAILED:  sys.netinet6.forward6.fwd_ip6_gu_icmp_gw_ll_fast_success

Error Message:
atf-check failed; see the output of the test for details

FAILED:  sys.netinet6.forward6.fwd_ip6_gu_icmp_gw_ll_slow_success

Error Message:
atf-check failed; see the output of the test for details

FAILED:  sys.netinet6.forward6.fwd_ip6_gu_icmp_iface_fast_success

Error Message:
atf-check failed; see the output of the test for details

FAILED:  sys.netinet6.forward6.fwd_ip6_gu_icmp_iface_slow_success

Error Message:
atf-check failed; see the output of the test for details

FAILED:  sys.netinet6.frag6.frag6_02.frag6_02

Error Message:
atf-check failed; see the output of the test for details

FAILED:  sys.netinet6.frag6.frag6_03.frag6_03

Error Message:
atf-check failed; see the output of the test for details

FAILED:  sys.netinet6.frag6.frag6_04.frag6_04

Error Message:
atf-check failed; see the output of the test for details

FAILED:  sys.netinet6.frag6.frag6_05.frag6_05_0

Error Message:
atf-check failed; see the output of the test for details

FAILED:  sys.netinet6.frag6.frag6_05.frag6_05_1

Error Message:
atf-check failed; see the output of the test for details

FAILED:  sys.netinet6.frag6.frag6_06.frag6_06_0

Error Message:
atf-check failed; see the output of the test for details

FAILED:  sys.netinet6.frag6.frag6_07.frag6_07

Error Message:
atf-check failed; see the output of the test for details

FAILED:  sys.netinet6.frag6.frag6_08.frag6_08

Error Message:
atf-check failed; see the output of the test for details

FAILED:  sys.netinet6.frag6.frag6_09.frag6_09

Error Message:
atf-check failed; see the output of the test for details

FAILED:  sys.netinet6.frag6.frag6_10.frag6_10

Error Message:
atf-check failed; see the output of the test for details

FAILED:  sys.netinet6.frag6.frag6_11.frag6_11

Error Message:
atf-check failed; see the output of the test for details

FAILED:  sys.netinet6.frag6.frag6_12.frag6_12

Error Message:
atf-check failed; see the output of the test for details

FAILED:  sys.netinet6.frag6.frag6_13.frag6_13

Error Message:
atf-check failed; see the output of the test for details

FAILED:  sys.netinet6.frag6.frag6_14.frag6_14

Error Message:
atf-check failed; see the output of the test for details

FAILED:  sys.netinet6.frag6.frag6_15.frag6_15

Error Message:
atf-check failed; see the output of the test for details

FAILED:  sys.netinet6.frag6.frag6_16.frag6_16

Error Message:
atf-check failed; see the output of the test for details

FAILED:  sys.netinet6.frag6.frag6_17.frag6_17

Error Message:
atf-check failed; see the output of the test for details

FAILED:  sys.netinet6.frag6.frag6_18.frag6_18

Error Message:
atf-check failed; see the output of the test for details

FAILED:  sys.netinet6.frag6.frag6_19.frag6_19

Error Message:
atf-check failed; see the output of the test for details

FAILED:  sys.netinet6.frag6.frag6_20.frag6_20

Error Message:
atf-check failed; see the output of the test for details

FAILED:  sys.netinet6.mld.mldraw01

Error Message:
atf-check failed; see the output of the test for details

FAILED:  sys.netinet6.redirect.valid_redirect

Error Message:
atf-check failed; see the output of the test for details

FAILED:  sys.netinet6.scapyi386.scapyi386

Error Message:
atf-check failed; see the output of the test for details

FAILED:  sys.netpfil.common.forward.ipf_v4

Error Message:
atf-check failed; see the output of the test for details

FAILED:  sys.netpfil.common.forward.ipfw_v4

Error Message:
atf-check failed; see the output of the test for details

FAILED:  sys.netpfil.common.forward.pf_v4

Error Message:
atf-check failed; see the output of the test for details

FAILED:  sys.netpfil.common.tos.ipfw_tos

Error Message:
atf-check failed; see the output of the test for details

FAILED:  sys.netpfil.common.tos.pf_tos

Error Message:
atf-check failed; see the output of the test for details

FAILED:  sys.netpfil.ipfw.ipv6-flow-id.ipv6fl

Error Message:
atf-check failed; see the output of the test for details

FAILED:  sys.netpfil.pf.dup.dup_to

Error Message:
atf-check failed; see the output of the test for details

FAILED:  sys.netpfil.pf.ether.bridge_to

Error Message:
atf-check failed; see the output of the test for details

FAILED:  sys.netpfil.pf.forward.v4

Error Message:
atf-check failed; see the output of the test for details

FAILED:  sys.netpfil.pf.forward.v6

Error Message:
atf-check failed; see the output of the test for details

FAILED:  sys.netpfil.pf.fragmentation_compat.overindex

Error Message:
atf-check failed; see the output of the test for details

FAILED:  sys.netpfil.pf.fragmentation_compat.overlimit

Error Message:
atf-check failed; see the output of the test for details

FAILED:  sys.netpfil.pf.fragmentation_compat.overreplace

Error Message:
atf-check failed; see the output of the test for details

FAILED:  sys.netpfil.pf.fragmentation_no_reassembly.compat_override_v4

Error Message:
atf-check failed; see the output of the test for details

FAILED:  sys.netpfil.pf.fragmentation_no_reassembly.match_fragment_v4

Error Message:
atf-check failed; see the output of the test for details

FAILED:  sys.netpfil.pf.fragmentation_no_reassembly.match_full_v4

Error Message:
atf-check failed; see the output of the test for details

FAILED:  sys.netpfil.pf.fragmentation_pass.adjhole

Error Message:
atf-check failed; see the output of the test for details

FAILED:  sys.netpfil.pf.fragmentation_pass.dummynet_fragmented

Error Message:
atf-check failed; see the output of the test for details

FAILED:  sys.netpfil.pf.fragmentation_pass.no_df

Error Message:
atf-check failed; see the output of the test for details

FAILED:  sys.netpfil.pf.fragmentation_pass.overhole

Error Message:
atf-check failed; see the output of the test for details

FAILED:  sys.netpfil.pf.fragmentation_pass.overindex

Error Message:
atf-check failed; see the output of the test for details

FAILED:  sys.netpfil.pf.fragmentation_pass.overlimit

Error Message:
atf-check failed; see the output of the test for details

FAILED:  sys.netpfil.pf.fragmentation_pass.overreplace

Error Message:
atf-check failed; see the output of the test for details

FAILED:  sys.netpfil.pf.fragmentation_pass.reassemble_slowpath

Error Message:
atf-check failed; see the output of the test for details

FAILED:  sys.netpfil.pf.icmp.cve_2019_5598

Error Message:
atf-check failed; see the output of the test for details

FAILED:  sys.netpfil.pf.icmp6.zero_id

Error Message:
atf-check failed; see the output of the test for details

FAILED:  sys.netpfil.pf.killstate.gateway

Error Message:
atf-check failed; see the output of the test for details

FAILED:  sys.netpfil.pf.killstate.id

Error Message:
atf-check failed; see the output of the test for details

FAILED:  sys.netpfil.pf.killstate.interface

Error Message:
atf-check failed; see the output of the test for details

FAILED:  sys.netpfil.pf.killstate.key

Error Message:
atf-check failed; see the output of the test for details

FAILED:  sys.netpfil.pf.killstate.label

Error Message:
atf-check failed; see the output of the test for details

FAILED:  sys.netpfil.pf.killstate.multilabel

Error Message:
atf-check failed; see the output of the test for details

FAILED:  sys.netpfil.pf.killstate.nat

Error Message:
atf-check failed; see the output of the test for details

FAILED:  sys.netpfil.pf.killstate.src_dst

Error Message:
atf-check failed; see the output of the test for details

FAILED:  sys.netpfil.pf.killstate.v4

Error Message:
atf-check failed; see the output of the test for details

FAILED:  sys.netpfil.pf.killstate.v6

Error Message:
atf-check failed; see the output of the test for details

FAILED:  sys.netpfil.pf.match.allow_opts

Error Message:
atf-check failed; see the output of the test for details

FAILED:  sys.netpfil.pf.max_states.max_states

Error Message:
atf-check failed; see the output of the test for details

FAILED:  sys.netpfil.pf.modulate.modulate_v4

Error Message:
atf-check failed; see the output of the test for details

FAILED:  sys.netpfil.pf.modulate.modulate_v6

Error Message:
atf-check failed; see the output of the test for details

FAILED:  sys.netpfil.pf.nat.binat_compat

Error Message:
atf-check failed; see the output of the test for details

FAILED:  sys.netpfil.pf.nat.binat_match

Error Message:
atf-check failed; see the output of the test for details

FAILED:  sys.netpfil.pf.nat.empty_pool

Error Message:
atf-check failed; see the output of the test for details

FAILED:  sys.netpfil.pf.nat.nat_match

Error Message:
atf-check failed; see the output of the test for details

FAILED:  sys.netpfil.pf.nat.nat_pass_in

Error Message:
atf-check failed; see the output of the test for details

FAILED:  sys.netpfil.pf.nat.nat_pass_out

Error Message:
atf-check failed; see the output of the test for details

FAILED:  sys.netpfil.pf.pass_block.urpf

Error Message:
atf-check failed; see the output of the test for details

FAILED:  sys.netpfil.pf.pflow.nat

Error Message:
atf-check failed; see the output of the test for details

FAILED:  sys.netpfil.pf.pflow.rule

Error Message:
atf-check failed; see the output of the test for details

FAILED:  sys.netpfil.pf.pflow.state_defaults

Error Message:
atf-check failed; see the output of the test for details

FAILED:  sys.netpfil.pf.pflow.v6

Error Message:
atf-check failed; see the output of the test for details

FAILED:  sys.netpfil.pf.pfsync.af_to_in_floating

Error Message:
atf-check failed; see the output of the test for details

FAILED:  sys.netpfil.pf.pfsync.af_to_in_if_bound

Error Message:
atf-check failed; see the output of the test for details

FAILED:  sys.netpfil.pf.pfsync.af_to_out_if_bound

Error Message:
atf-check failed; see the output of the test for details

... and 54 other failed tests.