FreeBSD-main-amd64-test - Build #29468 - Still Unstable
Date: Sat, 12 Sep 2026 05:48:53 UTC
FreeBSD-main-amd64-test - Build #29468 (de5fcd16650207f6f2e7c50afd1ebbaeb36612c7) - Still Unstable
Build information: https://ci.FreeBSD.org/job/FreeBSD-main-amd64-test/29468/
Full change log: https://ci.FreeBSD.org/job/FreeBSD-main-amd64-test/29468/changes
Full build log: https://ci.FreeBSD.org/job/FreeBSD-main-amd64-test/29468/console
Status explanation:
"Unstable" - some tests are suspected being broken by the following changes
"Still Unstable" - the failing test cases have not been fixed by these
following changes and this is a notification to note that
these changes have not been fully tested by the CI system
Change summaries:
(Those commits are likely but not certainly responsible)
b7e91f238c2f70e8432f56762499aebd0ab9960b by siva:
sctp: remove unused variable
d8e315ba975163a2050dd3d3e193f2472dbc2478 by wulf:
hid: Add Sony DualSense gamepad driver
0d022baa047aea6499e394d2cd8d097820ecf486 by wulf:
LinuxKPI: Run irq_work callbacks under RCU protection
16246209d25ac437494ebe92b9819a65f1336594 by gbe:
arpa/telnet: Fix a typo in a source code comment
8255ae9a750f6de312f9b445c25b1c8caf3d95b7 by gbe:
sys/kern: Fix a typo in a source code comment
26248c370fade359e5303094fb57102d7fcc9c78 by netchild:
if_bridge: pull up only the headers bridge_pfil() inspects
8209ceeb7504417c49fae77de4c77286eccb8746 by netchild:
if_bridge: count the drops on the fragmentation path
b08e6a3882b44a09fbda84dd315a431c7a585219 by kib:
lib/msun: use the same algorithm for sw fmaf(3) as for fma(3)
cb82cc9f0e3bdf2b39734851c74b9a13edb0cbdc by kib:
lib/msun: add tests for fmaf(3) subnormals
fb8fcd4bff36d620d00fc20903379fb9ee844c57 by kbowling:
iflib: Track queue datapath lifecycle
2b2cc52236f462f1ca2b86581c8115252fb1a834 by kbowling:
iflib: Own queue quiescence during power transitions
62dd064b03dfe04b727e7d1fdea17eb165b52e9c by kbowling:
iflib: Reject media changes during suspend
45dc4a13654c5e90bcf5f757e46f1353b30848ee by kbowling:
ixgbe: Pause firmware recovery polling in low power
f496cd95cf9e1ed68b0df3ae2f7a24fc0f66aa6b by kbowling:
iflibdd(9): Clarify resume during suspend rollback
99eaf07a3cef77e61423e9431c0a8c5fd4d4be58 by kbowling:
vmxnet3: Propagate device-enable failure to iflib
372803d65d242b308abd6b312a40ff6987fc3452 by kbowling:
ixl: Set critical-error state bits independently
33be59b660befb13cdcc38e52b1c9b4119a6a069 by kbowling:
ice: Use the mirror interface softc in PF callbacks
3a4e037989f91672974eeedf1fa81ce0b684beb7 by kbowling:
ixgbe: Leave run-state publication to iflib during FDIR recovery
d9c798b9fcc9c559e5d12a21fdca3eb226f53edf by jhibbits:
powerpc/booke64: Remove unused pmap global
ef5bc5a1160e88267d14afed1df321cf4d5c35f9 by philip:
Import tzdata 2026d
fc3eca391341f1d354340ef41e059c0fce6afa8e by jhibbits:
powerpmac_thermal: Improve thermal regulation on G5 quad models
2e01f5bf9813d67d33e8ca095e22952c0193e3b7 by vexeduxr:
rtwn: add ID for the Edimax EW-7611ULB
4f9de24ae98384fced8114a4ee331c87e90ca814 by jhibbits:
dpaa/fman: Clean up port config code
de5fcd16650207f6f2e7c50afd1ebbaeb36612c7 by jhibbits:
powerpc/booke: Add a machine check stack
The failed test cases:
154 tests failed.
FAILED: sys.net.if_lagg_test.witness
Error Message:
Lock-order reversals involving if_lagg.c detected
FAILED: sys.netinet6.ndp.ndp_prefix_lifetime
Error Message:
atf-check failed; see the output of the test for details
FAILED: sys.netinet.udp_bindings.connect_bound_socket_from_2address_jail
Error Message:
/usr/src/tests/sys/netinet/udp_bindings.c:244: connect(s, (struct sockaddr *)&sin, sizeof(sin)) == 0 not met
FAILED: sbin.ping.ping_test.inject_opts
Error Message:
atf-check failed; see the output of the test for details
FAILED: sbin.ping.ping_test.inject_pip
Error Message:
atf-check failed; see the output of the test for details
FAILED: sbin.ping.ping_test.inject_reply
Error Message:
atf-check failed; see the output of the test for details
FAILED: sys.net.if_bridge_test.span
Error Message:
atf-check failed; see the output of the test for details
FAILED: sys.net.if_bridge_test.stp_validation
Error Message:
atf-check failed; see the output of the test for details
FAILED: sys.netinet.divert.ipdivert_ip_input_local_success
Error Message:
atf-check failed; see the output of the test for details
FAILED: sys.netinet.divert.ipdivert_ip_output_remote_success
Error Message:
atf-check failed; see the output of the test for details
FAILED: sys.netinet.forward.fwd_ip_icmp_gw_fast_success
Error Message:
atf-check failed; see the output of the test for details
FAILED: sys.netinet.forward.fwd_ip_icmp_gw_slow_success
Error Message:
atf-check failed; see the output of the test for details
FAILED: sys.netinet.forward.fwd_ip_icmp_iface_fast_success
Error Message:
atf-check failed; see the output of the test for details
FAILED: sys.netinet.forward.fwd_ip_icmp_iface_slow_success
Error Message:
atf-check failed; see the output of the test for details
FAILED: sys.netinet.redirect.valid_redirect
Error Message:
atf-check failed; see the output of the test for details
FAILED: sys.netinet6.divert.ipdivert_ip6_output_remote_success
Error Message:
atf-check failed; see the output of the test for details
FAILED: sys.netinet6.exthdr.exthdr
Error Message:
atf-check failed; see the output of the test for details
FAILED: sys.netinet6.forward6.fwd_ip6_gu_icmp_gw_gu_fast_success
Error Message:
atf-check failed; see the output of the test for details
FAILED: sys.netinet6.forward6.fwd_ip6_gu_icmp_gw_gu_slow_success
Error Message:
atf-check failed; see the output of the test for details
FAILED: sys.netinet6.forward6.fwd_ip6_gu_icmp_gw_ll_fast_success
Error Message:
atf-check failed; see the output of the test for details
FAILED: sys.netinet6.forward6.fwd_ip6_gu_icmp_gw_ll_slow_success
Error Message:
atf-check failed; see the output of the test for details
FAILED: sys.netinet6.forward6.fwd_ip6_gu_icmp_iface_fast_success
Error Message:
atf-check failed; see the output of the test for details
FAILED: sys.netinet6.forward6.fwd_ip6_gu_icmp_iface_slow_success
Error Message:
atf-check failed; see the output of the test for details
FAILED: sys.netinet6.frag6.frag6_02.frag6_02
Error Message:
atf-check failed; see the output of the test for details
FAILED: sys.netinet6.frag6.frag6_03.frag6_03
Error Message:
atf-check failed; see the output of the test for details
FAILED: sys.netinet6.frag6.frag6_04.frag6_04
Error Message:
atf-check failed; see the output of the test for details
FAILED: sys.netinet6.frag6.frag6_05.frag6_05_0
Error Message:
atf-check failed; see the output of the test for details
FAILED: sys.netinet6.frag6.frag6_05.frag6_05_1
Error Message:
atf-check failed; see the output of the test for details
FAILED: sys.netinet6.frag6.frag6_06.frag6_06_0
Error Message:
atf-check failed; see the output of the test for details
FAILED: sys.netinet6.frag6.frag6_07.frag6_07
Error Message:
atf-check failed; see the output of the test for details
FAILED: sys.netinet6.frag6.frag6_08.frag6_08
Error Message:
atf-check failed; see the output of the test for details
FAILED: sys.netinet6.frag6.frag6_09.frag6_09
Error Message:
atf-check failed; see the output of the test for details
FAILED: sys.netinet6.frag6.frag6_10.frag6_10
Error Message:
atf-check failed; see the output of the test for details
FAILED: sys.netinet6.frag6.frag6_11.frag6_11
Error Message:
atf-check failed; see the output of the test for details
FAILED: sys.netinet6.frag6.frag6_12.frag6_12
Error Message:
atf-check failed; see the output of the test for details
FAILED: sys.netinet6.frag6.frag6_13.frag6_13
Error Message:
atf-check failed; see the output of the test for details
FAILED: sys.netinet6.frag6.frag6_14.frag6_14
Error Message:
atf-check failed; see the output of the test for details
FAILED: sys.netinet6.frag6.frag6_15.frag6_15
Error Message:
atf-check failed; see the output of the test for details
FAILED: sys.netinet6.frag6.frag6_16.frag6_16
Error Message:
atf-check failed; see the output of the test for details
FAILED: sys.netinet6.frag6.frag6_17.frag6_17
Error Message:
atf-check failed; see the output of the test for details
FAILED: sys.netinet6.frag6.frag6_18.frag6_18
Error Message:
atf-check failed; see the output of the test for details
FAILED: sys.netinet6.frag6.frag6_19.frag6_19
Error Message:
atf-check failed; see the output of the test for details
FAILED: sys.netinet6.frag6.frag6_20.frag6_20
Error Message:
atf-check failed; see the output of the test for details
FAILED: sys.netinet6.mld.mldraw01
Error Message:
atf-check failed; see the output of the test for details
FAILED: sys.netinet6.redirect.valid_redirect
Error Message:
atf-check failed; see the output of the test for details
FAILED: sys.netinet6.scapyi386.scapyi386
Error Message:
atf-check failed; see the output of the test for details
FAILED: sys.netpfil.common.forward.ipf_v4
Error Message:
atf-check failed; see the output of the test for details
FAILED: sys.netpfil.common.forward.ipfw_v4
Error Message:
atf-check failed; see the output of the test for details
FAILED: sys.netpfil.common.forward.pf_v4
Error Message:
atf-check failed; see the output of the test for details
FAILED: sys.netpfil.common.tos.ipfw_tos
Error Message:
atf-check failed; see the output of the test for details
FAILED: sys.netpfil.common.tos.pf_tos
Error Message:
atf-check failed; see the output of the test for details
FAILED: sys.netpfil.ipfw.ipv6-flow-id.ipv6fl
Error Message:
atf-check failed; see the output of the test for details
FAILED: sys.netpfil.pf.dup.dup_to
Error Message:
atf-check failed; see the output of the test for details
FAILED: sys.netpfil.pf.ether.bridge_to
Error Message:
atf-check failed; see the output of the test for details
FAILED: sys.netpfil.pf.forward.v4
Error Message:
atf-check failed; see the output of the test for details
FAILED: sys.netpfil.pf.forward.v6
Error Message:
atf-check failed; see the output of the test for details
FAILED: sys.netpfil.pf.fragmentation_compat.overindex
Error Message:
atf-check failed; see the output of the test for details
FAILED: sys.netpfil.pf.fragmentation_compat.overlimit
Error Message:
atf-check failed; see the output of the test for details
FAILED: sys.netpfil.pf.fragmentation_compat.overreplace
Error Message:
atf-check failed; see the output of the test for details
FAILED: sys.netpfil.pf.fragmentation_no_reassembly.compat_override_v4
Error Message:
atf-check failed; see the output of the test for details
FAILED: sys.netpfil.pf.fragmentation_no_reassembly.match_fragment_v4
Error Message:
atf-check failed; see the output of the test for details
FAILED: sys.netpfil.pf.fragmentation_no_reassembly.match_full_v4
Error Message:
atf-check failed; see the output of the test for details
FAILED: sys.netpfil.pf.fragmentation_pass.adjhole
Error Message:
atf-check failed; see the output of the test for details
FAILED: sys.netpfil.pf.fragmentation_pass.dummynet_fragmented
Error Message:
atf-check failed; see the output of the test for details
FAILED: sys.netpfil.pf.fragmentation_pass.no_df
Error Message:
atf-check failed; see the output of the test for details
FAILED: sys.netpfil.pf.fragmentation_pass.overhole
Error Message:
atf-check failed; see the output of the test for details
FAILED: sys.netpfil.pf.fragmentation_pass.overindex
Error Message:
atf-check failed; see the output of the test for details
FAILED: sys.netpfil.pf.fragmentation_pass.overlimit
Error Message:
atf-check failed; see the output of the test for details
FAILED: sys.netpfil.pf.fragmentation_pass.overreplace
Error Message:
atf-check failed; see the output of the test for details
FAILED: sys.netpfil.pf.fragmentation_pass.reassemble_slowpath
Error Message:
atf-check failed; see the output of the test for details
FAILED: sys.netpfil.pf.icmp.cve_2019_5598
Error Message:
atf-check failed; see the output of the test for details
FAILED: sys.netpfil.pf.icmp6.zero_id
Error Message:
atf-check failed; see the output of the test for details
FAILED: sys.netpfil.pf.killstate.gateway
Error Message:
atf-check failed; see the output of the test for details
FAILED: sys.netpfil.pf.killstate.id
Error Message:
atf-check failed; see the output of the test for details
FAILED: sys.netpfil.pf.killstate.interface
Error Message:
atf-check failed; see the output of the test for details
FAILED: sys.netpfil.pf.killstate.key
Error Message:
atf-check failed; see the output of the test for details
FAILED: sys.netpfil.pf.killstate.label
Error Message:
atf-check failed; see the output of the test for details
FAILED: sys.netpfil.pf.killstate.multilabel
Error Message:
atf-check failed; see the output of the test for details
FAILED: sys.netpfil.pf.killstate.nat
Error Message:
atf-check failed; see the output of the test for details
FAILED: sys.netpfil.pf.killstate.src_dst
Error Message:
atf-check failed; see the output of the test for details
FAILED: sys.netpfil.pf.killstate.v4
Error Message:
atf-check failed; see the output of the test for details
FAILED: sys.netpfil.pf.killstate.v6
Error Message:
atf-check failed; see the output of the test for details
FAILED: sys.netpfil.pf.match.allow_opts
Error Message:
atf-check failed; see the output of the test for details
FAILED: sys.netpfil.pf.max_states.max_states
Error Message:
atf-check failed; see the output of the test for details
FAILED: sys.netpfil.pf.modulate.modulate_v4
Error Message:
atf-check failed; see the output of the test for details
FAILED: sys.netpfil.pf.modulate.modulate_v6
Error Message:
atf-check failed; see the output of the test for details
FAILED: sys.netpfil.pf.nat.binat_compat
Error Message:
atf-check failed; see the output of the test for details
FAILED: sys.netpfil.pf.nat.binat_match
Error Message:
atf-check failed; see the output of the test for details
FAILED: sys.netpfil.pf.nat.empty_pool
Error Message:
atf-check failed; see the output of the test for details
FAILED: sys.netpfil.pf.nat.nat_match
Error Message:
atf-check failed; see the output of the test for details
FAILED: sys.netpfil.pf.nat.nat_pass_in
Error Message:
atf-check failed; see the output of the test for details
FAILED: sys.netpfil.pf.nat.nat_pass_out
Error Message:
atf-check failed; see the output of the test for details
FAILED: sys.netpfil.pf.pass_block.urpf
Error Message:
atf-check failed; see the output of the test for details
FAILED: sys.netpfil.pf.pflow.nat
Error Message:
atf-check failed; see the output of the test for details
FAILED: sys.netpfil.pf.pflow.rule
Error Message:
atf-check failed; see the output of the test for details
FAILED: sys.netpfil.pf.pflow.state_defaults
Error Message:
atf-check failed; see the output of the test for details
FAILED: sys.netpfil.pf.pflow.v6
Error Message:
atf-check failed; see the output of the test for details
FAILED: sys.netpfil.pf.pfsync.af_to_in_floating
Error Message:
atf-check failed; see the output of the test for details
FAILED: sys.netpfil.pf.pfsync.af_to_in_if_bound
Error Message:
atf-check failed; see the output of the test for details
FAILED: sys.netpfil.pf.pfsync.af_to_out_if_bound
Error Message:
atf-check failed; see the output of the test for details
... and 54 other failed tests.