FreeBSD-main-amd64-test - Build #29461 - Still Unstable

From: <jenkins-admin_at_FreeBSD.org>
Date: Fri, 11 Sep 2026 11:09:23 UTC
FreeBSD-main-amd64-test - Build #29461 (8821d42d8be4c2dcf1f70a3ccc96a9c37bd85172) - Still Unstable

Build information: https://ci.FreeBSD.org/job/FreeBSD-main-amd64-test/29461/
Full change log: https://ci.FreeBSD.org/job/FreeBSD-main-amd64-test/29461/changes
Full build log: https://ci.FreeBSD.org/job/FreeBSD-main-amd64-test/29461/console

Status explanation:
"Unstable" - some tests are suspected being broken by the following changes
"Still Unstable" - the failing test cases have not been fixed by these
                   following changes and this is a notification to note that
                   these changes have not been fully tested by the CI system

Change summaries:
(Those commits are likely but not certainly responsible)

6b92093fdf65a80cba01af74710bdfe7ac7ef252 by vexeduxr:
ig4: Add Lunar Lake-M I2C controllers 4 and 5

1256447cbc21361ff5a6f9022b58ad6c1c43e59f by seuros:
jail: define well-known parameter names in sys/jail.h

d4820dc1e6cb9ec9d8d3ef030f143c69f92228cd by dumbbell:
linuxkpi: Add `int_sqrt()`

9ae680fcfd36e03547ffc7989c80dcbaac200556 by seuros:
libjail, jls(8), jail(8): use the JAIL_PARAM_* constants

542df51903ae57c5a5f271949a45ebcb1362d9b1 by obiwac:
acpi_spmc: Make sure constraints array doesn't end up sparse

8fae9294d6ba714000611d1dd2263fdaf528ad62 by imp:
loader: Allow this to compile w/o MD_IMAGE_SIZE defined

4f7475ab5b3f78300b5357a3ee53cd09e03efb7c by imp:
loader: Small tweak to how md is configured

7055aa7a070fa98fa3a7e1efaab0b07d68a08975 by imp:
loader: Move ramdisk export to md.c

752bde7da6ad11b53af82f81d44e0ae2729c56d7 by imp:
loader: Allow dynmaic creation of MD disks

69d1595ded957137ee103a385ca4056cc1d30d5a by imp:
loader.efi: Move probing the md up to before doing bootmgr

96b1e04a747fef17cb660f62ca7cf6d0e365549c by imp:
loader: Add md support

f1163b9436b750f6d141e3db72e9000f9cf8b5e4 by imp:
loader.efi: For ipxe booting, fall back to md when ramdisk fails

7208b3b845a6fca40099a4eab0d86afc2fb84aa7 by imp:
libsa: Add a generic URI-syntax devspec parser

6788e42d53c60904943a1db11bdb27b8f9d2bb4c by imp:
stand/efihttp: Support arbitrary http[N]://host[:port]/path devspecs

a098fd021e517df930d8df0ac3a808d63c24252b by imp:
loader: request DHCP initmd option

e6b997c73c41dd8cf42afbc86215fe9c312d5096 by imp:
loader: add standalone network configuration

5bbd617cc5fe10949a856e7f75cd616c24b3438b by imp:
loader.efi: release SNP after network configuration

25b58eb37a7971f94f61f3a001b0d2c47228f08e by imp:
loader.efi: download md images through file API

d48e9bff8c0216e66c5d789266c8800dc18d51e0 by imp:
loader.efi: fetch initmd specified by DHCP

6de311d309dadee0d66e7f1533c254a44b9b5635 by imp:
loader.efi: download DHCP initmd specified image

08265d5edef168d8ad493b975ef184336a022927 by imp:
loader: Fix starting typo

0ca12047beb97f3e8dd19d272bafeea045b27252 by imp:
loader.efi: Eat the character used to break to OK

8821d42d8be4c2dcf1f70a3ccc96a9c37bd85172 by imp:
loader.efi: Allow downloading of ramdisk or md to be aborted



The failed test cases:

152 tests failed.
FAILED:  sys.netinet.udp_bindings.connect_bound_socket_from_2address_jail

Error Message:
/usr/src/tests/sys/netinet/udp_bindings.c:244: connect(s, (struct sockaddr *)&sin, sizeof(sin)) == 0 not met

FAILED:  sbin.ping.ping_test.inject_opts

Error Message:
atf-check failed; see the output of the test for details

FAILED:  sbin.ping.ping_test.inject_pip

Error Message:
atf-check failed; see the output of the test for details

FAILED:  sbin.ping.ping_test.inject_reply

Error Message:
atf-check failed; see the output of the test for details

FAILED:  sys.net.if_bridge_test.span

Error Message:
atf-check failed; see the output of the test for details

FAILED:  sys.net.if_bridge_test.stp_validation

Error Message:
atf-check failed; see the output of the test for details

FAILED:  sys.netinet.divert.ipdivert_ip_input_local_success

Error Message:
atf-check failed; see the output of the test for details

FAILED:  sys.netinet.divert.ipdivert_ip_output_remote_success

Error Message:
atf-check failed; see the output of the test for details

FAILED:  sys.netinet.forward.fwd_ip_icmp_gw_fast_success

Error Message:
atf-check failed; see the output of the test for details

FAILED:  sys.netinet.forward.fwd_ip_icmp_gw_slow_success

Error Message:
atf-check failed; see the output of the test for details

FAILED:  sys.netinet.forward.fwd_ip_icmp_iface_fast_success

Error Message:
atf-check failed; see the output of the test for details

FAILED:  sys.netinet.forward.fwd_ip_icmp_iface_slow_success

Error Message:
atf-check failed; see the output of the test for details

FAILED:  sys.netinet.redirect.valid_redirect

Error Message:
atf-check failed; see the output of the test for details

FAILED:  sys.netinet6.divert.ipdivert_ip6_output_remote_success

Error Message:
atf-check failed; see the output of the test for details

FAILED:  sys.netinet6.exthdr.exthdr

Error Message:
atf-check failed; see the output of the test for details

FAILED:  sys.netinet6.forward6.fwd_ip6_gu_icmp_gw_gu_fast_success

Error Message:
atf-check failed; see the output of the test for details

FAILED:  sys.netinet6.forward6.fwd_ip6_gu_icmp_gw_gu_slow_success

Error Message:
atf-check failed; see the output of the test for details

FAILED:  sys.netinet6.forward6.fwd_ip6_gu_icmp_gw_ll_fast_success

Error Message:
atf-check failed; see the output of the test for details

FAILED:  sys.netinet6.forward6.fwd_ip6_gu_icmp_gw_ll_slow_success

Error Message:
atf-check failed; see the output of the test for details

FAILED:  sys.netinet6.forward6.fwd_ip6_gu_icmp_iface_fast_success

Error Message:
atf-check failed; see the output of the test for details

FAILED:  sys.netinet6.forward6.fwd_ip6_gu_icmp_iface_slow_success

Error Message:
atf-check failed; see the output of the test for details

FAILED:  sys.netinet6.frag6.frag6_02.frag6_02

Error Message:
atf-check failed; see the output of the test for details

FAILED:  sys.netinet6.frag6.frag6_03.frag6_03

Error Message:
atf-check failed; see the output of the test for details

FAILED:  sys.netinet6.frag6.frag6_04.frag6_04

Error Message:
atf-check failed; see the output of the test for details

FAILED:  sys.netinet6.frag6.frag6_05.frag6_05_0

Error Message:
atf-check failed; see the output of the test for details

FAILED:  sys.netinet6.frag6.frag6_05.frag6_05_1

Error Message:
atf-check failed; see the output of the test for details

FAILED:  sys.netinet6.frag6.frag6_06.frag6_06_0

Error Message:
atf-check failed; see the output of the test for details

FAILED:  sys.netinet6.frag6.frag6_07.frag6_07

Error Message:
atf-check failed; see the output of the test for details

FAILED:  sys.netinet6.frag6.frag6_08.frag6_08

Error Message:
atf-check failed; see the output of the test for details

FAILED:  sys.netinet6.frag6.frag6_09.frag6_09

Error Message:
atf-check failed; see the output of the test for details

FAILED:  sys.netinet6.frag6.frag6_10.frag6_10

Error Message:
atf-check failed; see the output of the test for details

FAILED:  sys.netinet6.frag6.frag6_11.frag6_11

Error Message:
atf-check failed; see the output of the test for details

FAILED:  sys.netinet6.frag6.frag6_12.frag6_12

Error Message:
atf-check failed; see the output of the test for details

FAILED:  sys.netinet6.frag6.frag6_13.frag6_13

Error Message:
atf-check failed; see the output of the test for details

FAILED:  sys.netinet6.frag6.frag6_14.frag6_14

Error Message:
atf-check failed; see the output of the test for details

FAILED:  sys.netinet6.frag6.frag6_15.frag6_15

Error Message:
atf-check failed; see the output of the test for details

FAILED:  sys.netinet6.frag6.frag6_16.frag6_16

Error Message:
atf-check failed; see the output of the test for details

FAILED:  sys.netinet6.frag6.frag6_17.frag6_17

Error Message:
atf-check failed; see the output of the test for details

FAILED:  sys.netinet6.frag6.frag6_18.frag6_18

Error Message:
atf-check failed; see the output of the test for details

FAILED:  sys.netinet6.frag6.frag6_19.frag6_19

Error Message:
atf-check failed; see the output of the test for details

FAILED:  sys.netinet6.frag6.frag6_20.frag6_20

Error Message:
atf-check failed; see the output of the test for details

FAILED:  sys.netinet6.mld.mldraw01

Error Message:
atf-check failed; see the output of the test for details

FAILED:  sys.netinet6.redirect.valid_redirect

Error Message:
atf-check failed; see the output of the test for details

FAILED:  sys.netinet6.scapyi386.scapyi386

Error Message:
atf-check failed; see the output of the test for details

FAILED:  sys.netpfil.common.forward.ipf_v4

Error Message:
atf-check failed; see the output of the test for details

FAILED:  sys.netpfil.common.forward.ipfw_v4

Error Message:
atf-check failed; see the output of the test for details

FAILED:  sys.netpfil.common.forward.pf_v4

Error Message:
atf-check failed; see the output of the test for details

FAILED:  sys.netpfil.common.tos.ipfw_tos

Error Message:
atf-check failed; see the output of the test for details

FAILED:  sys.netpfil.common.tos.pf_tos

Error Message:
atf-check failed; see the output of the test for details

FAILED:  sys.netpfil.ipfw.ipv6-flow-id.ipv6fl

Error Message:
atf-check failed; see the output of the test for details

FAILED:  sys.netpfil.pf.dup.dup_to

Error Message:
atf-check failed; see the output of the test for details

FAILED:  sys.netpfil.pf.ether.bridge_to

Error Message:
atf-check failed; see the output of the test for details

FAILED:  sys.netpfil.pf.forward.v4

Error Message:
atf-check failed; see the output of the test for details

FAILED:  sys.netpfil.pf.forward.v6

Error Message:
atf-check failed; see the output of the test for details

FAILED:  sys.netpfil.pf.fragmentation_compat.overindex

Error Message:
atf-check failed; see the output of the test for details

FAILED:  sys.netpfil.pf.fragmentation_compat.overlimit

Error Message:
atf-check failed; see the output of the test for details

FAILED:  sys.netpfil.pf.fragmentation_compat.overreplace

Error Message:
atf-check failed; see the output of the test for details

FAILED:  sys.netpfil.pf.fragmentation_no_reassembly.compat_override_v4

Error Message:
atf-check failed; see the output of the test for details

FAILED:  sys.netpfil.pf.fragmentation_no_reassembly.match_fragment_v4

Error Message:
atf-check failed; see the output of the test for details

FAILED:  sys.netpfil.pf.fragmentation_no_reassembly.match_full_v4

Error Message:
atf-check failed; see the output of the test for details

FAILED:  sys.netpfil.pf.fragmentation_pass.adjhole

Error Message:
atf-check failed; see the output of the test for details

FAILED:  sys.netpfil.pf.fragmentation_pass.dummynet_fragmented

Error Message:
atf-check failed; see the output of the test for details

FAILED:  sys.netpfil.pf.fragmentation_pass.no_df

Error Message:
atf-check failed; see the output of the test for details

FAILED:  sys.netpfil.pf.fragmentation_pass.overhole

Error Message:
atf-check failed; see the output of the test for details

FAILED:  sys.netpfil.pf.fragmentation_pass.overindex

Error Message:
atf-check failed; see the output of the test for details

FAILED:  sys.netpfil.pf.fragmentation_pass.overlimit

Error Message:
atf-check failed; see the output of the test for details

FAILED:  sys.netpfil.pf.fragmentation_pass.overreplace

Error Message:
atf-check failed; see the output of the test for details

FAILED:  sys.netpfil.pf.fragmentation_pass.reassemble_slowpath

Error Message:
atf-check failed; see the output of the test for details

FAILED:  sys.netpfil.pf.icmp.cve_2019_5598

Error Message:
atf-check failed; see the output of the test for details

FAILED:  sys.netpfil.pf.icmp6.zero_id

Error Message:
atf-check failed; see the output of the test for details

FAILED:  sys.netpfil.pf.killstate.gateway

Error Message:
atf-check failed; see the output of the test for details

FAILED:  sys.netpfil.pf.killstate.id

Error Message:
atf-check failed; see the output of the test for details

FAILED:  sys.netpfil.pf.killstate.interface

Error Message:
atf-check failed; see the output of the test for details

FAILED:  sys.netpfil.pf.killstate.key

Error Message:
atf-check failed; see the output of the test for details

FAILED:  sys.netpfil.pf.killstate.label

Error Message:
atf-check failed; see the output of the test for details

FAILED:  sys.netpfil.pf.killstate.multilabel

Error Message:
atf-check failed; see the output of the test for details

FAILED:  sys.netpfil.pf.killstate.nat

Error Message:
atf-check failed; see the output of the test for details

FAILED:  sys.netpfil.pf.killstate.src_dst

Error Message:
atf-check failed; see the output of the test for details

FAILED:  sys.netpfil.pf.killstate.v4

Error Message:
atf-check failed; see the output of the test for details

FAILED:  sys.netpfil.pf.killstate.v6

Error Message:
atf-check failed; see the output of the test for details

FAILED:  sys.netpfil.pf.match.allow_opts

Error Message:
atf-check failed; see the output of the test for details

FAILED:  sys.netpfil.pf.max_states.max_states

Error Message:
atf-check failed; see the output of the test for details

FAILED:  sys.netpfil.pf.modulate.modulate_v4

Error Message:
atf-check failed; see the output of the test for details

FAILED:  sys.netpfil.pf.modulate.modulate_v6

Error Message:
atf-check failed; see the output of the test for details

FAILED:  sys.netpfil.pf.nat.binat_compat

Error Message:
atf-check failed; see the output of the test for details

FAILED:  sys.netpfil.pf.nat.binat_match

Error Message:
atf-check failed; see the output of the test for details

FAILED:  sys.netpfil.pf.nat.empty_pool

Error Message:
atf-check failed; see the output of the test for details

FAILED:  sys.netpfil.pf.nat.nat_match

Error Message:
atf-check failed; see the output of the test for details

FAILED:  sys.netpfil.pf.nat.nat_pass_in

Error Message:
atf-check failed; see the output of the test for details

FAILED:  sys.netpfil.pf.nat.nat_pass_out

Error Message:
atf-check failed; see the output of the test for details

FAILED:  sys.netpfil.pf.pass_block.urpf

Error Message:
atf-check failed; see the output of the test for details

FAILED:  sys.netpfil.pf.pflow.nat

Error Message:
atf-check failed; see the output of the test for details

FAILED:  sys.netpfil.pf.pflow.rule

Error Message:
atf-check failed; see the output of the test for details

FAILED:  sys.netpfil.pf.pflow.state_defaults

Error Message:
atf-check failed; see the output of the test for details

FAILED:  sys.netpfil.pf.pflow.v6

Error Message:
atf-check failed; see the output of the test for details

FAILED:  sys.netpfil.pf.pfsync.af_to_in_floating

Error Message:
atf-check failed; see the output of the test for details

FAILED:  sys.netpfil.pf.pfsync.af_to_in_if_bound

Error Message:
atf-check failed; see the output of the test for details

FAILED:  sys.netpfil.pf.pfsync.af_to_out_if_bound

Error Message:
atf-check failed; see the output of the test for details

FAILED:  sys.netpfil.pf.pfsync.defer

Error Message:
atf-check failed; see the output of the test for details

FAILED:  sys.netpfil.pf.pfsync.route_to_1301

Error Message:
atf-check failed; see the output of the test for details

... and 52 other failed tests.