FreeBSD-main-amd64-gcc14_build - Build #4655 - Failure
- Go to: [ bottom of page ] [ top of archives ] [ this month ]
Date: Thu, 10 Sep 2026 13:02:59 UTC
FreeBSD-main-amd64-gcc14_build - Build #4655 (fc33bbb024502d2c90289ff4b62a8ec4d20df238) - Failure
Build information: https://ci.FreeBSD.org/job/FreeBSD-main-amd64-gcc14_build/4655/
Full change log: https://ci.FreeBSD.org/job/FreeBSD-main-amd64-gcc14_build/4655/changes
Full build log: https://ci.FreeBSD.org/job/FreeBSD-main-amd64-gcc14_build/4655/console
Status explanation:
"Failure" - the build is suspected being broken by the following changes
"Still Failing" - the build has not been fixed by the following changes and
this is a notification to note that these changes have
not been fully tested by the CI system
Change summaries:
(Those commits are likely but not certainly responsible)
fc33bbb024502d2c90289ff4b62a8ec4d20df238 by markj:
nd6: Fix the array size in union nd_opts
The end of the build log:
[...truncated 94.76 MiB...]
/usr/local/bin/x86_64-unknown-freebsd15.0-gcc14 --sysroot=/tmp/obj/workspace/src/amd64.amd64/tmp -B/usr/local/x86_64-unknown-freebsd15.0/bin/ -O2 -pipe -fno-common -I/workspace/src/lib/libnetbsd -I/workspace/src/contrib/netbsd-tests -fPIE -g -std=gnu17 -Wno-format-zero-length -fstack-protector-strong -Wsystem-headers -Werror -Wall -Wno-format-y2k -W -Wno-unused-parameter -Wmissing-prototypes -Wpointer-arith -Wreturn-type -Wcast-qual -Wwrite-strings -Wswitch -Wshadow -Wunused-parameter -Wcast-align -Wno-uninitialized -Wno-pointer-sign -Wdate-time -Wno-error=address -Wno-error=array-bounds -Wno-error=attributes -Wno-error=bool-compare -Wno-error=cast-align -Wno-error=clobbered -Wno-error=deprecated-declarations -Wno-error=enum-compare -Wno-error=extra -Wno-error=logical-not-parentheses -Wno-error=strict-aliasing -Wno-error=uninitialized -Wno-error=unused-function -Wno-error=unused-value -Wno-error=empty-body -Wno-error=maybe-uninitialized -Wno-error=nonnull-compare -Wno-error=shift-negative-value -Wno-error=tautological-compare -Wno-error=unused-const-variable -Wno-error=bool-operation -Wno-error=deprecated -Wno-error=expansion-to-defined -Wno-error=format-overflow -Wno-error=format-truncation -Wno-error=implicit-fallthrough -Wno-error=int-in-bool-context -Wno-error=memset-elt-size -Wno-error=noexcept-type -Wno-error=nonnull -Wno-error=pointer-compare -Wno-error=stringop-overflow -Wno-error=aggressive-loop-optimizations -Wno-error=cast-function-type -Wno-error=catch-value -Wno-error=multistatement-macros -Wno-error=restrict -Wno-error=sizeof-pointer-memaccess -Wno-error=stringop-truncation -Wno-return-type -L/tmp/obj/workspace/src/amd64.amd64/lib/libnetbsd -Wl,-zrelro -pie -Wl,-znoexecstack -o threadjmp_test.full t_threadjmp.pieo -lprivateatf-c -L/tmp/obj/workspace/src/amd64.amd64/lib/libnetbsd -lnetbsd_pie
--- all_subdir_lib/libc/tests/secure ---
--- fortify_select_test.debug ---
/usr/local/x86_64-unknown-freebsd15.0/bin/objcopy --only-keep-debug fortify_select_test.full fortify_select_test.debug
--- fortify_select_test ---
/usr/local/x86_64-unknown-freebsd15.0/bin/objcopy --strip-debug --add-gnu-debuglink=fortify_select_test.debug fortify_select_test.full fortify_select_test
--- fortify_socket_test ---
(cd /workspace/src/lib/libc/tests/secure && DEPENDFILE=.depend.fortify_socket_test NO_SUBDIR=1 make -f /workspace/src/lib/libc/tests/secure/Makefile _RECURSING_PROGS=t PROG=fortify_socket_test )
--- all_subdir_lib/libc/tests/setjmp ---
--- threadjmp_test.debug ---
/usr/local/x86_64-unknown-freebsd15.0/bin/objcopy --only-keep-debug threadjmp_test.full threadjmp_test.debug
--- all_subdir_tests ---
--- functional ---
--- all_subdir_lib ---
--- threadjmp_test ---
--- all_subdir_tests ---
echo '#! /usr/libexec/atf-sh' > functional.tmp
cat /workspace/src/tests/sys/capsicum/functional.sh >>functional.tmp
--- all_subdir_lib ---
/usr/local/x86_64-unknown-freebsd15.0/bin/objcopy --strip-debug --add-gnu-debuglink=threadjmp_test.debug threadjmp_test.full threadjmp_test
--- all_subdir_tests ---
chmod +x functional.tmp
mv functional.tmp functional
--- all_subdir_lib ---
--- Kyuafile ---
--- all_subdir_tests ---
--- Kyuafile ---
--- mini-me ---
--- all_subdir_tests/sys/audit ---
--- all_subdir_tests/sys/capsicum ---
--- mini-me.noexec ---
--- all_subdir_tests/sys/audit ---
--- file-close.full ---
--- all_subdir_tests/sys/capsicum ---
--- mini-me ---
(cd /workspace/src/tests/sys/capsicum && DEPENDFILE=.depend.mini-me NO_SUBDIR=1 make -f /workspace/src/tests/sys/capsicum/Makefile _RECURSING_PROGS=t PROG=mini-me )
--- mini-me.noexec ---
(cd /workspace/src/tests/sys/capsicum && DEPENDFILE=.depend.mini-me.noexec NO_SUBDIR=1 make -f /workspace/src/tests/sys/capsicum/Makefile _RECURSING_PROGS=t PROG=mini-me.noexec )
--- all_subdir_tests/sys/audit ---
/usr/local/bin/x86_64-unknown-freebsd15.0-gcc14 --sysroot=/tmp/obj/workspace/src/amd64.amd64/tmp -B/usr/local/x86_64-unknown-freebsd15.0/bin/ -O2 -pipe -fno-common -I/workspace/src/contrib/openbsm -g -std=gnu17 -Wno-format-zero-length -fstack-protector-strong -Wsystem-headers -Werror -Wall -Wno-format-y2k -W -Wno-unused-parameter -Wmissing-prototypes -Wpointer-arith -Wreturn-type -Wcast-qual -Wwrite-strings -Wswitch -Wshadow -Wunused-parameter -Wcast-align -Wchar-subscripts -Wnested-externs -Wold-style-definition -Wno-pointer-sign -Wdate-time -Wno-error=address -Wno-error=array-bounds -Wno-error=attributes -Wno-error=bool-compare -Wno-error=cast-align -Wno-error=clobbered -Wno-error=deprecated-declarations -Wno-error=enum-compare -Wno-error=extra -Wno-error=logical-not-parentheses -Wno-error=strict-aliasing -Wno-error=uninitialized -Wno-error=unused-function -Wno-error=unused-value -Wno-error=empty-body -Wno-error=maybe-uninitialized -Wno-error=nonnull-compare -Wno-error=shift-negative-value -Wno-error=tautological-compare -Wno-error=unused-const-variable -Wno-error=bool-operation -Wno-error=deprecated -Wno-error=expansion-to-defined -Wno-error=format-overflow -Wno-error=format-truncation -Wno-error=implicit-fallthrough -Wno-error=int-in-bool-context -Wno-error=memset-elt-size -Wno-error=noexcept-type -Wno-error=nonnull -Wno-error=pointer-compare -Wno-error=stringop-overflow -Wno-error=aggressive-loop-optimizations -Wno-error=cast-function-type -Wno-error=catch-value -Wno-error=multistatement-macros -Wno-error=restrict -Wno-error=sizeof-pointer-memaccess -Wno-error=stringop-truncation -Wno-return-type -lbsm -lutil -Wl,-zrelro -Wl,-znoexecstack -o file-close.full file-close.o utils.o /tmp/obj/workspace/src/amd64.amd64/tmp/usr/lib/libprivateauditd.a -lprivateatf-c
--- all_subdir_lib ---
--- all_subdir_lib/libc/tests/secure ---
--- .depend.fortify_socket_test ---
echo fortify_socket_test.full: /tmp/obj/workspace/src/amd64.amd64/tmp/usr/lib/libc.a /tmp/obj/workspace/src/amd64.amd64/tmp/usr/lib/libprivateatf-c.a >> .depend.fortify_socket_test
--- fortify_socket_test.pieo ---
/usr/local/bin/x86_64-unknown-freebsd15.0-gcc14 --sysroot=/tmp/obj/workspace/src/amd64.amd64/tmp -B/usr/local/x86_64-unknown-freebsd15.0/bin/ -fpie -DPIC -O2 -pipe -fno-common -fPIE -g -MD -MF.depend.fortify_socket_test.fortify_socket_test.pieo -MTfortify_socket_test.pieo -std=gnu17 -Wno-format-zero-length -fstack-protector-strong -Wsystem-headers -Werror -Wall -Wno-format-y2k -W -Wno-unused-parameter -Wmissing-prototypes -Wpointer-arith -Wreturn-type -Wcast-qual -Wwrite-strings -Wswitch -Wshadow -Wunused-parameter -Wcast-align -Wchar-subscripts -Wnested-externs -Wold-style-definition -Wno-pointer-sign -Wdate-time -Wno-error=address -Wno-error=array-bounds -Wno-error=attributes -Wno-error=bool-compare -Wno-error=cast-align -Wno-error=clobbered -Wno-error=deprecated-declarations -Wno-error=enum-compare -Wno-error=extra -Wno-error=logical-not-parentheses -Wno-error=strict-aliasing -Wno-error=uninitialized -Wno-error=unused-function -Wno-error=unused-value -Wno-error=empty-body -Wno-error=maybe-uninitialized -Wno-error=nonnull-compare -Wno-error=shift-negative-value -Wno-error=tautological-compare -Wno-error=unused-const-variable -Wno-error=bool-operation -Wno-error=deprecated -Wno-error=expansion-to-defined -Wno-error=format-overflow -Wno-error=format-truncation -Wno-error=implicit-fallthrough -Wno-error=int-in-bool-context -Wno-error=memset-elt-size -Wno-error=noexcept-type -Wno-error=nonnull -Wno-error=pointer-compare -Wno-error=stringop-overflow -Wno-error=aggressive-loop-optimizations -Wno-error=cast-function-type -Wno-error=catch-value -Wno-error=multistatement-macros -Wno-error=restrict -Wno-error=sizeof-pointer-memaccess -Wno-error=stringop-truncation -Wno-return-type -c /workspace/src/lib/libc/tests/secure/fortify_socket_test.c -o fortify_socket_test.pieo
--- all_subdir_tests ---
--- all_subdir_tests/sys/capsicum ---
--- .depend.mini-me.noexec ---
echo mini-me.noexec.full: /tmp/obj/workspace/src/amd64.amd64/tmp/usr/lib/libc.a >> .depend.mini-me.noexec
--- mini-me.o ---
/usr/local/bin/x86_64-unknown-freebsd15.0-gcc14 --sysroot=/tmp/obj/workspace/src/amd64.amd64/tmp -B/usr/local/x86_64-unknown-freebsd15.0/bin/ -O2 -pipe -fno-common -I/workspace/src/tests -g -MD -MF.depend.mini-me.noexec.mini-me.o -MTmini-me.o -std=gnu17 -Wno-format-zero-length -fstack-protector-strong -Wsystem-headers -Werror -Wall -Wno-format-y2k -W -Wno-unused-parameter -Wmissing-prototypes -Wpointer-arith -Wreturn-type -Wcast-qual -Wwrite-strings -Wswitch -Wshadow -Wunused-parameter -Wcast-align -Wchar-subscripts -Wnested-externs -Wold-style-definition -Wno-pointer-sign -Wdate-time -Wno-error=address -Wno-error=array-bounds -Wno-error=attributes -Wno-error=bool-compare -Wno-error=cast-align -Wno-error=clobbered -Wno-error=deprecated-declarations -Wno-error=enum-compare -Wno-error=extra -Wno-error=logical-not-parentheses -Wno-error=strict-aliasing -Wno-error=uninitialized -Wno-error=unused-function -Wno-error=unused-value -Wno-error=empty-body -Wno-error=maybe-uninitialized -Wno-error=nonnull-compare -Wno-error=shift-negative-value -Wno-error=tautological-compare -Wno-error=unused-const-variable -Wno-error=bool-operation -Wno-error=deprecated -Wno-error=expansion-to-defined -Wno-error=format-overflow -Wno-error=format-truncation -Wno-error=implicit-fallthrough -Wno-error=int-in-bool-context -Wno-error=memset-elt-size -Wno-error=noexcept-type -Wno-error=nonnull -Wno-error=pointer-compare -Wno-error=stringop-overflow -Wno-error=aggressive-loop-optimizations -Wno-error=cast-function-type -Wno-error=catch-value -Wno-error=multistatement-macros -Wno-error=restrict -Wno-error=sizeof-pointer-memaccess -Wno-error=stringop-truncation -Wno-return-type -c /workspace/src/tests/sys/capsicum/mini-me.c -o mini-me.o
--- mini-me ---
--- .depend.mini-me ---
echo mini-me.full: /tmp/obj/workspace/src/amd64.amd64/tmp/usr/lib/libc.a >> .depend.mini-me
--- mini-me.full ---
/usr/local/bin/x86_64-unknown-freebsd15.0-gcc14 --sysroot=/tmp/obj/workspace/src/amd64.amd64/tmp -B/usr/local/x86_64-unknown-freebsd15.0/bin/ -O2 -pipe -fno-common -I/workspace/src/tests -g -std=gnu17 -Wno-format-zero-length -fstack-protector-strong -Wsystem-headers -Werror -Wall -Wno-format-y2k -W -Wno-unused-parameter -Wmissing-prototypes -Wpointer-arith -Wreturn-type -Wcast-qual -Wwrite-strings -Wswitch -Wshadow -Wunused-parameter -Wcast-align -Wchar-subscripts -Wnested-externs -Wold-style-definition -Wno-pointer-sign -Wdate-time -Wno-error=address -Wno-error=array-bounds -Wno-error=attributes -Wno-error=bool-compare -Wno-error=cast-align -Wno-error=clobbered -Wno-error=deprecated-declarations -Wno-error=enum-compare -Wno-error=extra -Wno-error=logical-not-parentheses -Wno-error=strict-aliasing -Wno-error=uninitialized -Wno-error=unused-function -Wno-error=unused-value -Wno-error=empty-body -Wno-error=maybe-uninitialized -Wno-error=nonnull-compare -Wno-error=shift-negative-value -Wno-error=tautological-compare -Wno-error=unused-const-variable -Wno-error=bool-operation -Wno-error=deprecated -Wno-error=expansion-to-defined -Wno-error=format-overflow -Wno-error=format-truncation -Wno-error=implicit-fallthrough -Wno-error=int-in-bool-context -Wno-error=memset-elt-size -Wno-error=noexcept-type -Wno-error=nonnull -Wno-error=pointer-compare -Wno-error=stringop-overflow -Wno-error=aggressive-loop-optimizations -Wno-error=cast-function-type -Wno-error=catch-value -Wno-error=multistatement-macros -Wno-error=restrict -Wno-error=sizeof-pointer-memaccess -Wno-error=stringop-truncation -Wno-return-type -Wl,-zrelro -static -Wl,-znoexecstack -o mini-me.full mini-me.o
--- all_subdir_tests/sys/audit ---
--- file-close.debug ---
/usr/local/x86_64-unknown-freebsd15.0/bin/objcopy --only-keep-debug file-close.full file-close.debug
--- file-close ---
/usr/local/x86_64-unknown-freebsd15.0/bin/objcopy --strip-debug --add-gnu-debuglink=file-close.debug file-close.full file-close
--- file-write ---
(cd /workspace/src/tests/sys/audit && DEPENDFILE=.depend.file-write NO_SUBDIR=1 make -f /workspace/src/tests/sys/audit/Makefile _RECURSING_PROGS=t PROG=file-write )
--- all_subdir_tests/sys/capsicum ---
--- mini-me.noexec ---
--- all_subdir_tests/sys/audit ---
--- .depend.file-write ---
--- all_subdir_tests/sys/capsicum ---
--- mini-me.noexec.full ---
--- all_subdir_tests/sys/audit ---
echo file-write.full: /tmp/obj/workspace/src/amd64.amd64/tmp/usr/lib/libc.a /tmp/obj/workspace/src/amd64.amd64/tmp/usr/lib/libprivateatf-c.a >> .depend.file-write
--- all_subdir_tests/sys/capsicum ---
/usr/local/bin/x86_64-unknown-freebsd15.0-gcc14 --sysroot=/tmp/obj/workspace/src/amd64.amd64/tmp -B/usr/local/x86_64-unknown-freebsd15.0/bin/ -O2 -pipe -fno-common -I/workspace/src/tests -g -std=gnu17 -Wno-format-zero-length -fstack-protector-strong -Wsystem-headers -Werror -Wall -Wno-format-y2k -W -Wno-unused-parameter -Wmissing-prototypes -Wpointer-arith -Wreturn-type -Wcast-qual -Wwrite-strings -Wswitch -Wshadow -Wunused-parameter -Wcast-align -Wchar-subscripts -Wnested-externs -Wold-style-definition -Wno-pointer-sign -Wdate-time -Wno-error=address -Wno-error=array-bounds -Wno-error=attributes -Wno-error=bool-compare -Wno-error=cast-align -Wno-error=clobbered -Wno-error=deprecated-declarations -Wno-error=enum-compare -Wno-error=extra -Wno-error=logical-not-parentheses -Wno-error=strict-aliasing -Wno-error=uninitialized -Wno-error=unused-function -Wno-error=unused-value -Wno-error=empty-body -Wno-error=maybe-uninitialized -Wno-error=nonnull-compare -Wno-error=shift-negative-value -Wno-error=tautological-compare -Wno-error=unused-const-variable -Wno-error=bool-operation -Wno-error=deprecated -Wno-error=expansion-to-defined -Wno-error=format-overflow -Wno-error=format-truncation -Wno-error=implicit-fallthrough -Wno-error=int-in-bool-context -Wno-error=memset-elt-size -Wno-error=noexcept-type -Wno-error=nonnull -Wno-error=pointer-compare -Wno-error=stringop-overflow -Wno-error=aggressive-loop-optimizations -Wno-error=cast-function-type -Wno-error=catch-value -Wno-error=multistatement-macros -Wno-error=restrict -Wno-error=sizeof-pointer-memaccess -Wno-error=stringop-truncation -Wno-return-type -Wl,-zrelro -static -Wl,-znoexecstack -o mini-me.noexec.full mini-me.o
--- all_subdir_tests/sys/audit ---
--- file-write.o ---
--- all_subdir_rescue ---
--- all_subdir_tests ---
/usr/local/bin/x86_64-unknown-freebsd15.0-gcc14 --sysroot=/tmp/obj/workspace/src/amd64.amd64/tmp -B/usr/local/x86_64-unknown-freebsd15.0/bin/ -O2 -pipe -fno-common -I/workspace/src/contrib/openbsm -g -MD -MF.depend.file-write.file-write.o -MTfile-write.o -std=gnu17 -Wno-format-zero-length -fstack-protector-strong -Wsystem-headers -Werror -Wall -Wno-format-y2k -W -Wno-unused-parameter -Wmissing-prototypes -Wpointer-arith -Wreturn-type -Wcast-qual -Wwrite-strings -Wswitch -Wshadow -Wunused-parameter -Wcast-align -Wchar-subscripts -Wnested-externs -Wold-style-definition -Wno-pointer-sign -Wdate-time -Wno-error=address -Wno-error=array-bounds -Wno-error=attributes -Wno-error=bool-compare -Wno-error=cast-align -Wno-error=clobbered -Wno-error=deprecated-declarations -Wno-error=enum-compare -Wno-error=extra -Wno-error=logical-not-parentheses -Wno-error=strict-aliasing -Wno-error=uninitialized -Wno-error=unused-function -Wno-error=unused-value -Wno-error=empty-body -Wno-error=maybe-uninitialized -Wno-error=nonnull-compare -Wno-error=shift-negative-value -Wno-error=tautological-compare -Wno-error=unused-const-variable -Wno-error=bool-operation -Wno-error=deprecated -Wno-error=expansion-to-defined -Wno-error=format-overflow -Wno-error=format-truncation -Wno-error=implicit-fallthrough -Wno-error=int-in-bool-context -Wno-error=memset-elt-size -Wno-error=noexcept-type -Wno-error=nonnull -Wno-error=pointer-compare -Wno-error=stringop-overflow -Wno-error=aggressive-loop-optimizations -Wno-error=cast-function-type -Wno-error=catch-value -Wno-error=multistatement-macros -Wno-error=restrict -Wno-error=sizeof-pointer-memaccess -Wno-error=stringop-truncation -Wno-return-type -c /workspace/src/tests/sys/audit/file-write.c -o file-write.o
--- all_subdir_rescue ---
--- zfsbootcfg_make ---
(cd /workspace/src/rescue/rescue/../../sbin/zfsbootcfg && make MK_PIE=no NO_SHARED=yes -DRESCUE CRUNCH_CFLAGS=-DRESCUE CRUNCH_CFLAGS+=-I/tmp/obj/workspace/src/amd64.amd64/lib/libifconfig CRUNCH_CFLAGS+=-I/tmp/obj/workspace/src/amd64.amd64/lib/libiscsiutil MK_AUTO_OBJ=yes DIRPRFX=rescue/rescue/zfsbootcfg/ depend && make MK_PIE=no NO_SHARED=yes -DRESCUE CRUNCH_CFLAGS=-DRESCUE CRUNCH_CFLAGS+=-I/tmp/obj/workspace/src/amd64.amd64/lib/libifconfig CRUNCH_CFLAGS+=-I/tmp/obj/workspace/src/amd64.amd64/lib/libiscsiutil MK_AUTO_OBJ=yes DIRPRFX=rescue/rescue/zfsbootcfg/ zfsbootcfg.o)
--- .depend ---
echo zfsbootcfg.full: /tmp/obj/workspace/src/amd64.amd64/tmp/usr/lib/libc.a /tmp/obj/workspace/src/amd64.amd64/rescue/rescue/workspace/src/cddl/lib/libzfsbootenv/libzfsbootenv.a /tmp/obj/workspace/src/amd64.amd64/rescue/rescue/workspace/src/cddl/lib/libzfs/libzfs.a /tmp/obj/workspace/src/amd64.amd64/tmp/usr/lib/libmd.a /tmp/obj/workspace/src/amd64.amd64/tmp/usr/lib/libpthread.a /tmp/obj/workspace/src/amd64.amd64/tmp/usr/lib/libc.a /tmp/obj/workspace/src/amd64.amd64/tmp/usr/lib/libcompiler_rt.a /tmp/obj/workspace/src/amd64.amd64/rescue/rescue/workspace/src/lib/libsys/libsys.a /tmp/obj/workspace/src/amd64.amd64/tmp/usr/lib/libcompiler_rt.a /tmp/obj/workspace/src/amd64.amd64/rescue/rescue/workspace/src/lib/libsys/libsys.a /tmp/obj/workspace/src/amd64.amd64/tmp/usr/lib/libcompiler_rt.a /tmp/obj/workspace/src/amd64.amd64/tmp/usr/lib/librt.a /tmp/obj/workspace/src/amd64.amd64/tmp/usr/lib/libpthread.a /tmp/obj/workspace/src/amd64.amd64/tmp/usr/lib/libc.a /tmp/obj/workspace/src/amd64.amd64/tmp/usr/lib/libcompiler_rt.a /tmp/obj/workspace/src/amd64.amd64/rescue/rescue/workspace/src/lib/libsys/libsys.a /tmp/obj/workspace/src/amd64.amd64/tmp/usr/lib/libcompiler_rt.a /tmp/obj/workspace/src/amd64.amd64/rescue/rescue/workspace/src/lib/libsys/libsys.a /tmp/obj/workspace/src/amd64.amd64/tmp/usr/lib/libcompiler_rt.a /tmp/obj/workspace/src/amd64.amd64/tmp/usr/lib/libumem.a /tmp/obj/workspace/src/amd64.amd64/tmp/usr/lib/libutil.a /tmp/obj/workspace/src/amd64.amd64/tmp/usr/lib/libm.a /tmp/obj/workspace/src/amd64.amd64/tmp/usr/lib/libavl.a /tmp/obj/workspace/src/amd64.amd64/tmp/usr/lib/libspl.a /tmp/obj/workspace/src/amd64.amd64/tmp/usr/lib/libbsdxml.a /tmp/obj/workspace/src/amd64.amd64/tmp/usr/lib/libcrypto.a /tmp/obj/workspace/src/amd64.amd64/tmp/usr/lib/libpthread.a /tmp/obj/workspace/src/amd64.amd64/tmp/usr/lib/libc.a /tmp/obj/workspace/src/amd64.amd64/tmp/usr/lib/libcompiler_rt.a /tmp/obj/workspace/src/amd64.amd64/rescue/rescue/workspace/src/lib/libsys/libsys.a /tmp/obj/workspace/src/amd64.amd64/tmp/usr/lib/libcompiler_rt.a /tmp/obj/workspace/src/amd64.amd64/rescue/rescue/workspace/src/lib/libsys/libsys.a /tmp/obj/workspace/src/amd64.amd64/tmp/usr/lib/libcompiler_rt.a /tmp/obj/workspace/src/amd64.amd64/tmp/usr/lib/libgeom.a /tmp/obj/workspace/src/amd64.amd64/tmp/usr/lib/libbsdxml.a /tmp/obj/workspace/src/amd64.amd64/tmp/usr/lib/libsbuf.a /tmp/obj/workspace/src/amd64.amd64/rescue/rescue/workspace/src/cddl/lib/libnvpair/libnvpair.a /tmp/obj/workspace/src/amd64.amd64/tmp/usr/lib/libspl.a /tmp/obj/workspace/src/amd64.amd64/tmp/usr/lib/libz.a /tmp/obj/workspace/src/amd64.amd64/rescue/rescue/workspace/src/cddl/lib/libzfs_core/libzfs_core.a /tmp/obj/workspace/src/amd64.amd64/rescue/rescue/workspace/src/cddl/lib/libnvpair/libnvpair.a /tmp/obj/workspace/src/amd64.amd64/tmp/usr/lib/libspl.a /tmp/obj/workspace/src/amd64.amd64/tmp/usr/lib/libspl.a /tmp/obj/workspace/src/amd64.amd64/rescue/rescue/workspace/src/cddl/lib/libzutil/libzutil.a /tmp/obj/workspace/src/amd64.amd64/tmp/usr/lib/libavl.a /tmp/obj/workspace/src/amd64.amd64/tmp/usr/lib/libspl.a /tmp/obj/workspace/src/amd64.amd64/tmp/usr/lib/libgeom.a /tmp/obj/workspace/src/amd64.amd64/tmp/usr/lib/libbsdxml.a /tmp/obj/workspace/src/amd64.amd64/tmp/usr/lib/libsbuf.a /tmp/obj/workspace/src/amd64.amd64/tmp/usr/lib/libm.a /tmp/obj/workspace/src/amd64.amd64/rescue/rescue/workspace/src/cddl/lib/libzutil/libzutil.a /tmp/obj/workspace/src/amd64.amd64/tmp/usr/lib/libavl.a /tmp/obj/workspace/src/amd64.amd64/tmp/usr/lib/libspl.a /tmp/obj/workspace/src/amd64.amd64/tmp/usr/lib/libgeom.a /tmp/obj/workspace/src/amd64.amd64/tmp/usr/lib/libbsdxml.a /tmp/obj/workspace/src/amd64.amd64/tmp/usr/lib/libsbuf.a /tmp/obj/workspace/src/amd64.amd64/tmp/usr/lib/libm.a /tmp/obj/workspace/src/amd64.amd64/rescue/rescue/workspace/src/cddl/lib/libnvpair/libnvpair.a /tmp/obj/workspace/src/amd64.amd64/tmp/usr/lib/libspl.a >> .depend
--- all_subdir_lib ---
/workspace/src/lib/libc/tests/secure/fortify_socket_test.c:52:1: warning: 'new_symlink' defined but not used [-Wunused-function]
52 | new_symlink(size_t __len)
| ^~~~~~~~~~~
/workspace/src/lib/libc/tests/secure/fortify_socket_test.c:31:1: warning: 'new_fp' defined but not used [-Wunused-function]
31 | new_fp(size_t __len)
| ^~~~~~
--- all_subdir_rescue ---
--- zfsbootcfg.o ---
/usr/local/bin/x86_64-unknown-freebsd15.0-gcc14 --sysroot=/tmp/obj/workspace/src/amd64.amd64/tmp -B/usr/local/x86_64-unknown-freebsd15.0/bin/ -O2 -pipe -fno-common -DRESCUE -I/tmp/obj/workspace/src/amd64.amd64/lib/libifconfig -I/tmp/obj/workspace/src/amd64.amd64/lib/libiscsiutil -g -MD -MF.depend.zfsbootcfg.o -MTzfsbootcfg.o -std=gnu17 -Wno-format-zero-length -fstack-protector-strong -Wsystem-headers -Werror -Wall -Wno-format-y2k -W -Wno-unused-parameter -Wmissing-prototypes -Wpointer-arith -Wreturn-type -Wcast-qual -Wwrite-strings -Wswitch -Wshadow -Wunused-parameter -Wcast-align -Wchar-subscripts -Wnested-externs -Wold-style-definition -Wno-pointer-sign -Wdate-time -Wno-error=address -Wno-error=array-bounds -Wno-error=attributes -Wno-error=bool-compare -Wno-error=cast-align -Wno-error=clobbered -Wno-error=deprecated-declarations -Wno-error=enum-compare -Wno-error=extra -Wno-error=logical-not-parentheses -Wno-error=strict-aliasing -Wno-error=uninitialized -Wno-error=unused-function -Wno-error=unused-value -Wno-error=empty-body -Wno-error=maybe-uninitialized -Wno-error=nonnull-compare -Wno-error=shift-negative-value -Wno-error=tautological-compare -Wno-error=unused-const-variable -Wno-error=bool-operation -Wno-error=deprecated -Wno-error=expansion-to-defined -Wno-error=format-overflow -Wno-error=format-truncation -Wno-error=implicit-fallthrough -Wno-error=int-in-bool-context -Wno-error=memset-elt-size -Wno-error=noexcept-type -Wno-error=nonnull -Wno-error=pointer-compare -Wno-error=stringop-overflow -Wno-error=aggressive-loop-optimizations -Wno-error=cast-function-type -Wno-error=catch-value -Wno-error=multistatement-macros -Wno-error=restrict -Wno-error=sizeof-pointer-memaccess -Wno-error=stringop-truncation -Wno-return-type -c /workspace/src/sbin/zfsbootcfg/zfsbootcfg.c -o zfsbootcfg.o
--- all_subdir_tests ---
--- all_subdir_tests/sys/capsicum ---
--- mini-me ---
/usr/local/bin/x86_64-unknown-freebsd15.0-ld: /tmp/obj/workspace/src/amd64.amd64/tmp/usr/lib/crt1.o: in function `_start':
/workspace/src/lib/csu/amd64/crt1_s.S:66:(.text+0x17): undefined reference to `main'
--- all_subdir_tests/sys/audit ---
--- file-write.full ---
/usr/local/bin/x86_64-unknown-freebsd15.0-gcc14 --sysroot=/tmp/obj/workspace/src/amd64.amd64/tmp -B/usr/local/x86_64-unknown-freebsd15.0/bin/ -O2 -pipe -fno-common -I/workspace/src/contrib/openbsm -g -std=gnu17 -Wno-format-zero-length -fstack-protector-strong -Wsystem-headers -Werror -Wall -Wno-format-y2k -W -Wno-unused-parameter -Wmissing-prototypes -Wpointer-arith -Wreturn-type -Wcast-qual -Wwrite-strings -Wswitch -Wshadow -Wunused-parameter -Wcast-align -Wchar-subscripts -Wnested-externs -Wold-style-definition -Wno-pointer-sign -Wdate-time -Wno-error=address -Wno-error=array-bounds -Wno-error=attributes -Wno-error=bool-compare -Wno-error=cast-align -Wno-error=clobbered -Wno-error=deprecated-declarations -Wno-error=enum-compare -Wno-error=extra -Wno-error=logical-not-parentheses -Wno-error=strict-aliasing -Wno-error=uninitialized -Wno-error=unused-function -Wno-error=unused-value -Wno-error=empty-body -Wno-error=maybe-uninitialized -Wno-error=nonnull-compare -Wno-error=shift-negative-value -Wno-error=tautological-compare -Wno-error=unused-const-variable -Wno-error=bool-operation -Wno-error=deprecated -Wno-error=expansion-to-defined -Wno-error=format-overflow -Wno-error=format-truncation -Wno-error=implicit-fallthrough -Wno-error=int-in-bool-context -Wno-error=memset-elt-size -Wno-error=noexcept-type -Wno-error=nonnull -Wno-error=pointer-compare -Wno-error=stringop-overflow -Wno-error=aggressive-loop-optimizations -Wno-error=cast-function-type -Wno-error=catch-value -Wno-error=multistatement-macros -Wno-error=restrict -Wno-error=sizeof-pointer-memaccess -Wno-error=stringop-truncation -Wno-return-type -lbsm -lutil -Wl,-zrelro -Wl,-znoexecstack -o file-write.full file-write.o utils.o /tmp/obj/workspace/src/amd64.amd64/tmp/usr/lib/libprivateauditd.a -lprivateatf-c
--- file-write.debug ---
/usr/local/x86_64-unknown-freebsd15.0/bin/objcopy --only-keep-debug file-write.full file-write.debug
--- file-write ---
/usr/local/x86_64-unknown-freebsd15.0/bin/objcopy --strip-debug --add-gnu-debuglink=file-write.debug file-write.full file-write
--- file-read ---
(cd /workspace/src/tests/sys/audit && DEPENDFILE=.depend.file-read NO_SUBDIR=1 make -f /workspace/src/tests/sys/audit/Makefile _RECURSING_PROGS=t PROG=file-read )
--- .depend.file-read ---
echo file-read.full: /tmp/obj/workspace/src/amd64.amd64/tmp/usr/lib/libc.a /tmp/obj/workspace/src/amd64.amd64/tmp/usr/lib/libprivateatf-c.a >> .depend.file-read
--- file-read.o ---
/usr/local/bin/x86_64-unknown-freebsd15.0-gcc14 --sysroot=/tmp/obj/workspace/src/amd64.amd64/tmp -B/usr/local/x86_64-unknown-freebsd15.0/bin/ -O2 -pipe -fno-common -I/workspace/src/contrib/openbsm -g -MD -MF.depend.file-read.file-read.o -MTfile-read.o -std=gnu17 -Wno-format-zero-length -fstack-protector-strong -Wsystem-headers -Werror -Wall -Wno-format-y2k -W -Wno-unused-parameter -Wmissing-prototypes -Wpointer-arith -Wreturn-type -Wcast-qual -Wwrite-strings -Wswitch -Wshadow -Wunused-parameter -Wcast-align -Wchar-subscripts -Wnested-externs -Wold-style-definition -Wno-pointer-sign -Wdate-time -Wno-error=address -Wno-error=array-bounds -Wno-error=attributes -Wno-error=bool-compare -Wno-error=cast-align -Wno-error=clobbered -Wno-error=deprecated-declarations -Wno-error=enum-compare -Wno-error=extra -Wno-error=logical-not-parentheses -Wno-error=strict-aliasing -Wno-error=uninitialized -Wno-error=unused-function -Wno-error=unused-value -Wno-error=empty-body -Wno-error=maybe-uninitialized -Wno-error=nonnull-compare -Wno-error=shift-negative-value -Wno-error=tautological-compare -Wno-error=unused-const-variable -Wno-error=bool-operation -Wno-error=deprecated -Wno-error=expansion-to-defined -Wno-error=format-overflow -Wno-error=format-truncation -Wno-error=implicit-fallthrough -Wno-error=int-in-bool-context -Wno-error=memset-elt-size -Wno-error=noexcept-type -Wno-error=nonnull -Wno-error=pointer-compare -Wno-error=stringop-overflow -Wno-error=aggressive-loop-optimizations -Wno-error=cast-function-type -Wno-error=catch-value -Wno-error=multistatement-macros -Wno-error=restrict -Wno-error=sizeof-pointer-memaccess -Wno-error=stringop-truncation -Wno-return-type -c /workspace/src/tests/sys/audit/file-read.c -o file-read.o
--- all_subdir_tests/sys/capsicum ---
collect2: error: ld returned 1 exit status
*** [mini-me.full] Error code 1
make[6]: stopped making "all" in /workspace/src/tests/sys/capsicum
make[6]: 1 error
make[6]: stopped making "all" in /workspace/src/tests/sys/capsicum
make[5]: stopped making "all" in /workspace/src/tests/sys/capsicum
--- all_subdir_rescue ---
make[5]: stopped making "objs" in /tmp/obj/workspace/src/amd64.amd64/rescue/rescue
--- all_subdir_sbin ---
make[3]: stopped making "all" in /workspace/src/sbin
make[2]: stopped making "all" in /workspace/src
--- all_subdir_tests ---
--- mini-me.noexec ---
make[5]: stopped making "all" in /workspace/src/tests/sys/capsicum
make[4]: stopped making "all" in /workspace/src/tests/sys
--- all_subdir_usr.sbin ---
make[4]: stopped making "all" in /workspace/src/usr.sbin/tcpdump
make[3]: stopped making "all" in /workspace/src/usr.sbin
make[2]: stopped making "all" in /workspace/src
--- all_subdir_tests ---
--- all_subdir_tests/sys/audit ---
make[5]: stopped making "all" in /workspace/src/tests/sys/audit
make[4]: stopped making "all" in /workspace/src/tests/sys
make[3]: stopped making "all" in /workspace/src/tests
make[2]: stopped making "all" in /workspace/src
--- all_subdir_usr.bin ---
make[3]: stopped making "all" in /workspace/src/usr.bin
make[2]: stopped making "all" in /workspace/src
--- all_subdir_lib ---
make[6]: stopped making "all" in /workspace/src/lib/libc/tests/secure
make[5]: stopped making "all" in /workspace/src/lib/libc/tests
--- all_subdir_rescue ---
--- pfctl_make ---
/workspace/src/sbin/pfctl/parse.y: In function 'yyparse':
/workspace/src/sbin/pfctl/parse.y:1238:37: warning: 'snprintf' output may be truncated before the last format character [-Wformat-truncation=]
1238 | "%s/%s", pf->anchor->path, $3);
| ^~~~~~~
/workspace/src/sbin/pfctl/parse.y:1237:33: note: 'snprintf' output 2 or more bytes (assuming 1025) into a destination of size 1024
1237 | snprintf(loadanchor->anchorname, MAXPATHLEN,
| ^~~~~~~~~~~~~~~~~~~~~~~~~~~~~~~~~~~~~~~~~~~~
1238 | "%s/%s", pf->anchor->path, $3);
| ~~~~~~~~~~~~~~~~~~~~~~~~~~~~~~~
--- all_subdir_stand ---
make[4]: stopped making "all" in /workspace/src/stand/efi
make[3]: stopped making "all" in /workspace/src/stand
make[2]: stopped making "all" in /workspace/src
--- all_subdir_rescue ---
make[5]: stopped making "objs" in /tmp/obj/workspace/src/amd64.amd64/rescue/rescue
*** [objs] Error code 2
make[4]: stopped making "all" in /workspace/src/rescue/rescue
make[4]: 1 error
make[4]: stopped making "all" in /workspace/src/rescue/rescue
make[3]: stopped making "all" in /workspace/src/rescue
make[2]: stopped making "all" in /workspace/src
--- all_subdir_cddl ---
--- all_subdir_cddl/usr.sbin/zfsd/tests ---
--- zfsd_unittest ---
make[6]: stopped making "all" in /workspace/src/cddl/usr.sbin/zfsd/tests
make[5]: stopped making "all" in /workspace/src/cddl/usr.sbin/zfsd
make[4]: stopped making "all" in /workspace/src/cddl/usr.sbin
make[3]: stopped making "all" in /workspace/src/cddl
make[2]: stopped making "all" in /workspace/src
--- all_subdir_lib ---
--- all_subdir_lib/libc/tests/net ---
--- link_addr_test ---
make[6]: stopped making "all" in /workspace/src/lib/libc/tests/net
make[5]: stopped making "all" in /workspace/src/lib/libc/tests
make[4]: stopped making "all" in /workspace/src/lib/libc
make[3]: stopped making "all" in /workspace/src/lib
make[2]: stopped making "all" in /workspace/src
226.59 real 1600.62 user 127.46 sys
make[1]: stopped making "buildworld" in /workspace/src
make: stopped making "buildworld" in /workspace/src
Build step 'Execute shell' marked build as failure
[PostBuildScript] - [INFO] Executing post build scripts.
[FreeBSD-main-amd64-gcc14_build] $ /bin/sh -xe /tmp/jenkins13420964901413134232.sh
+ sh freebsd-ci/scripts/jail/clean.sh
clean jail FreeBSD-main-amd64-gcc14_build
Checking for post-build
Performing post-build step
Checking if email needs to be generated
Email was triggered for: Failure - Any
Sending email for trigger: Failure - Any
Sending mail from default account using System Admin e-mail address