FreeBSD-stable-14-amd64-test - Build #2143 - Still Unstable

From: <jenkins-admin_at_FreeBSD.org>
Date: Thu, 10 Sep 2026 08:31:36 UTC
FreeBSD-stable-14-amd64-test - Build #2143 (f006f9ee93feb77e8fc4723d6c2e386b3956bb51) - Still Unstable

Build information: https://ci.FreeBSD.org/job/FreeBSD-stable-14-amd64-test/2143/
Full change log: https://ci.FreeBSD.org/job/FreeBSD-stable-14-amd64-test/2143/changes
Full build log: https://ci.FreeBSD.org/job/FreeBSD-stable-14-amd64-test/2143/console

Status explanation:
"Unstable" - some tests are suspected being broken by the following changes
"Still Unstable" - the failing test cases have not been fixed by these
                   following changes and this is a notification to note that
                   these changes have not been fully tested by the CI system

Change summaries:
(Those commits are likely but not certainly responsible)

197e0e35161c2c8516158d75ff3022518e74c494 by kbowling:
acpi_pci: Do not match SR-IOV VFs to ACPI devices

bf94f298c998bc366e6c29fbbd0dd37d53a056e0 by kbowling:
acpi_pci: Inherit PF locality for SR-IOV VFs

2bab696fbb85b858729da5a0ca9ec9a80d0d5886 by kbowling:
acpi_pci: Preserve CPU locality queries for descendants

44f0c9d2f89f1712de294c39c6e48bd6d6f388f0 by kbowling:
acpi_pci: Cache PCI proximity domains

f006f9ee93feb77e8fc4723d6c2e386b3956bb51 by kbowling:
acpi_pci: Honor device proximity for DMA tags



The failed test cases:

100 tests failed.
FAILED:  sys.fs.fusefs.ctl.remove_lun_with_atime

Error Message:
atf-check failed; see the output of the test for details

FAILED:  sys.kern.timerfd.timerfd__periodic_timer_performance

Error Message:
Test case body timed out

FAILED:  sys.netpfil.pf.pfsync.bulk

Error Message:
state not found on synced host

FAILED:  sbin.ping.ping_test.inject_opts

Error Message:
atf-check failed; see the output of the test for details

FAILED:  sbin.ping.ping_test.inject_pip

Error Message:
atf-check failed; see the output of the test for details

FAILED:  sbin.ping.ping_test.inject_reply

Error Message:
atf-check failed; see the output of the test for details

FAILED:  sys.net.if_bridge_test.span

Error Message:
atf-check failed; see the output of the test for details

FAILED:  sys.net.if_bridge_test.stp_validation

Error Message:
atf-check failed; see the output of the test for details

FAILED:  sys.netinet.divert.ipdivert_ip_input_local_success

Error Message:
atf-check failed; see the output of the test for details

FAILED:  sys.netinet.divert.ipdivert_ip_output_remote_success

Error Message:
atf-check failed; see the output of the test for details

FAILED:  sys.netinet.forward.fwd_ip_icmp_gw_fast_success

Error Message:
atf-check failed; see the output of the test for details

FAILED:  sys.netinet.forward.fwd_ip_icmp_gw_slow_success

Error Message:
atf-check failed; see the output of the test for details

FAILED:  sys.netinet.forward.fwd_ip_icmp_iface_fast_success

Error Message:
atf-check failed; see the output of the test for details

FAILED:  sys.netinet.forward.fwd_ip_icmp_iface_slow_success

Error Message:
atf-check failed; see the output of the test for details

FAILED:  sys.netinet.redirect.valid_redirect

Error Message:
atf-check failed; see the output of the test for details

FAILED:  sys.netinet6.divert.ipdivert_ip6_output_remote_success

Error Message:
atf-check failed; see the output of the test for details

FAILED:  sys.netinet6.exthdr.exthdr

Error Message:
atf-check failed; see the output of the test for details

FAILED:  sys.netinet6.forward6.fwd_ip6_gu_icmp_gw_gu_fast_success

Error Message:
atf-check failed; see the output of the test for details

FAILED:  sys.netinet6.forward6.fwd_ip6_gu_icmp_gw_gu_slow_success

Error Message:
atf-check failed; see the output of the test for details

FAILED:  sys.netinet6.forward6.fwd_ip6_gu_icmp_gw_ll_fast_success

Error Message:
atf-check failed; see the output of the test for details

FAILED:  sys.netinet6.forward6.fwd_ip6_gu_icmp_gw_ll_slow_success

Error Message:
atf-check failed; see the output of the test for details

FAILED:  sys.netinet6.forward6.fwd_ip6_gu_icmp_iface_fast_success

Error Message:
atf-check failed; see the output of the test for details

FAILED:  sys.netinet6.forward6.fwd_ip6_gu_icmp_iface_slow_success

Error Message:
atf-check failed; see the output of the test for details

FAILED:  sys.netinet6.frag6.frag6_02.frag6_02

Error Message:
atf-check failed; see the output of the test for details

FAILED:  sys.netinet6.frag6.frag6_03.frag6_03

Error Message:
atf-check failed; see the output of the test for details

FAILED:  sys.netinet6.frag6.frag6_04.frag6_04

Error Message:
atf-check failed; see the output of the test for details

FAILED:  sys.netinet6.frag6.frag6_05.frag6_05_0

Error Message:
atf-check failed; see the output of the test for details

FAILED:  sys.netinet6.frag6.frag6_05.frag6_05_1

Error Message:
atf-check failed; see the output of the test for details

FAILED:  sys.netinet6.frag6.frag6_06.frag6_06_0

Error Message:
atf-check failed; see the output of the test for details

FAILED:  sys.netinet6.frag6.frag6_07.frag6_07

Error Message:
atf-check failed; see the output of the test for details

FAILED:  sys.netinet6.frag6.frag6_08.frag6_08

Error Message:
atf-check failed; see the output of the test for details

FAILED:  sys.netinet6.frag6.frag6_09.frag6_09

Error Message:
atf-check failed; see the output of the test for details

FAILED:  sys.netinet6.frag6.frag6_10.frag6_10

Error Message:
atf-check failed; see the output of the test for details

FAILED:  sys.netinet6.frag6.frag6_11.frag6_11

Error Message:
atf-check failed; see the output of the test for details

FAILED:  sys.netinet6.frag6.frag6_12.frag6_12

Error Message:
atf-check failed; see the output of the test for details

FAILED:  sys.netinet6.frag6.frag6_13.frag6_13

Error Message:
atf-check failed; see the output of the test for details

FAILED:  sys.netinet6.frag6.frag6_14.frag6_14

Error Message:
atf-check failed; see the output of the test for details

FAILED:  sys.netinet6.frag6.frag6_15.frag6_15

Error Message:
atf-check failed; see the output of the test for details

FAILED:  sys.netinet6.frag6.frag6_16.frag6_16

Error Message:
atf-check failed; see the output of the test for details

FAILED:  sys.netinet6.frag6.frag6_17.frag6_17

Error Message:
atf-check failed; see the output of the test for details

FAILED:  sys.netinet6.frag6.frag6_18.frag6_18

Error Message:
atf-check failed; see the output of the test for details

FAILED:  sys.netinet6.frag6.frag6_19.frag6_19

Error Message:
atf-check failed; see the output of the test for details

FAILED:  sys.netinet6.frag6.frag6_20.frag6_20

Error Message:
atf-check failed; see the output of the test for details

FAILED:  sys.netinet6.mld.mldraw01

Error Message:
atf-check failed; see the output of the test for details

FAILED:  sys.netinet6.scapyi386.scapyi386

Error Message:
atf-check failed; see the output of the test for details

FAILED:  sys.netpfil.common.forward.ipf_v4

Error Message:
atf-check failed; see the output of the test for details

FAILED:  sys.netpfil.common.forward.ipfw_v4

Error Message:
atf-check failed; see the output of the test for details

FAILED:  sys.netpfil.common.forward.pf_v4

Error Message:
atf-check failed; see the output of the test for details

FAILED:  sys.netpfil.common.tos.ipfw_tos

Error Message:
atf-check failed; see the output of the test for details

FAILED:  sys.netpfil.common.tos.pf_tos

Error Message:
atf-check failed; see the output of the test for details

FAILED:  sys.netpfil.pf.dup.dup_to

Error Message:
atf-check failed; see the output of the test for details

FAILED:  sys.netpfil.pf.ether.bridge_to

Error Message:
atf-check failed; see the output of the test for details

FAILED:  sys.netpfil.pf.forward.v4

Error Message:
atf-check failed; see the output of the test for details

FAILED:  sys.netpfil.pf.forward.v6

Error Message:
atf-check failed; see the output of the test for details

FAILED:  sys.netpfil.pf.fragmentation_compat.overindex

Error Message:
atf-check failed; see the output of the test for details

FAILED:  sys.netpfil.pf.fragmentation_compat.overlimit

Error Message:
atf-check failed; see the output of the test for details

FAILED:  sys.netpfil.pf.fragmentation_compat.overreplace

Error Message:
atf-check failed; see the output of the test for details

FAILED:  sys.netpfil.pf.fragmentation_no_reassembly.compat_override_v4

Error Message:
atf-check failed; see the output of the test for details

FAILED:  sys.netpfil.pf.fragmentation_no_reassembly.match_fragment_v4

Error Message:
atf-check failed; see the output of the test for details

FAILED:  sys.netpfil.pf.fragmentation_no_reassembly.match_full_v4

Error Message:
atf-check failed; see the output of the test for details

FAILED:  sys.netpfil.pf.fragmentation_pass.adjhole

Error Message:
atf-check failed; see the output of the test for details

FAILED:  sys.netpfil.pf.fragmentation_pass.no_df

Error Message:
atf-check failed; see the output of the test for details

FAILED:  sys.netpfil.pf.fragmentation_pass.overhole

Error Message:
atf-check failed; see the output of the test for details

FAILED:  sys.netpfil.pf.fragmentation_pass.overindex

Error Message:
atf-check failed; see the output of the test for details

FAILED:  sys.netpfil.pf.fragmentation_pass.overlimit

Error Message:
atf-check failed; see the output of the test for details

FAILED:  sys.netpfil.pf.fragmentation_pass.overreplace

Error Message:
atf-check failed; see the output of the test for details

FAILED:  sys.netpfil.pf.fragmentation_pass.reassemble_slowpath

Error Message:
atf-check failed; see the output of the test for details

FAILED:  sys.netpfil.pf.icmp.cve_2019_5598

Error Message:
atf-check failed; see the output of the test for details

FAILED:  sys.netpfil.pf.icmp6.zero_id

Error Message:
atf-check failed; see the output of the test for details

FAILED:  sys.netpfil.pf.killstate.gateway

Error Message:
atf-check failed; see the output of the test for details

FAILED:  sys.netpfil.pf.killstate.id

Error Message:
atf-check failed; see the output of the test for details

FAILED:  sys.netpfil.pf.killstate.interface

Error Message:
atf-check failed; see the output of the test for details

FAILED:  sys.netpfil.pf.killstate.label

Error Message:
atf-check failed; see the output of the test for details

FAILED:  sys.netpfil.pf.killstate.multilabel

Error Message:
atf-check failed; see the output of the test for details

FAILED:  sys.netpfil.pf.killstate.v4

Error Message:
atf-check failed; see the output of the test for details

FAILED:  sys.netpfil.pf.killstate.v6

Error Message:
atf-check failed; see the output of the test for details

FAILED:  sys.netpfil.pf.modulate.modulate_v4

Error Message:
atf-check failed; see the output of the test for details

FAILED:  sys.netpfil.pf.modulate.modulate_v6

Error Message:
atf-check failed; see the output of the test for details

FAILED:  sys.netpfil.pf.pass_block.urpf

Error Message:
atf-check failed; see the output of the test for details

FAILED:  sys.netpfil.pf.pfsync.defer

Error Message:
atf-check failed; see the output of the test for details

FAILED:  sys.netpfil.pf.pfsync.route_to

Error Message:
atf-check failed; see the output of the test for details

FAILED:  sys.netpfil.pf.route_to.icmp_nat

Error Message:
atf-check failed; see the output of the test for details

FAILED:  sys.netpfil.pf.rtable.forward_v4

Error Message:
atf-check failed; see the output of the test for details

FAILED:  sys.netpfil.pf.rtable.forward_v6

Error Message:
atf-check failed; see the output of the test for details

FAILED:  sys.netpfil.pf.scrub_compat.max_mss_v4

Error Message:
atf-check failed; see the output of the test for details

FAILED:  sys.netpfil.pf.scrub_compat.max_mss_v6

Error Message:
atf-check failed; see the output of the test for details

FAILED:  sys.netpfil.pf.scrub_compat.min_ttl_v4

Error Message:
atf-check failed; see the output of the test for details

FAILED:  sys.netpfil.pf.scrub_compat.min_ttl_v6

Error Message:
atf-check failed; see the output of the test for details

FAILED:  sys.netpfil.pf.scrub_compat.no_scrub_v4

Error Message:
atf-check failed; see the output of the test for details

FAILED:  sys.netpfil.pf.scrub_compat.no_scrub_v6

Error Message:
atf-check failed; see the output of the test for details

FAILED:  sys.netpfil.pf.scrub_compat.set_tos_v4

Error Message:
atf-check failed; see the output of the test for details

FAILED:  sys.netpfil.pf.scrub_compat.set_tos_v6

Error Message:
atf-check failed; see the output of the test for details

FAILED:  sys.netpfil.pf.scrub_pass.max_mss_v4

Error Message:
atf-check failed; see the output of the test for details

FAILED:  sys.netpfil.pf.scrub_pass.max_mss_v6

Error Message:
atf-check failed; see the output of the test for details

FAILED:  sys.netpfil.pf.scrub_pass.min_ttl_v4

Error Message:
atf-check failed; see the output of the test for details

FAILED:  sys.netpfil.pf.scrub_pass.min_ttl_v6

Error Message:
atf-check failed; see the output of the test for details

FAILED:  sys.netpfil.pf.scrub_pass.set_tos_v4

Error Message:
atf-check failed; see the output of the test for details

FAILED:  sys.netpfil.pf.scrub_pass.set_tos_v6

Error Message:
atf-check failed; see the output of the test for details

FAILED:  sys.netpfil.pf.set_tos.v4

Error Message:
atf-check failed; see the output of the test for details

FAILED:  sys.netpfil.pf.tcp.rst

Error Message:
atf-check failed; see the output of the test for details