FreeBSD-stable-14-amd64-test - Build #2141 - Still Unstable
Date: Thu, 10 Sep 2026 04:59:39 UTC
FreeBSD-stable-14-amd64-test - Build #2141 (981bb14f5de86c9f911a51de5e8d0110173aa24c) - Still Unstable
Build information: https://ci.FreeBSD.org/job/FreeBSD-stable-14-amd64-test/2141/
Full change log: https://ci.FreeBSD.org/job/FreeBSD-stable-14-amd64-test/2141/changes
Full build log: https://ci.FreeBSD.org/job/FreeBSD-stable-14-amd64-test/2141/console
Status explanation:
"Unstable" - some tests are suspected being broken by the following changes
"Still Unstable" - the failing test cases have not been fixed by these
following changes and this is a notification to note that
these changes have not been fully tested by the CI system
Change summaries:
(Those commits are likely but not certainly responsible)
9af3236ece36e244bb709839b120d7daf6f99113 by delphij:
MFC: fsck_msdosfs: add tests for lost cluster chain repair accounting
79e284a3d0ca5781a167a270b2a77353f599c569 by delphij:
MFC: fsck_msdosfs: add tests for the 32-bit boot block field decoding
2643ff9626b4af80c4c55056cef333b7b7314952 by delphij:
MFC: fsck_msdosfs: add a test for reconnecting on volumes larger than 4
741eb8ae72c0eb7f51d06229a51291742aab2a7c by delphij:
MFC: fsck_msdosfs: fix memory leaks in checkfilesys()
0011a183ccd16fa315e4cf4c1f9650f81c6c9740 by delphij:
MFC: fsck_msdosfs: fix 32-bit overflow computing the LOST.DIR offset
8a702ccda30da602007db38f1ebf91e92d72fe52 by delphij:
MFC: fsck_msdosfs: fix status accounting for lost cluster chains
981bb14f5de86c9f911a51de5e8d0110173aa24c by delphij:
MFC: fsck_msdosfs: avoid signed integer overflow in readboot()
The failed test cases:
99 tests failed.
FAILED: sys.netpfil.pf.pfsync.bulk
Error Message:
state not found on synced host
FAILED: usr.bin.xinstall.install_test.stdin
Error Message:
atf-check failed; see the output of the test for details
FAILED: sbin.ping.ping_test.inject_opts
Error Message:
atf-check failed; see the output of the test for details
FAILED: sbin.ping.ping_test.inject_pip
Error Message:
atf-check failed; see the output of the test for details
FAILED: sbin.ping.ping_test.inject_reply
Error Message:
atf-check failed; see the output of the test for details
FAILED: sys.net.if_bridge_test.span
Error Message:
atf-check failed; see the output of the test for details
FAILED: sys.net.if_bridge_test.stp_validation
Error Message:
atf-check failed; see the output of the test for details
FAILED: sys.netinet.divert.ipdivert_ip_input_local_success
Error Message:
atf-check failed; see the output of the test for details
FAILED: sys.netinet.divert.ipdivert_ip_output_remote_success
Error Message:
atf-check failed; see the output of the test for details
FAILED: sys.netinet.forward.fwd_ip_icmp_gw_fast_success
Error Message:
atf-check failed; see the output of the test for details
FAILED: sys.netinet.forward.fwd_ip_icmp_gw_slow_success
Error Message:
atf-check failed; see the output of the test for details
FAILED: sys.netinet.forward.fwd_ip_icmp_iface_fast_success
Error Message:
atf-check failed; see the output of the test for details
FAILED: sys.netinet.forward.fwd_ip_icmp_iface_slow_success
Error Message:
atf-check failed; see the output of the test for details
FAILED: sys.netinet.redirect.valid_redirect
Error Message:
atf-check failed; see the output of the test for details
FAILED: sys.netinet6.divert.ipdivert_ip6_output_remote_success
Error Message:
atf-check failed; see the output of the test for details
FAILED: sys.netinet6.exthdr.exthdr
Error Message:
atf-check failed; see the output of the test for details
FAILED: sys.netinet6.forward6.fwd_ip6_gu_icmp_gw_gu_fast_success
Error Message:
atf-check failed; see the output of the test for details
FAILED: sys.netinet6.forward6.fwd_ip6_gu_icmp_gw_gu_slow_success
Error Message:
atf-check failed; see the output of the test for details
FAILED: sys.netinet6.forward6.fwd_ip6_gu_icmp_gw_ll_fast_success
Error Message:
atf-check failed; see the output of the test for details
FAILED: sys.netinet6.forward6.fwd_ip6_gu_icmp_gw_ll_slow_success
Error Message:
atf-check failed; see the output of the test for details
FAILED: sys.netinet6.forward6.fwd_ip6_gu_icmp_iface_fast_success
Error Message:
atf-check failed; see the output of the test for details
FAILED: sys.netinet6.forward6.fwd_ip6_gu_icmp_iface_slow_success
Error Message:
atf-check failed; see the output of the test for details
FAILED: sys.netinet6.frag6.frag6_02.frag6_02
Error Message:
atf-check failed; see the output of the test for details
FAILED: sys.netinet6.frag6.frag6_03.frag6_03
Error Message:
atf-check failed; see the output of the test for details
FAILED: sys.netinet6.frag6.frag6_04.frag6_04
Error Message:
atf-check failed; see the output of the test for details
FAILED: sys.netinet6.frag6.frag6_05.frag6_05_0
Error Message:
atf-check failed; see the output of the test for details
FAILED: sys.netinet6.frag6.frag6_05.frag6_05_1
Error Message:
atf-check failed; see the output of the test for details
FAILED: sys.netinet6.frag6.frag6_06.frag6_06_0
Error Message:
atf-check failed; see the output of the test for details
FAILED: sys.netinet6.frag6.frag6_07.frag6_07
Error Message:
atf-check failed; see the output of the test for details
FAILED: sys.netinet6.frag6.frag6_08.frag6_08
Error Message:
atf-check failed; see the output of the test for details
FAILED: sys.netinet6.frag6.frag6_09.frag6_09
Error Message:
atf-check failed; see the output of the test for details
FAILED: sys.netinet6.frag6.frag6_10.frag6_10
Error Message:
atf-check failed; see the output of the test for details
FAILED: sys.netinet6.frag6.frag6_11.frag6_11
Error Message:
atf-check failed; see the output of the test for details
FAILED: sys.netinet6.frag6.frag6_12.frag6_12
Error Message:
atf-check failed; see the output of the test for details
FAILED: sys.netinet6.frag6.frag6_13.frag6_13
Error Message:
atf-check failed; see the output of the test for details
FAILED: sys.netinet6.frag6.frag6_14.frag6_14
Error Message:
atf-check failed; see the output of the test for details
FAILED: sys.netinet6.frag6.frag6_15.frag6_15
Error Message:
atf-check failed; see the output of the test for details
FAILED: sys.netinet6.frag6.frag6_16.frag6_16
Error Message:
atf-check failed; see the output of the test for details
FAILED: sys.netinet6.frag6.frag6_17.frag6_17
Error Message:
atf-check failed; see the output of the test for details
FAILED: sys.netinet6.frag6.frag6_18.frag6_18
Error Message:
atf-check failed; see the output of the test for details
FAILED: sys.netinet6.frag6.frag6_19.frag6_19
Error Message:
atf-check failed; see the output of the test for details
FAILED: sys.netinet6.frag6.frag6_20.frag6_20
Error Message:
atf-check failed; see the output of the test for details
FAILED: sys.netinet6.mld.mldraw01
Error Message:
atf-check failed; see the output of the test for details
FAILED: sys.netinet6.scapyi386.scapyi386
Error Message:
atf-check failed; see the output of the test for details
FAILED: sys.netpfil.common.forward.ipf_v4
Error Message:
atf-check failed; see the output of the test for details
FAILED: sys.netpfil.common.forward.ipfw_v4
Error Message:
atf-check failed; see the output of the test for details
FAILED: sys.netpfil.common.forward.pf_v4
Error Message:
atf-check failed; see the output of the test for details
FAILED: sys.netpfil.common.tos.ipfw_tos
Error Message:
atf-check failed; see the output of the test for details
FAILED: sys.netpfil.common.tos.pf_tos
Error Message:
atf-check failed; see the output of the test for details
FAILED: sys.netpfil.pf.dup.dup_to
Error Message:
atf-check failed; see the output of the test for details
FAILED: sys.netpfil.pf.ether.bridge_to
Error Message:
atf-check failed; see the output of the test for details
FAILED: sys.netpfil.pf.forward.v4
Error Message:
atf-check failed; see the output of the test for details
FAILED: sys.netpfil.pf.forward.v6
Error Message:
atf-check failed; see the output of the test for details
FAILED: sys.netpfil.pf.fragmentation_compat.overindex
Error Message:
atf-check failed; see the output of the test for details
FAILED: sys.netpfil.pf.fragmentation_compat.overlimit
Error Message:
atf-check failed; see the output of the test for details
FAILED: sys.netpfil.pf.fragmentation_compat.overreplace
Error Message:
atf-check failed; see the output of the test for details
FAILED: sys.netpfil.pf.fragmentation_no_reassembly.compat_override_v4
Error Message:
atf-check failed; see the output of the test for details
FAILED: sys.netpfil.pf.fragmentation_no_reassembly.match_fragment_v4
Error Message:
atf-check failed; see the output of the test for details
FAILED: sys.netpfil.pf.fragmentation_no_reassembly.match_full_v4
Error Message:
atf-check failed; see the output of the test for details
FAILED: sys.netpfil.pf.fragmentation_pass.adjhole
Error Message:
atf-check failed; see the output of the test for details
FAILED: sys.netpfil.pf.fragmentation_pass.no_df
Error Message:
atf-check failed; see the output of the test for details
FAILED: sys.netpfil.pf.fragmentation_pass.overhole
Error Message:
atf-check failed; see the output of the test for details
FAILED: sys.netpfil.pf.fragmentation_pass.overindex
Error Message:
atf-check failed; see the output of the test for details
FAILED: sys.netpfil.pf.fragmentation_pass.overlimit
Error Message:
atf-check failed; see the output of the test for details
FAILED: sys.netpfil.pf.fragmentation_pass.overreplace
Error Message:
atf-check failed; see the output of the test for details
FAILED: sys.netpfil.pf.fragmentation_pass.reassemble_slowpath
Error Message:
atf-check failed; see the output of the test for details
FAILED: sys.netpfil.pf.icmp.cve_2019_5598
Error Message:
atf-check failed; see the output of the test for details
FAILED: sys.netpfil.pf.icmp6.zero_id
Error Message:
atf-check failed; see the output of the test for details
FAILED: sys.netpfil.pf.killstate.gateway
Error Message:
atf-check failed; see the output of the test for details
FAILED: sys.netpfil.pf.killstate.id
Error Message:
atf-check failed; see the output of the test for details
FAILED: sys.netpfil.pf.killstate.interface
Error Message:
atf-check failed; see the output of the test for details
FAILED: sys.netpfil.pf.killstate.label
Error Message:
atf-check failed; see the output of the test for details
FAILED: sys.netpfil.pf.killstate.multilabel
Error Message:
atf-check failed; see the output of the test for details
FAILED: sys.netpfil.pf.killstate.v4
Error Message:
atf-check failed; see the output of the test for details
FAILED: sys.netpfil.pf.killstate.v6
Error Message:
atf-check failed; see the output of the test for details
FAILED: sys.netpfil.pf.modulate.modulate_v4
Error Message:
atf-check failed; see the output of the test for details
FAILED: sys.netpfil.pf.modulate.modulate_v6
Error Message:
atf-check failed; see the output of the test for details
FAILED: sys.netpfil.pf.pass_block.urpf
Error Message:
atf-check failed; see the output of the test for details
FAILED: sys.netpfil.pf.pfsync.defer
Error Message:
atf-check failed; see the output of the test for details
FAILED: sys.netpfil.pf.pfsync.route_to
Error Message:
atf-check failed; see the output of the test for details
FAILED: sys.netpfil.pf.route_to.icmp_nat
Error Message:
atf-check failed; see the output of the test for details
FAILED: sys.netpfil.pf.rtable.forward_v4
Error Message:
atf-check failed; see the output of the test for details
FAILED: sys.netpfil.pf.rtable.forward_v6
Error Message:
atf-check failed; see the output of the test for details
FAILED: sys.netpfil.pf.scrub_compat.max_mss_v4
Error Message:
atf-check failed; see the output of the test for details
FAILED: sys.netpfil.pf.scrub_compat.max_mss_v6
Error Message:
atf-check failed; see the output of the test for details
FAILED: sys.netpfil.pf.scrub_compat.min_ttl_v4
Error Message:
atf-check failed; see the output of the test for details
FAILED: sys.netpfil.pf.scrub_compat.min_ttl_v6
Error Message:
atf-check failed; see the output of the test for details
FAILED: sys.netpfil.pf.scrub_compat.no_scrub_v4
Error Message:
atf-check failed; see the output of the test for details
FAILED: sys.netpfil.pf.scrub_compat.no_scrub_v6
Error Message:
atf-check failed; see the output of the test for details
FAILED: sys.netpfil.pf.scrub_compat.set_tos_v4
Error Message:
atf-check failed; see the output of the test for details
FAILED: sys.netpfil.pf.scrub_compat.set_tos_v6
Error Message:
atf-check failed; see the output of the test for details
FAILED: sys.netpfil.pf.scrub_pass.max_mss_v4
Error Message:
atf-check failed; see the output of the test for details
FAILED: sys.netpfil.pf.scrub_pass.max_mss_v6
Error Message:
atf-check failed; see the output of the test for details
FAILED: sys.netpfil.pf.scrub_pass.min_ttl_v4
Error Message:
atf-check failed; see the output of the test for details
FAILED: sys.netpfil.pf.scrub_pass.min_ttl_v6
Error Message:
atf-check failed; see the output of the test for details
FAILED: sys.netpfil.pf.scrub_pass.set_tos_v4
Error Message:
atf-check failed; see the output of the test for details
FAILED: sys.netpfil.pf.scrub_pass.set_tos_v6
Error Message:
atf-check failed; see the output of the test for details
FAILED: sys.netpfil.pf.set_tos.v4
Error Message:
atf-check failed; see the output of the test for details
FAILED: sys.netpfil.pf.tcp.rst
Error Message:
atf-check failed; see the output of the test for details