FreeBSD-stable-15-amd64-test - Build #1238 - Still Unstable
Date: Thu, 29 Oct 2026 10:24:33 UTC
FreeBSD-stable-15-amd64-test - Build #1238 (0fdb7f3d30e065011fd346f70d067ba54845c55d) - Still Unstable
Build information: https://ci.FreeBSD.org/job/FreeBSD-stable-15-amd64-test/1238/
Full change log: https://ci.FreeBSD.org/job/FreeBSD-stable-15-amd64-test/1238/changes
Full build log: https://ci.FreeBSD.org/job/FreeBSD-stable-15-amd64-test/1238/console
Status explanation:
"Unstable" - some tests are suspected being broken by the following changes
"Still Unstable" - the failing test cases have not been fixed by these
following changes and this is a notification to note that
these changes have not been fully tested by the CI system
Change summaries:
(Those commits are likely but not certainly responsible)
812a6ee0d3cb5b15af60c029a35751e405980341 by kbowling:
iflib: don't update the admin status in if_media_status()
e00102818cddebb7146181a11903a5c7f441ae46 by kbowling:
iflib: Own queue quiescence during power transitions
c489bd72cdbba7c5f719cadffe3aeb301e0da830 by kbowling:
iflib: Reject media changes during suspend
43185e3be403861c446f8b61c3da742f6a5cf97a by kbowling:
ixgbe: Pause firmware recovery polling in low power
1e9d3ab6a3562ddad531200f7cd1b0876e6633a2 by kbowling:
iflibdd(9): Clarify resume during suspend rollback
9c1a2561cbdcb161070d9e7d88ab308e0d3c2cd1 by kbowling:
vmxnet3: Propagate device-enable failure to iflib
107f080085ab51af6873585b65ce2b058593af33 by kbowling:
ixl: Set critical-error state bits independently
2adc1aee828bfe74e83c672c933e12035daf7d3b by kbowling:
ice: Use the mirror interface softc in PF callbacks
b399c62710594db42aaaa21a814d695283b82766 by kbowling:
ixgbe: Leave run-state publication to iflib during FDIR recovery
d3b1d2fbe92654fe32da1a2ba91c1abb15196855 by kbowling:
hn: Refresh VF offloads after bringing it up
f5f6479d5c719834524e94e13dac947ef339c5b4 by kbowling:
hyperv: Stop bus relations handling from falling through to eject
b0179ff3e5eb1fc13007ec13fc33da210a61c377 by kbowling:
hn: Track VF association and wait for datapath switch completion
544102932584a66a52a4dacc166ba8a1c32b936c by kbowling:
hn: Serialize VF link events with datapath handoff
f6d7a063ae11bce38a142965a94bb149381d503f by kbowling:
hn: Invoke the owned VF's transmit queue flush callback
1327d9102a5bdbf124095c5524382a6835f10036 by kbowling:
hyperv: Bound IPv4 address removal when configuring VF failover
88ad5d5f4e300176af520216c7ccdd83235c0ade by kbowling:
hyperv: Configure IPv6 when setting up VF failover
d8ede50f1b076281c67674fd2839e166a9b8c27c by kbowling:
ixv: Add Hyper-V virtual function support
8e74a48332104fde43b3c5f0e34fc8b966d19f8c by kbowling:
ixv: Recover E610 Hyper-V carrier without the PCI link query
cc0a1727539a9000a5223ba81dac3872cba592bc by kbowling:
ixv: Use host granted RSS queues on Hyper-V
0fdb7f3d30e065011fd346f70d067ba54845c55d by kbowling:
iflib: Use private lifecycle state for control work
The failed test cases:
4 tests failed.
FAILED: sys.fs.fusefs.ext2-misc.execute
Error Message:
atf-check failed; see the output of the test for details
FAILED: sys.netpfil.pf.route_to.dummynet
Error Message:
atf-check failed; see the output of the test for details
FAILED: sys.netpfil.pf.pfsync.bulk
Error Message:
state not found on synced host
FAILED: lib.libexecinfo.sigtramp_test.test_backtrace_sigtramp
Error Message:
/usr/src/lib/libexecinfo/tests/sigtramp_test.c:30: n > 1 not met