FreeBSD-main-amd64-test - Build #29829 - Still Unstable
Date: Thu, 29 Oct 2026 04:32:58 UTC
FreeBSD-main-amd64-test - Build #29829 (06f98c554fbe1fa9a678aacbcf1bc25bda0aef91) - Still Unstable
Build information: https://ci.FreeBSD.org/job/FreeBSD-main-amd64-test/29829/
Full change log: https://ci.FreeBSD.org/job/FreeBSD-main-amd64-test/29829/changes
Full build log: https://ci.FreeBSD.org/job/FreeBSD-main-amd64-test/29829/console
Status explanation:
"Unstable" - some tests are suspected being broken by the following changes
"Still Unstable" - the failing test cases have not been fixed by these
following changes and this is a notification to note that
these changes have not been fully tested by the CI system
Change summaries:
(Those commits are likely but not certainly responsible)
ad9ab26ab52a0a88933806c81f34d2670c0f69a9 by pouria:
smb(4): Add SMB Block Process Call command
afeb885b4ae41357a648f547d3835a5e0dcde81e by pouria:
linux: Preserve partial results from recvmmsg()
11080181491144b9cad726bb6e84d87fa05a681e by rcm:
pf: Clear only the part of the packet descriptor that is read first
06f98c554fbe1fa9a678aacbcf1bc25bda0aef91 by rcm:
pf: Store the rounded source node hash size
The failed test cases:
33 tests failed.
FAILED: sys.netpfil.pf.pfsync.bulk
Error Message:
state not found on synced host
FAILED: sys.netpfil.pf.syncookie.basic_v6
Error Message:
Failed to connect to syncookie protected echo daemon
FAILED: lib.libarchive.functional_test.test_archive_read_append_filter
Error Message:
atf-check failed; see the output of the test for details
FAILED: lib.libarchive.functional_test.test_archive_write_add_filter_by_name_grzip
Error Message:
atf-check failed; see the output of the test for details
FAILED: lib.libarchive.functional_test.test_archive_write_add_filter_by_name_lrzip
Error Message:
atf-check failed; see the output of the test for details
FAILED: lib.libarchive.functional_test.test_archive_write_add_filter_by_name_lz4
Error Message:
atf-check failed; see the output of the test for details
FAILED: lib.libarchive.functional_test.test_archive_write_add_filter_by_name_lzop
Error Message:
atf-check failed; see the output of the test for details
FAILED: lib.libarchive.functional_test.test_archive_write_add_filter_grzip
Error Message:
atf-check failed; see the output of the test for details
FAILED: lib.libarchive.functional_test.test_archive_write_add_filter_lrzip
Error Message:
atf-check failed; see the output of the test for details
FAILED: lib.libarchive.functional_test.test_archive_write_add_filter_lz4
Error Message:
atf-check failed; see the output of the test for details
FAILED: lib.libarchive.functional_test.test_archive_write_add_filter_lzop
Error Message:
atf-check failed; see the output of the test for details
FAILED: lib.libarchive.functional_test.test_read_append_filter_program
Error Message:
atf-check failed; see the output of the test for details
FAILED: lib.libarchive.functional_test.test_read_append_filter_wrong_program
Error Message:
atf-check failed; see the output of the test for details
FAILED: lib.libarchive.functional_test.test_read_append_lz4_filter
Error Message:
atf-check failed; see the output of the test for details
FAILED: lib.libarchive.functional_test.test_write_filter_lz4
Error Message:
atf-check failed; see the output of the test for details
FAILED: lib.libarchive.functional_test.test_write_filter_lz4_block_dependence
Error Message:
atf-check failed; see the output of the test for details
FAILED: lib.libarchive.functional_test.test_write_filter_lz4_block_size_4
Error Message:
atf-check failed; see the output of the test for details
FAILED: lib.libarchive.functional_test.test_write_filter_lz4_block_size_5
Error Message:
atf-check failed; see the output of the test for details
FAILED: lib.libarchive.functional_test.test_write_filter_lz4_block_size_6
Error Message:
atf-check failed; see the output of the test for details
FAILED: lib.libarchive.functional_test.test_write_filter_lz4_disable_stream_checksum
Error Message:
atf-check failed; see the output of the test for details
FAILED: lib.libarchive.functional_test.test_write_filter_lz4_empty_archive
Error Message:
atf-check failed; see the output of the test for details
FAILED: lib.libarchive.functional_test.test_write_filter_lz4_enable_block_checksum
Error Message:
atf-check failed; see the output of the test for details
FAILED: usr.bin.bsdcat.functional_test.test_empty_lz4
Error Message:
atf-check failed; see the output of the test for details
FAILED: usr.bin.bsdcat.functional_test.test_expand_lz4
Error Message:
atf-check failed; see the output of the test for details
FAILED: usr.bin.cpio.functional_test.test_extract_cpio_lz4
Error Message:
atf-check failed; see the output of the test for details
FAILED: usr.bin.tar.functional_test.test_extract_tar_lz4
Error Message:
atf-check failed; see the output of the test for details
FAILED: sys.kern.ssl_sendfile.grow
Error Message:
Test case body timed out
FAILED: sys.kern.ssl_sendfile.eagain_vs_eof
Error Message:
/usr/src/tests/sys/kern/ssl_sendfile.c:485: c.sbytes == -1 not met
FAILED: sys.kern.ssl_sendfile.truncate
Error Message:
Test case body timed out
FAILED: sbin.dhclient.functional.py.__test_cases_list__
Error Message:
Test case list wrote to stderr
FAILED: sys.net.if_lagg_test.witness
Error Message:
Lock-order reversals involving if_lagg.c detected
FAILED: sys.netinet.udp_bindings.connect_bound_socket_from_2address_jail
Error Message:
/usr/src/tests/sys/netinet/udp_bindings.c:244: connect(s, (struct sockaddr *)&sin, sizeof(sin)) == 0 not met
FAILED: sys.netlink.netlink_socket.overflow
Error Message:
/usr/src/tests/sys/netlink/netlink_socket.c:146: send(fd, &hdr, sizeof(hdr), 0) == sizeof(hdr) not met