FreeBSD-main-amd64-test - Build #29810 - Still Unstable
Date: Tue, 27 Oct 2026 00:27:45 UTC
FreeBSD-main-amd64-test - Build #29810 (509d65fae512c24fc755d6a8b3b41bb967e6c5e1) - Still Unstable
Build information: https://ci.FreeBSD.org/job/FreeBSD-main-amd64-test/29810/
Full change log: https://ci.FreeBSD.org/job/FreeBSD-main-amd64-test/29810/changes
Full build log: https://ci.FreeBSD.org/job/FreeBSD-main-amd64-test/29810/console
Status explanation:
"Unstable" - some tests are suspected being broken by the following changes
"Still Unstable" - the failing test cases have not been fixed by these
following changes and this is a notification to note that
these changes have not been fully tested by the CI system
Change summaries:
(Those commits are likely but not certainly responsible)
509d65fae512c24fc755d6a8b3b41bb967e6c5e1 by mhorne:
riscv: Map the DTB when it is outside the kernel's 1GB region
The failed test cases:
9 tests failed.
FAILED: sys.netpfil.pf.pfsync.bulk
Error Message:
state not found on synced host
FAILED: sys.netpfil.pf.syncookie.basic_v6
Error Message:
Failed to connect to syncookie protected echo daemon
FAILED: sys.kern.ssl_sendfile.grow
Error Message:
Test case body timed out
FAILED: sys.kern.ssl_sendfile.eagain_vs_eof
Error Message:
/usr/src/tests/sys/kern/ssl_sendfile.c:485: c.sbytes == -1 not met
FAILED: sys.kern.ssl_sendfile.truncate
Error Message:
Test case body timed out
FAILED: sbin.dhclient.functional.py.__test_cases_list__
Error Message:
Test case list wrote to stderr
FAILED: sys.net.if_lagg_test.witness
Error Message:
Lock-order reversals involving if_lagg.c detected
FAILED: sys.netinet.udp_bindings.connect_bound_socket_from_2address_jail
Error Message:
/usr/src/tests/sys/netinet/udp_bindings.c:244: connect(s, (struct sockaddr *)&sin, sizeof(sin)) == 0 not met
FAILED: sys.netlink.netlink_socket.overflow
Error Message:
/usr/src/tests/sys/netlink/netlink_socket.c:146: send(fd, &hdr, sizeof(hdr), 0) == sizeof(hdr) not met