FreeBSD-main-amd64-test - Build #29807 - Still unstable
Date: Mon, 26 Oct 2026 16:06:10 UTC
FreeBSD-main-amd64-test - Build #29807 (13d222bd83ac15fec4b142b2a97cf0cb7ad981f7) - Still unstable
Build information: https://ci.FreeBSD.org/job/FreeBSD-main-amd64-test/29807/
Full change log: https://ci.FreeBSD.org/job/FreeBSD-main-amd64-test/29807/changes
Full build log: https://ci.FreeBSD.org/job/FreeBSD-main-amd64-test/29807/console
Status explanation:
"Unstable" - some tests are suspected being broken by the following changes
"Still Unstable" - the failing test cases have not been fixed by these
following changes and this is a notification to note that
these changes have not been fully tested by the CI system
Change summaries:
(Those commits are likely but not certainly responsible)
3208a17f96ef01872ad77e2ab70d182c6f3e39bb by wosch:
manpages: Fix unusual Xr order
f5b6c8f5c25261033fb9e6d0e9f682e3aa97efb5 by wosch:
manpages: Fix unusual Xr order
2ba2623414a60fb812fd5cfb075178c852b0db8b by wosch:
manpages: Fix unusual Xr order
fb4f233466d3b662f0dd8220b409a681ea6dacc3 by wosch:
manpages: Fix unusual Xr order
029466808f100ba04fa99efebb40b4209cf79e82 by wosch:
manpages: Fix unusual Xr order
13d222bd83ac15fec4b142b2a97cf0cb7ad981f7 by wosch:
manpages: Fix unusual Xr order
The failed test cases:
9 tests failed.
FAILED: sys.netpfil.pf.pfsync.bulk
Error Message:
state not found on synced host
FAILED: sys.netpfil.pf.syncookie.basic_v6
Error Message:
Failed to connect to syncookie protected echo daemon
FAILED: sys.kern.ssl_sendfile.grow
Error Message:
Test case body timed out
FAILED: sys.kern.ssl_sendfile.eagain_vs_eof
Error Message:
/usr/src/tests/sys/kern/ssl_sendfile.c:485: c.sbytes == -1 not met
FAILED: sys.kern.ssl_sendfile.truncate
Error Message:
Test case body timed out
FAILED: sbin.dhclient.functional.py.__test_cases_list__
Error Message:
Test case list wrote to stderr
FAILED: sys.net.if_lagg_test.witness
Error Message:
Lock-order reversals involving if_lagg.c detected
FAILED: sys.netinet.udp_bindings.connect_bound_socket_from_2address_jail
Error Message:
/usr/src/tests/sys/netinet/udp_bindings.c:244: connect(s, (struct sockaddr *)&sin, sizeof(sin)) == 0 not met
FAILED: sys.netlink.netlink_socket.overflow
Error Message:
/usr/src/tests/sys/netlink/netlink_socket.c:146: send(fd, &hdr, sizeof(hdr), 0) == sizeof(hdr) not met